\relax 
\abx@aux@refcontext{nty/global//global/global}
\@writefile{toc}{\contentsline {section}{\numberline {1}Abstract}{4}{}\protected@file@percent }
\@writefile{toc}{\contentsline {section}{\numberline {2}Acknowledgement}{5}{}\protected@file@percent }
\@writefile{toc}{\contentsline {section}{\numberline {3}Introduction}{6}{}\protected@file@percent }
\@writefile{toc}{\contentsline {subsection}{\numberline {3.1}Objective of the project}{6}{}\protected@file@percent }
\@writefile{toc}{\contentsline {section}{\numberline {4}Background}{7}{}\protected@file@percent }
\@writefile{toc}{\contentsline {subsection}{\numberline {4.1}Need for predicting the solubility of compounds}{7}{}\protected@file@percent }
\@writefile{toc}{\contentsline {subsection}{\numberline {4.2}Understanding Delaney's work}{7}{}\protected@file@percent }
\@writefile{toc}{\contentsline {subsection}{\numberline {4.3}Molecular Descriptors used by Delaney}{7}{}\protected@file@percent }
\@writefile{toc}{\contentsline {section}{\numberline {5}Methodology}{9}{}\protected@file@percent }
\@writefile{toc}{\contentsline {subsection}{\numberline {5.1}Data and Tools used}{9}{}\protected@file@percent }
\@writefile{toc}{\contentsline {subsection}{\numberline {5.2}Implementation}{10}{}\protected@file@percent }
\@writefile{toc}{\contentsline {subsection}{\numberline {5.3}Explanation}{10}{}\protected@file@percent }
\@writefile{toc}{\contentsline {section}{\numberline {6}Results}{11}{}\protected@file@percent }
\@writefile{toc}{\contentsline {subsection}{\numberline {6.1}Results of train data}{11}{}\protected@file@percent }
\@writefile{toc}{\contentsline {subsection}{\numberline {6.2}Results of test data}{11}{}\protected@file@percent }
\@writefile{toc}{\contentsline {subsection}{\numberline {6.3}Linear Regression Equation}{11}{}\protected@file@percent }
\@writefile{toc}{\contentsline {section}{\numberline {7}Conclusion}{13}{}\protected@file@percent }
\abx@aux@cite{0}{plaxton2005string}
\abx@aux@segm{0}{0}{plaxton2005string}
\abx@aux@cite{0}{sri2018string}
\abx@aux@segm{0}{0}{sri2018string}
\abx@aux@cite{0}{pandey2014study}
\abx@aux@segm{0}{0}{pandey2014study}
\abx@aux@cite{0}{chillar2008rb}
\abx@aux@segm{0}{0}{chillar2008rb}
\abx@aux@cite{0}{rasool2012string}
\abx@aux@segm{0}{0}{rasool2012string}
\abx@aux@cite{0}{faro2016string}
\abx@aux@segm{0}{0}{faro2016string}
\abx@aux@cite{0}{colussi1990exact}
\abx@aux@segm{0}{0}{colussi1990exact}
\abx@aux@cite{0}{singla2012string}
\abx@aux@segm{0}{0}{singla2012string}
\gdef\minted@oldcachelist{,
  default.pygstyle,
  74BDCA5C10D76C760400193B7124140DF73D778D6577DD371281B40198477396.pygtex,
  0730C5BB838DD2991EA95061CE4A3DFBF73D778D6577DD371281B40198477396.pygtex,
  2909B7EF0DC72DF7B7769444E278B8C7F73D778D6577DD371281B40198477396.pygtex,
  C50DD2D63B9385B82702BCE1A2BFF2B0F73D778D6577DD371281B40198477396.pygtex}
\@writefile{toc}{\contentsline {section}{\numberline {8}Future Work}{14}{}\protected@file@percent }
\abx@aux@read@bbl@mdfivesum{nobblfile}
\abx@aux@read@bblrerun
\gdef \@abspage@last{14}
