This is BibTeX, Version 0.99d (TeX Live 2024/Arch Linux)
Capacity: max_strings=200000, hash_size=200000, hash_prime=170003
The top-level auxiliary file: main.aux
A level-1 auxiliary file: sppulogo.aux
A level-1 auxiliary file: certificates.aux
A level-1 auxiliary file: acknowledgements.aux
A level-1 auxiliary file: abstract.aux
A level-1 auxiliary file: ch01-introduction.aux
A level-1 auxiliary file: lit.aux
A level-1 auxiliary file: ch03-softwarerequirements.aux
A level-1 auxiliary file: ch04-systemdesign.aux
A level-1 auxiliary file: ch05-projectplan.aux
A level-1 auxiliary file: ch06-projectimplementation.aux
A level-1 auxiliary file: ch07-softwaretesting.aux
A level-1 auxiliary file: ch08-results.aux
A level-1 auxiliary file: ch09-conclusion.aux
A level-1 auxiliary file: references.aux
The style file: plain.bst
A level-1 auxiliary file: appendixA.aux
A level-1 auxiliary file: appendixB.aux
A level-1 auxiliary file: appendixC.aux
A level-1 auxiliary file: appendixD.aux
Database file #1: references.bib
You've used 19 entries,
            2118 wiz_defined-function locations,
            624 strings with 8257 characters,
and the built_in function-call counts, 7510 in all, are:
= -- 746
> -- 371
< -- 11
+ -- 148
- -- 126
* -- 487
:= -- 1184
add.period$ -- 61
call.type$ -- 19
change.case$ -- 118
chr.to.int$ -- 0
cite$ -- 19
duplicate$ -- 305
empty$ -- 577
format.name$ -- 126
if$ -- 1634
int.to.chr$ -- 0
int.to.str$ -- 19
missing$ -- 17
newline$ -- 96
num.names$ -- 38
pop$ -- 152
preamble$ -- 1
purify$ -- 99
quote$ -- 0
skip$ -- 239
stack$ -- 0
substring$ -- 421
swap$ -- 108
text.length$ -- 11
text.prefix$ -- 0
top$ -- 0
type$ -- 76
warning$ -- 0
while$ -- 72
width$ -- 21
write$ -- 208
