sa\osama_alharbi\sas\db\db_Class$Update.class
sa\osama_alharbi\sas\model\Model$Section$Delete.class
sa\osama_alharbi\sas\controller\Section_Students$Filter.class
sa\osama_alharbi\sas\controller\Classes_Attendance$Data.class
sa\osama_alharbi\sas\db\DB.class
sa\osama_alharbi\sas\model\ClassesModel.class
sa\osama_alharbi\sas\db\db_Students_Section$Insert.class
sa\osama_alharbi\sas\controller\Classes_Attendance$Filter.class
sa\osama_alharbi\sas\model\Model$Server.class
sa\osama_alharbi\sas\inc\action\Lisner$Students.class
sa\osama_alharbi\sas\db\db_Students$Delete.class
sa\osama_alharbi\sas\controller\Students_Attendance$SectionBoxItemModel.class
sa\osama_alharbi\sas\controller\Root.class
sa\osama_alharbi\sas\controller\Students_Section.class
sa\osama_alharbi\sas\model\Model$Classes$Delete.class
sa\osama_alharbi\sas\controller\Students_Attendance$2.class
sa\osama_alharbi\sas\inc\action\Action.class
sa\osama_alharbi\sas\model\Model$Section.class
sa\osama_alharbi\sas\db\db_Attendance$Var.class
sa\osama_alharbi\sas\inc\action\Classes.class
sa\osama_alharbi\sas\controller\Section_item.class
sa\osama_alharbi\sas\controller\Classes_Students$Data.class
sa\osama_alharbi\sas\inc\action\Lisner.class
sa\osama_alharbi\sas\db\db_Students$Select.class
sa\osama_alharbi\sas\model\Model$StudentsSection$Get.class
sa\osama_alharbi\sas\controller\Students_Attendance$3.class
sa\osama_alharbi\sas\inc\IncGUI.class
sa\osama_alharbi\sas\model\Model$Classes$Get.class
sa\osama_alharbi\sas\db\db_Attendance.class
module-info.class
sa\osama_alharbi\sas\controller\Section_Students$Data.class
sa\osama_alharbi\sas\controller\Section_AddEdit$1.class
sa\osama_alharbi\sas\controller\Section_Students$1.class
sa\osama_alharbi\sas\inc\action\Section$Add.class
sa\osama_alharbi\sas\controller\Students_Section_listItem.class
sa\osama_alharbi\sas\db\db_Section$Insert.class
sa\osama_alharbi\sas\controller\Section_AddEdit.class
sa\osama_alharbi\sas\inc\IncGUI$tools.class
sa\osama_alharbi\sas\db\db_Students$Create.class
sa\osama_alharbi\sas\controller\Classes_Students.class
sa\osama_alharbi\sas\controller\Classes_Attendance$SectionBoxItemModel.class
sa\osama_alharbi\sas\inc\action\Lisner$Section.class
sa\osama_alharbi\sas\controller\Students_Section$ClassBoxItemModel.class
sa\osama_alharbi\sas\controller\Section$Data.class
sa\osama_alharbi\sas\db\db_Students_Section$Var.class
sa\osama_alharbi\sas\model\Model.class
sa\osama_alharbi\sas\controller\Section_AddEdit$2.class
sa\osama_alharbi\sas\model\StudentsSectionModel.class
sa\osama_alharbi\sas\controller\Section_Students.class
sa\osama_alharbi\sas\model\SectionModel.class
sa\osama_alharbi\sas\controller\Section_Attendance$3.class
sa\osama_alharbi\sas\controller\Students_Classes$Data.class
sa\osama_alharbi\sas\db\db_Students$Update.class
sa\osama_alharbi\sas\controller\HotBar.class
sa\osama_alharbi\sas\db\db_Setting$Insert.class
sa\osama_alharbi\sas\db\db_Section$Delete.class
sa\osama_alharbi\sas\inc\action\Classes$Delete.class
sa\osama_alharbi\sas\model\Model$StudentsSection$1.class
sa\osama_alharbi\sas\inc\action\Section$Edit.class
sa\osama_alharbi\sas\controller\Classes_Students$1.class
sa\osama_alharbi\sas\controller\Students_AddEdit.class
sa\osama_alharbi\sas\inc\action\StudentsSection$Edit.class
sa\osama_alharbi\sas\inc\action\Students$Delete.class
sa\osama_alharbi\sas\controller\Classes_Students$Filter.class
sa\osama_alharbi\sas\inc\action\StudentsSection.class
sa\osama_alharbi\sas\model\Model$Classes.class
sa\osama_alharbi\sas\view\Index.class
sa\osama_alharbi\sas\model\Model$Students$Add.class
sa\osama_alharbi\sas\controller\Classes_Attendance$2.class
sa\osama_alharbi\sas\inc\action\LogInOut$Tools.class
sa\osama_alharbi\sas\controller\Students_Attendance.class
sa\osama_alharbi\sas\controller\Classes_Students$SectionBoxItemModel.class
sa\osama_alharbi\sas\model\Model$Section$1.class
sa\osama_alharbi\sas\controller\Students_Attendance$ClassBoxItemModel.class
sa\osama_alharbi\sas\inc\action\Students$Edit.class
sa\osama_alharbi\sas\model\Model$StudentsSection$Edit.class
sa\osama_alharbi\sas\controller\Section_Attendance.class
sa\osama_alharbi\sas\db\db_Attendance$Delete.class
sa\osama_alharbi\sas\inc\action\Section$Delete.class
sa\osama_alharbi\sas\controller\Section.class
sa\osama_alharbi\sas\controller\Classes$Data.class
sa\osama_alharbi\sas\model\Model$Server$Get.class
sa\osama_alharbi\sas\controller\Classes_item.class
sa\osama_alharbi\sas\model\Model$Section$Add.class
sa\osama_alharbi\sas\db\DBTable.class
sa\osama_alharbi\sas\controller\Section_Attendance$2.class
sa\osama_alharbi\sas\model\SettingModel.class
sa\osama_alharbi\sas\db\db_Attendance$Update.class
sa\osama_alharbi\sas\controller\Students_Classes_listItem.class
sa\osama_alharbi\sas\inc\action\StudentsSection$Add.class
sa\osama_alharbi\sas\controller\Classes_Attendance$1.class
sa\osama_alharbi\sas\controller\Server.class
sa\osama_alharbi\sas\controller\Section_Attendance$1.class
sa\osama_alharbi\sas\controller\Classes_Section$Data.class
sa\osama_alharbi\sas\model\Model$Classes$1.class
sa\osama_alharbi\sas\inc\action\Classes$Edit.class
sa\osama_alharbi\sas\inc\IncGUI$guiShow.class
sa\osama_alharbi\sas\controller\Section$1.class
sa\osama_alharbi\sas\db\db_Students_Section$Update.class
sa\osama_alharbi\sas\db\db_Setting$Create.class
sa\osama_alharbi\sas\db\db_Attendance$Create.class
sa\osama_alharbi\sas\inc\IncGUI$1.class
sa\osama_alharbi\sas\controller\Section_Attendance$TimeBoxItemModel.class
sa\osama_alharbi\sas\inc\action\LogInOut.class
sa\osama_alharbi\sas\controller\Section_AddEdit$Data.class
sa\osama_alharbi\sas\db\db_Class$Insert.class
sa\osama_alharbi\sas\controller\Students_Attendance$5.class
sa\osama_alharbi\sas\inc\action\Students.class
sa\osama_alharbi\sas\model\Model$Students.class
sa\osama_alharbi\sas\db\db_Setting$Select.class
sa\osama_alharbi\sas\db\db_Attendance$Select.class
sa\osama_alharbi\sas\db\db_Setting.class
sa\osama_alharbi\sas\controller\Students_Attendance$Filter.class
sa\osama_alharbi\sas\model\Model$Classes$Edit.class
sa\osama_alharbi\sas\controller\Classes_Students$3.class
sa\osama_alharbi\sas\inc\action\StudentsSection$Delete.class
sa\osama_alharbi\sas\controller\Students_item.class
sa\osama_alharbi\sas\controller\Students$Data.class
sa\osama_alharbi\sas\controller\Classes_Attendance.class
sa\osama_alharbi\sas\model\Model$StudentsSection$Add.class
sa\osama_alharbi\sas\controller\Classes_Attendance$TimeBoxItemModel.class
sa\osama_alharbi\sas\db\db_Students_Section$Select.class
sa\osama_alharbi\sas\db\db_Section.class
sa\osama_alharbi\sas\controller\Students_Section$2.class
sa\osama_alharbi\sas\model\Model$Classes$Add.class
sa\osama_alharbi\sas\controller\Classes$1.class
sa\osama_alharbi\sas\controller\Classes.class
sa\osama_alharbi\sas\controller\Classes_Attendance$3.class
sa\osama_alharbi\sas\controller\Section_Attendance$5.class
sa\osama_alharbi\sas\db\db_Class$Delete.class
sa\osama_alharbi\sas\model\Model$Section$Edit.class
sa\osama_alharbi\sas\controller\Students_Section$3.class
sa\osama_alharbi\sas\db\db_Students_Section.class
sa\osama_alharbi\sas\controller\Section_Attendance$4.class
sa\osama_alharbi\sas\controller\Section_Attendance$DateBoxItemModel.class
sa\osama_alharbi\sas\controller\Students_Classes$1.class
sa\osama_alharbi\sas\ws\Server.class
sa\osama_alharbi\sas\db\db_Section$Update.class
sa\osama_alharbi\sas\controller\Classes_Students$2.class
sa\osama_alharbi\sas\inc\action\HotBar.class
sa\osama_alharbi\sas\controller\Classes_Attendance$4.class
sa\osama_alharbi\sas\inc\action\Lisner$StudentsSection.class
sa\osama_alharbi\sas\controller\Students_Attendance$4.class
sa\osama_alharbi\sas\controller\Students_Attendance$Data.class
sa\osama_alharbi\sas\db\db_Class$Var.class
sa\osama_alharbi\sas\db\db_Class.class
sa\osama_alharbi\sas\db\db_Students_Section$Create.class
sa\osama_alharbi\sas\controller\Section_Attendance$Data.class
sa\osama_alharbi\sas\controller\Students_Attendance$1.class
sa\osama_alharbi\sas\db\db_Setting$Var.class
sa\osama_alharbi\sas\controller\Classes_Section$1.class
sa\osama_alharbi\sas\inc\Inc.class
sa\osama_alharbi\sas\model\Model$Students$Delete.class
sa\osama_alharbi\sas\controller\Students_Section$Filter.class
sa\osama_alharbi\sas\controller\Students_Classes.class
sa\osama_alharbi\sas\model\Model$Students$1.class
sa\osama_alharbi\sas\model\Model$Server$Set.class
sa\osama_alharbi\sas\ws\Server$Type.class
sa\osama_alharbi\sas\controller\Classes_Attendance$DateBoxItemModel.class
sa\osama_alharbi\sas\model\StudentsModel.class
sa\osama_alharbi\sas\controller\Classes_Attendance$5.class
sa\osama_alharbi\sas\db\db_Setting$Update.class
sa\osama_alharbi\sas\controller\Classes_AddEdit.class
sa\osama_alharbi\sas\db\db_Section$Var.class
sa\osama_alharbi\sas\controller\Students_Section$1.class
sa\osama_alharbi\sas\main\SimpleAttendanceServer_Main.class
sa\osama_alharbi\sas\controller\Students$1.class
sa\osama_alharbi\sas\model\Model$StudentsSection$Delete.class
sa\osama_alharbi\sas\model\AttendanceModel.class
sa\osama_alharbi\sas\db\db_Class$Select.class
sa\osama_alharbi\sas\model\Model$Section$Get.class
sa\osama_alharbi\sas\db\db_Setting$Delete.class
sa\osama_alharbi\sas\db\DB$SecureDbHostFile.class
sa\osama_alharbi\sas\inc\action\Section.class
sa\osama_alharbi\sas\controller\Classes_Attendance$6.class
sa\osama_alharbi\sas\db\db_Section$Select.class
sa\osama_alharbi\sas\inc\action\Students$Add.class
sa\osama_alharbi\sas\inc\IncGUIController.class
sa\osama_alharbi\sas\model\Model$Students$Edit.class
sa\osama_alharbi\sas\model\Model$StudentsSection.class
sa\osama_alharbi\sas\controller\Classes_Section$Filter.class
sa\osama_alharbi\sas\controller\Login.class
sa\osama_alharbi\sas\db\db_Students_Section$Delete.class
sa\osama_alharbi\sas\controller\Classes_Attendance$7.class
sa\osama_alharbi\sas\inc\action\Classes$Add.class
sa\osama_alharbi\sas\controller\Classes_Section.class
sa\osama_alharbi\sas\db\db_Students$Var.class
sa\osama_alharbi\sas\db\db_Attendance$Insert.class
sa\osama_alharbi\sas\controller\Students.class
sa\osama_alharbi\sas\db\db_Students$Insert.class
sa\osama_alharbi\sas\db\db_Section$Create.class
sa\osama_alharbi\sas\controller\Students_Section$Data.class
sa\osama_alharbi\sas\db\db_Class$Create.class
sa\osama_alharbi\sas\db\db_Students.class
sa\osama_alharbi\sas\inc\action\Lisner$Classes.class
sa\osama_alharbi\sas\model\Model$Students$Get.class
