^D:\GAME DEV\JUEGUITO AUTO QUE DISPARA\CARSHOOTER\SOURCE\ANIMATION.CPP|D:\GAME DEV\JUEGUITO AUTO QUE DISPARA\CARSHOOTER\SOURCE\BULLET.CPP|D:\GAME DEV\JUEGUITO AUTO QUE DISPARA\CARSHOOTER\SOURCE\COLLIDER.CPP|D:\GAME DEV\JUEGUITO AUTO QUE DISPARA\CARSHOOTER\SOURCE\COREGAME.CPP|D:\GAME DEV\JUEGUITO AUTO QUE DISPARA\CARSHOOTER\SOURCE\ENEMYVEHICLE.CPP|D:\GAME DEV\JUEGUITO AUTO QUE DISPARA\CARSHOOTER\SOURCE\EXPLOTION.CPP|D:\GAME DEV\JUEGUITO AUTO QUE DISPARA\CARSHOOTER\SOURCE\GAMESTATE.CPP|D:\GAME DEV\JUEGUITO AUTO QUE DISPARA\CARSHOOTER\SOURCE\GENERALMENU.CPP|D:\GAME DEV\JUEGUITO AUTO QUE DISPARA\CARSHOOTER\SOURCE\HUD.CPP|D:\GAME DEV\JUEGUITO AUTO QUE DISPARA\CARSHOOTER\SOURCE\LEVELONE.CPP|D:\GAME DEV\JUEGUITO AUTO QUE DISPARA\CARSHOOTER\SOURCE\MAIN.CPP|D:\GAME DEV\JUEGUITO AUTO QUE DISPARA\CARSHOOTER\SOURCE\MAINMENU.CPP|D:\GAME DEV\JUEGUITO AUTO QUE DISPARA\CARSHOOTER\SOURCE\OBSTACLE.CPP|D:\GAME DEV\JUEGUITO AUTO QUE DISPARA\CARSHOOTER\SOURCE\PLAYERVEHICLE.CPP|D:\GAME DEV\JUEGUITO AUTO QUE DISPARA\CARSHOOTER\SOURCE\TEXTUREHANDLER.CPP|D:\GAME DEV\JUEGUITO AUTO QUE DISPARA\CARSHOOTER\SOURCE\VEHICLE.CPP|D:\GAME DEV\JUEGUITO AUTO QUE DISPARA\CARSHOOTER\SOURCE\WONSCREEN.CPP
D:\GAME DEV\JUEGUITO AUTO QUE DISPARA\CARSHOOTER\CARSHOOTER\X64\DEBUG\VC142.PDB
D:\GAME DEV\JUEGUITO AUTO QUE DISPARA\CARSHOOTER\CARSHOOTER\X64\DEBUG\VC142.IDB
D:\GAME DEV\JUEGUITO AUTO QUE DISPARA\CARSHOOTER\CARSHOOTER\X64\DEBUG\GAMESTATE.OBJ
^D:\GAME DEV\JUEGUITO AUTO QUE DISPARA\CARSHOOTER\SOURCE\ANIMATION.CPP|D:\GAME DEV\JUEGUITO AUTO QUE DISPARA\CARSHOOTER\SOURCE\BULLET.CPP|D:\GAME DEV\JUEGUITO AUTO QUE DISPARA\CARSHOOTER\SOURCE\COLLIDER.CPP|D:\GAME DEV\JUEGUITO AUTO QUE DISPARA\CARSHOOTER\SOURCE\COREGAME.CPP|D:\GAME DEV\JUEGUITO AUTO QUE DISPARA\CARSHOOTER\SOURCE\ENEMYVEHICLE.CPP|D:\GAME DEV\JUEGUITO AUTO QUE DISPARA\CARSHOOTER\SOURCE\EXPLOTION.CPP|D:\GAME DEV\JUEGUITO AUTO QUE DISPARA\CARSHOOTER\SOURCE\GAMESTATE.CPP|D:\GAME DEV\JUEGUITO AUTO QUE DISPARA\CARSHOOTER\SOURCE\GENERALMENU.CPP|D:\GAME DEV\JUEGUITO AUTO QUE DISPARA\CARSHOOTER\SOURCE\HUD.CPP|D:\GAME DEV\JUEGUITO AUTO QUE DISPARA\CARSHOOTER\SOURCE\LEVELONE.CPP|D:\GAME DEV\JUEGUITO AUTO QUE DISPARA\CARSHOOTER\SOURCE\MAIN.CPP|D:\GAME DEV\JUEGUITO AUTO QUE DISPARA\CARSHOOTER\SOURCE\MAINMENU.CPP|D:\GAME DEV\JUEGUITO AUTO QUE DISPARA\CARSHOOTER\SOURCE\OBSTACLE.CPP|D:\GAME DEV\JUEGUITO AUTO QUE DISPARA\CARSHOOTER\SOURCE\PLAYERVEHICLE.CPP|D:\GAME DEV\JUEGUITO AUTO QUE DISPARA\CARSHOOTER\SOURCE\SOURCE.CPP|D:\GAME DEV\JUEGUITO AUTO QUE DISPARA\CARSHOOTER\SOURCE\TEXTUREHANDLER.CPP|D:\GAME DEV\JUEGUITO AUTO QUE DISPARA\CARSHOOTER\SOURCE\VEHICLE.CPP|D:\GAME DEV\JUEGUITO AUTO QUE DISPARA\CARSHOOTER\SOURCE\WONSCREEN.CPP
D:\GAME DEV\JUEGUITO AUTO QUE DISPARA\CARSHOOTER\CARSHOOTER\X64\DEBUG\VC142.PDB
D:\GAME DEV\JUEGUITO AUTO QUE DISPARA\CARSHOOTER\CARSHOOTER\X64\DEBUG\VC142.IDB
D:\GAME DEV\JUEGUITO AUTO QUE DISPARA\CARSHOOTER\CARSHOOTER\X64\DEBUG\WONSCREEN.OBJ
D:\GAME DEV\JUEGUITO AUTO QUE DISPARA\CARSHOOTER\CARSHOOTER\X64\DEBUG\VEHICLE.OBJ
D:\GAME DEV\JUEGUITO AUTO QUE DISPARA\CARSHOOTER\CARSHOOTER\X64\DEBUG\TEXTUREHANDLER.OBJ
D:\GAME DEV\JUEGUITO AUTO QUE DISPARA\CARSHOOTER\CARSHOOTER\X64\DEBUG\SOURCE.OBJ
D:\GAME DEV\JUEGUITO AUTO QUE DISPARA\CARSHOOTER\CARSHOOTER\X64\DEBUG\PLAYERVEHICLE.OBJ
D:\GAME DEV\JUEGUITO AUTO QUE DISPARA\CARSHOOTER\CARSHOOTER\X64\DEBUG\OBSTACLE.OBJ
D:\GAME DEV\JUEGUITO AUTO QUE DISPARA\CARSHOOTER\CARSHOOTER\X64\DEBUG\MAINMENU.OBJ
D:\GAME DEV\JUEGUITO AUTO QUE DISPARA\CARSHOOTER\CARSHOOTER\X64\DEBUG\MAIN.OBJ
D:\GAME DEV\JUEGUITO AUTO QUE DISPARA\CARSHOOTER\CARSHOOTER\X64\DEBUG\HUD.OBJ
D:\GAME DEV\JUEGUITO AUTO QUE DISPARA\CARSHOOTER\CARSHOOTER\X64\DEBUG\GENERALMENU.OBJ
D:\GAME DEV\JUEGUITO AUTO QUE DISPARA\CARSHOOTER\CARSHOOTER\X64\DEBUG\GAMESTATE.OBJ
D:\GAME DEV\JUEGUITO AUTO QUE DISPARA\CARSHOOTER\CARSHOOTER\X64\DEBUG\EXPLOTION.OBJ
D:\GAME DEV\JUEGUITO AUTO QUE DISPARA\CARSHOOTER\CARSHOOTER\X64\DEBUG\ENEMYVEHICLE.OBJ
D:\GAME DEV\JUEGUITO AUTO QUE DISPARA\CARSHOOTER\CARSHOOTER\X64\DEBUG\COREGAME.OBJ
D:\GAME DEV\JUEGUITO AUTO QUE DISPARA\CARSHOOTER\CARSHOOTER\X64\DEBUG\COLLIDER.OBJ
D:\GAME DEV\JUEGUITO AUTO QUE DISPARA\CARSHOOTER\CARSHOOTER\X64\DEBUG\BULLET.OBJ
D:\GAME DEV\JUEGUITO AUTO QUE DISPARA\CARSHOOTER\CARSHOOTER\X64\DEBUG\ANIMATION.OBJ
^D:\GAME DEV\JUEGUITO AUTO QUE DISPARA\CARSHOOTER\SOURCE\ANIMATION.CPP
D:\GAME DEV\JUEGUITO AUTO QUE DISPARA\CARSHOOTER\CARSHOOTER\X64\DEBUG\ANIMATION.OBJ
^D:\GAME DEV\JUEGUITO AUTO QUE DISPARA\CARSHOOTER\SOURCE\EXPLOTION.CPP
D:\GAME DEV\JUEGUITO AUTO QUE DISPARA\CARSHOOTER\CARSHOOTER\X64\DEBUG\EXPLOTION.OBJ
^D:\GAME DEV\JUEGUITO AUTO QUE DISPARA\CARSHOOTER\SOURCE\GAMESTATE.CPP
D:\GAME DEV\JUEGUITO AUTO QUE DISPARA\CARSHOOTER\CARSHOOTER\X64\DEBUG\GAMESTATE.OBJ
^D:\GAME DEV\JUEGUITO AUTO QUE DISPARA\CARSHOOTER\SOURCE\GENERALMENU.CPP
D:\GAME DEV\JUEGUITO AUTO QUE DISPARA\CARSHOOTER\CARSHOOTER\X64\DEBUG\GENERALMENU.OBJ
^D:\GAME DEV\JUEGUITO AUTO QUE DISPARA\CARSHOOTER\SOURCE\HUD.CPP
D:\GAME DEV\JUEGUITO AUTO QUE DISPARA\CARSHOOTER\CARSHOOTER\X64\DEBUG\HUD.OBJ
^D:\GAME DEV\JUEGUITO AUTO QUE DISPARA\CARSHOOTER\SOURCE\MAINMENU.CPP
D:\GAME DEV\JUEGUITO AUTO QUE DISPARA\CARSHOOTER\CARSHOOTER\X64\DEBUG\MAINMENU.OBJ
^D:\GAME DEV\JUEGUITO AUTO QUE DISPARA\CARSHOOTER\SOURCE\SOURCE.CPP
D:\GAME DEV\JUEGUITO AUTO QUE DISPARA\CARSHOOTER\CARSHOOTER\X64\DEBUG\SOURCE.OBJ
^D:\GAME DEV\JUEGUITO AUTO QUE DISPARA\CARSHOOTER\SOURCE\TEXTUREHANDLER.CPP
D:\GAME DEV\JUEGUITO AUTO QUE DISPARA\CARSHOOTER\CARSHOOTER\X64\DEBUG\TEXTUREHANDLER.OBJ
^D:\GAME DEV\JUEGUITO AUTO QUE DISPARA\CARSHOOTER\SOURCE\LEVELONE.CPP|D:\GAME DEV\JUEGUITO AUTO QUE DISPARA\CARSHOOTER\SOURCE\MAIN.CPP|D:\GAME DEV\JUEGUITO AUTO QUE DISPARA\CARSHOOTER\SOURCE\WONSCREEN.CPP
D:\GAME DEV\JUEGUITO AUTO QUE DISPARA\CARSHOOTER\CARSHOOTER\X64\DEBUG\VC142.PDB
D:\GAME DEV\JUEGUITO AUTO QUE DISPARA\CARSHOOTER\CARSHOOTER\X64\DEBUG\VC142.IDB
D:\GAME DEV\JUEGUITO AUTO QUE DISPARA\CARSHOOTER\CARSHOOTER\X64\DEBUG\WONSCREEN.OBJ
D:\GAME DEV\JUEGUITO AUTO QUE DISPARA\CARSHOOTER\CARSHOOTER\X64\DEBUG\MAIN.OBJ
^D:\GAME DEV\JUEGUITO AUTO QUE DISPARA\CARSHOOTER\SOURCE\BULLET.CPP|D:\GAME DEV\JUEGUITO AUTO QUE DISPARA\CARSHOOTER\SOURCE\COLLIDER.CPP|D:\GAME DEV\JUEGUITO AUTO QUE DISPARA\CARSHOOTER\SOURCE\COREGAME.CPP|D:\GAME DEV\JUEGUITO AUTO QUE DISPARA\CARSHOOTER\SOURCE\ENEMYVEHICLE.CPP|D:\GAME DEV\JUEGUITO AUTO QUE DISPARA\CARSHOOTER\SOURCE\LEVELONE.CPP|D:\GAME DEV\JUEGUITO AUTO QUE DISPARA\CARSHOOTER\SOURCE\MAIN.CPP|D:\GAME DEV\JUEGUITO AUTO QUE DISPARA\CARSHOOTER\SOURCE\OBSTACLE.CPP|D:\GAME DEV\JUEGUITO AUTO QUE DISPARA\CARSHOOTER\SOURCE\PLAYERVEHICLE.CPP|D:\GAME DEV\JUEGUITO AUTO QUE DISPARA\CARSHOOTER\SOURCE\VEHICLE.CPP|D:\GAME DEV\JUEGUITO AUTO QUE DISPARA\CARSHOOTER\SOURCE\WONSCREEN.CPP
D:\GAME DEV\JUEGUITO AUTO QUE DISPARA\CARSHOOTER\CARSHOOTER\X64\DEBUG\VC142.PDB
D:\GAME DEV\JUEGUITO AUTO QUE DISPARA\CARSHOOTER\CARSHOOTER\X64\DEBUG\VC142.IDB
D:\GAME DEV\JUEGUITO AUTO QUE DISPARA\CARSHOOTER\CARSHOOTER\X64\DEBUG\WONSCREEN.OBJ
D:\GAME DEV\JUEGUITO AUTO QUE DISPARA\CARSHOOTER\CARSHOOTER\X64\DEBUG\VEHICLE.OBJ
D:\GAME DEV\JUEGUITO AUTO QUE DISPARA\CARSHOOTER\CARSHOOTER\X64\DEBUG\PLAYERVEHICLE.OBJ
D:\GAME DEV\JUEGUITO AUTO QUE DISPARA\CARSHOOTER\CARSHOOTER\X64\DEBUG\OBSTACLE.OBJ
D:\GAME DEV\JUEGUITO AUTO QUE DISPARA\CARSHOOTER\CARSHOOTER\X64\DEBUG\MAIN.OBJ
D:\GAME DEV\JUEGUITO AUTO QUE DISPARA\CARSHOOTER\CARSHOOTER\X64\DEBUG\LEVELONE.OBJ
D:\GAME DEV\JUEGUITO AUTO QUE DISPARA\CARSHOOTER\CARSHOOTER\X64\DEBUG\ENEMYVEHICLE.OBJ
D:\GAME DEV\JUEGUITO AUTO QUE DISPARA\CARSHOOTER\CARSHOOTER\X64\DEBUG\COREGAME.OBJ
D:\GAME DEV\JUEGUITO AUTO QUE DISPARA\CARSHOOTER\CARSHOOTER\X64\DEBUG\COLLIDER.OBJ
D:\GAME DEV\JUEGUITO AUTO QUE DISPARA\CARSHOOTER\CARSHOOTER\X64\DEBUG\BULLET.OBJ
^D:\GAME DEV\JUEGUITO AUTO QUE DISPARA\CARSHOOTER\SOURCE\WONSCREEN.CPP
D:\GAME DEV\JUEGUITO AUTO QUE DISPARA\CARSHOOTER\CARSHOOTER\X64\DEBUG\VC142.PDB
^D:\GAME DEV\JUEGUITO AUTO QUE DISPARA\CARSHOOTER\SOURCE\BULLET.CPP|D:\GAME DEV\JUEGUITO AUTO QUE DISPARA\CARSHOOTER\SOURCE\COLLIDER.CPP|D:\GAME DEV\JUEGUITO AUTO QUE DISPARA\CARSHOOTER\SOURCE\COREGAME.CPP|D:\GAME DEV\JUEGUITO AUTO QUE DISPARA\CARSHOOTER\SOURCE\ENEMYVEHICLE.CPP|D:\GAME DEV\JUEGUITO AUTO QUE DISPARA\CARSHOOTER\SOURCE\LEVELONE.CPP|D:\GAME DEV\JUEGUITO AUTO QUE DISPARA\CARSHOOTER\SOURCE\MAIN.CPP|D:\GAME DEV\JUEGUITO AUTO QUE DISPARA\CARSHOOTER\SOURCE\OBSTACLE.CPP|D:\GAME DEV\JUEGUITO AUTO QUE DISPARA\CARSHOOTER\SOURCE\PLAYERVEHICLE.CPP|D:\GAME DEV\JUEGUITO AUTO QUE DISPARA\CARSHOOTER\SOURCE\VEHICLE.CPP
D:\GAME DEV\JUEGUITO AUTO QUE DISPARA\CARSHOOTER\CARSHOOTER\X64\DEBUG\VC142.PDB
D:\GAME DEV\JUEGUITO AUTO QUE DISPARA\CARSHOOTER\CARSHOOTER\X64\DEBUG\VC142.IDB
D:\GAME DEV\JUEGUITO AUTO QUE DISPARA\CARSHOOTER\CARSHOOTER\X64\DEBUG\MAIN.OBJ
D:\GAME DEV\JUEGUITO AUTO QUE DISPARA\CARSHOOTER\CARSHOOTER\X64\DEBUG\ENEMYVEHICLE.OBJ
D:\GAME DEV\JUEGUITO AUTO QUE DISPARA\CARSHOOTER\CARSHOOTER\X64\DEBUG\VEHICLE.OBJ
D:\GAME DEV\JUEGUITO AUTO QUE DISPARA\CARSHOOTER\CARSHOOTER\X64\DEBUG\PLAYERVEHICLE.OBJ
D:\GAME DEV\JUEGUITO AUTO QUE DISPARA\CARSHOOTER\CARSHOOTER\X64\DEBUG\OBSTACLE.OBJ
D:\GAME DEV\JUEGUITO AUTO QUE DISPARA\CARSHOOTER\CARSHOOTER\X64\DEBUG\COREGAME.OBJ
D:\GAME DEV\JUEGUITO AUTO QUE DISPARA\CARSHOOTER\CARSHOOTER\X64\DEBUG\BULLET.OBJ
^D:\GAME DEV\JUEGUITO AUTO QUE DISPARA\CARSHOOTER\SOURCE\BULLET.CPP
D:\GAME DEV\JUEGUITO AUTO QUE DISPARA\CARSHOOTER\CARSHOOTER\X64\DEBUG\BULLET.OBJ
^D:\GAME DEV\JUEGUITO AUTO QUE DISPARA\CARSHOOTER\SOURCE\COLLIDER.CPP|D:\GAME DEV\JUEGUITO AUTO QUE DISPARA\CARSHOOTER\SOURCE\COREGAME.CPP|D:\GAME DEV\JUEGUITO AUTO QUE DISPARA\CARSHOOTER\SOURCE\LEVELONE.CPP|D:\GAME DEV\JUEGUITO AUTO QUE DISPARA\CARSHOOTER\SOURCE\MAIN.CPP|D:\GAME DEV\JUEGUITO AUTO QUE DISPARA\CARSHOOTER\SOURCE\OBSTACLE.CPP
D:\GAME DEV\JUEGUITO AUTO QUE DISPARA\CARSHOOTER\CARSHOOTER\X64\DEBUG\VC142.PDB
D:\GAME DEV\JUEGUITO AUTO QUE DISPARA\CARSHOOTER\CARSHOOTER\X64\DEBUG\VC142.IDB
D:\GAME DEV\JUEGUITO AUTO QUE DISPARA\CARSHOOTER\CARSHOOTER\X64\DEBUG\OBSTACLE.OBJ
D:\GAME DEV\JUEGUITO AUTO QUE DISPARA\CARSHOOTER\CARSHOOTER\X64\DEBUG\MAIN.OBJ
D:\GAME DEV\JUEGUITO AUTO QUE DISPARA\CARSHOOTER\CARSHOOTER\X64\DEBUG\COREGAME.OBJ
^D:\GAME DEV\JUEGUITO AUTO QUE DISPARA\CARSHOOTER\SOURCE\COLLIDER.CPP|D:\GAME DEV\JUEGUITO AUTO QUE DISPARA\CARSHOOTER\SOURCE\LEVELONE.CPP|D:\GAME DEV\JUEGUITO AUTO QUE DISPARA\CARSHOOTER\SOURCE\MAIN.CPP|D:\GAME DEV\JUEGUITO AUTO QUE DISPARA\CARSHOOTER\SOURCE\OBSTACLE.CPP
D:\GAME DEV\JUEGUITO AUTO QUE DISPARA\CARSHOOTER\CARSHOOTER\X64\DEBUG\VC142.PDB
D:\GAME DEV\JUEGUITO AUTO QUE DISPARA\CARSHOOTER\CARSHOOTER\X64\DEBUG\VC142.IDB
D:\GAME DEV\JUEGUITO AUTO QUE DISPARA\CARSHOOTER\CARSHOOTER\X64\DEBUG\OBSTACLE.OBJ
D:\GAME DEV\JUEGUITO AUTO QUE DISPARA\CARSHOOTER\CARSHOOTER\X64\DEBUG\MAIN.OBJ
^D:\GAME DEV\JUEGUITO AUTO QUE DISPARA\CARSHOOTER\SOURCE\COLLIDER.CPP|D:\GAME DEV\JUEGUITO AUTO QUE DISPARA\CARSHOOTER\SOURCE\COREGAME.CPP|D:\GAME DEV\JUEGUITO AUTO QUE DISPARA\CARSHOOTER\SOURCE\ENEMYVEHICLE.CPP|D:\GAME DEV\JUEGUITO AUTO QUE DISPARA\CARSHOOTER\SOURCE\LEVELONE.CPP|D:\GAME DEV\JUEGUITO AUTO QUE DISPARA\CARSHOOTER\SOURCE\MAIN.CPP|D:\GAME DEV\JUEGUITO AUTO QUE DISPARA\CARSHOOTER\SOURCE\OBSTACLE.CPP|D:\GAME DEV\JUEGUITO AUTO QUE DISPARA\CARSHOOTER\SOURCE\PLAYERVEHICLE.CPP|D:\GAME DEV\JUEGUITO AUTO QUE DISPARA\CARSHOOTER\SOURCE\VEHICLE.CPP
D:\GAME DEV\JUEGUITO AUTO QUE DISPARA\CARSHOOTER\CARSHOOTER\X64\DEBUG\VC142.PDB
D:\GAME DEV\JUEGUITO AUTO QUE DISPARA\CARSHOOTER\CARSHOOTER\X64\DEBUG\VC142.IDB
D:\GAME DEV\JUEGUITO AUTO QUE DISPARA\CARSHOOTER\CARSHOOTER\X64\DEBUG\VEHICLE.OBJ
D:\GAME DEV\JUEGUITO AUTO QUE DISPARA\CARSHOOTER\CARSHOOTER\X64\DEBUG\PLAYERVEHICLE.OBJ
D:\GAME DEV\JUEGUITO AUTO QUE DISPARA\CARSHOOTER\CARSHOOTER\X64\DEBUG\OBSTACLE.OBJ
D:\GAME DEV\JUEGUITO AUTO QUE DISPARA\CARSHOOTER\CARSHOOTER\X64\DEBUG\MAIN.OBJ
D:\GAME DEV\JUEGUITO AUTO QUE DISPARA\CARSHOOTER\CARSHOOTER\X64\DEBUG\ENEMYVEHICLE.OBJ
D:\GAME DEV\JUEGUITO AUTO QUE DISPARA\CARSHOOTER\CARSHOOTER\X64\DEBUG\COREGAME.OBJ
^D:\GAME DEV\JUEGUITO AUTO QUE DISPARA\CARSHOOTER\SOURCE\OBSTACLE.CPP
D:\GAME DEV\JUEGUITO AUTO QUE DISPARA\CARSHOOTER\CARSHOOTER\X64\DEBUG\OBSTACLE.OBJ
^D:\GAME DEV\JUEGUITO AUTO QUE DISPARA\CARSHOOTER\SOURCE\COLLIDER.CPP|D:\GAME DEV\JUEGUITO AUTO QUE DISPARA\CARSHOOTER\SOURCE\COREGAME.CPP|D:\GAME DEV\JUEGUITO AUTO QUE DISPARA\CARSHOOTER\SOURCE\ENEMYVEHICLE.CPP|D:\GAME DEV\JUEGUITO AUTO QUE DISPARA\CARSHOOTER\SOURCE\LEVELONE.CPP|D:\GAME DEV\JUEGUITO AUTO QUE DISPARA\CARSHOOTER\SOURCE\MAIN.CPP|D:\GAME DEV\JUEGUITO AUTO QUE DISPARA\CARSHOOTER\SOURCE\PLAYERVEHICLE.CPP|D:\GAME DEV\JUEGUITO AUTO QUE DISPARA\CARSHOOTER\SOURCE\VEHICLE.CPP
D:\GAME DEV\JUEGUITO AUTO QUE DISPARA\CARSHOOTER\CARSHOOTER\X64\DEBUG\VC142.PDB
D:\GAME DEV\JUEGUITO AUTO QUE DISPARA\CARSHOOTER\CARSHOOTER\X64\DEBUG\VC142.IDB
D:\GAME DEV\JUEGUITO AUTO QUE DISPARA\CARSHOOTER\CARSHOOTER\X64\DEBUG\VEHICLE.OBJ
D:\GAME DEV\JUEGUITO AUTO QUE DISPARA\CARSHOOTER\CARSHOOTER\X64\DEBUG\PLAYERVEHICLE.OBJ
D:\GAME DEV\JUEGUITO AUTO QUE DISPARA\CARSHOOTER\CARSHOOTER\X64\DEBUG\MAIN.OBJ
D:\GAME DEV\JUEGUITO AUTO QUE DISPARA\CARSHOOTER\CARSHOOTER\X64\DEBUG\ENEMYVEHICLE.OBJ
D:\GAME DEV\JUEGUITO AUTO QUE DISPARA\CARSHOOTER\CARSHOOTER\X64\DEBUG\COREGAME.OBJ
^D:\GAME DEV\JUEGUITO AUTO QUE DISPARA\CARSHOOTER\SOURCE\COREGAME.CPP
D:\GAME DEV\JUEGUITO AUTO QUE DISPARA\CARSHOOTER\CARSHOOTER\X64\DEBUG\COREGAME.OBJ
^D:\GAME DEV\JUEGUITO AUTO QUE DISPARA\CARSHOOTER\SOURCE\ENEMYVEHICLE.CPP
D:\GAME DEV\JUEGUITO AUTO QUE DISPARA\CARSHOOTER\CARSHOOTER\X64\DEBUG\ENEMYVEHICLE.OBJ
^D:\GAME DEV\JUEGUITO AUTO QUE DISPARA\CARSHOOTER\SOURCE\PLAYERVEHICLE.CPP
D:\GAME DEV\JUEGUITO AUTO QUE DISPARA\CARSHOOTER\CARSHOOTER\X64\DEBUG\PLAYERVEHICLE.OBJ
