﻿  Animation.cpp
D:\Game Dev\Jueguito auto que dispara\Animation.cpp(13,40): warning C4244: '=': conversion from 'float' to 'T', possible loss of data
D:\Game Dev\Jueguito auto que dispara\Animation.cpp(13,40): warning C4244:         with
D:\Game Dev\Jueguito auto que dispara\Animation.cpp(13,40): warning C4244:         [
D:\Game Dev\Jueguito auto que dispara\Animation.cpp(13,40): warning C4244:             T=int
D:\Game Dev\Jueguito auto que dispara\Animation.cpp(13,40): warning C4244:         ]
  Bullet.cpp
  Collider.cpp
  CoreGame.cpp
  enemyVehicle.cpp
  Explotion.cpp
  GameState.cpp
  GeneralMenu.cpp
  HUD.cpp
  LevelOne.cpp
D:\Game Dev\Jueguito auto que dispara\Animation.cpp(14,41): warning C4244: '=': conversion from 'float' to 'T', possible loss of data
D:\Game Dev\Jueguito auto que dispara\Animation.cpp(14,41): warning C4244:         with
D:\Game Dev\Jueguito auto que dispara\Animation.cpp(14,41): warning C4244:         [
D:\Game Dev\Jueguito auto que dispara\Animation.cpp(14,41): warning C4244:             T=int
D:\Game Dev\Jueguito auto que dispara\Animation.cpp(14,41): warning C4244:         ]
D:\Game Dev\Jueguito auto que dispara\LevelOne.cpp(79,8): error C2664: 'bool Collider::Collider::ckeckCollision(Collider::Collider &,float)': cannot convert argument 1 from 'Collider::Collider' to 'Collider::Collider &'
D:\Game Dev\Jueguito auto que dispara\LevelOne.cpp(79,73): message : A non-const reference may only be bound to an lvalue
D:\Game Dev\Jueguito auto que dispara\Collider.h(16,8): message : see declaration of 'Collider::Collider::ckeckCollision'
D:\Game Dev\Jueguito auto que dispara\LevelOne.cpp(163,7): error C2664: 'bool Collider::Collider::ckeckCollision(Collider::Collider &,float)': cannot convert argument 1 from 'Collider::Collider' to 'Collider::Collider &'
D:\Game Dev\Jueguito auto que dispara\LevelOne.cpp(163,57): message : A non-const reference may only be bound to an lvalue
D:\Game Dev\Jueguito auto que dispara\Collider.h(16,8): message : see declaration of 'Collider::Collider::ckeckCollision'
D:\Game Dev\Jueguito auto que dispara\LevelOne.cpp(172,64): error C2664: 'bool Collider::Collider::ckeckCollision(Collider::Collider &,float)': cannot convert argument 1 from 'Collider::Collider' to 'Collider::Collider &'
D:\Game Dev\Jueguito auto que dispara\LevelOne.cpp(172,56): message : A non-const reference may only be bound to an lvalue
  main.cpp
  MainMenu.cpp
  Obstacle.cpp
  PlayerVehicle.cpp
  Source.cpp
  TextureHandler.cpp
  Vehicle.cpp
  WonScreen.cpp
  Generating Code...
D:\Game Dev\Jueguito auto que dispara\Collider.h(16,8): message : see declaration of 'Collider::Collider::ckeckCollision'
