^D:\GAME DEV\JUEGUITO AUTO QUE DISPARA\ENEMYVEHICLE.CPP
/c /ZI /JMC /nologo /W3 /WX- /diagnostics:column /sdl /Od /D _MBCS /Gm- /EHsc /RTC1 /MDd /GS /fp:precise /permissive- /Zc:wchar_t /Zc:forScope /Zc:inline /Fo"X64\DEBUG\\" /Fd"X64\DEBUG\VC142.PDB" /Gd /TP /FC D:\GAME DEV\JUEGUITO AUTO QUE DISPARA\ENEMYVEHICLE.CPP
^D:\GAME DEV\JUEGUITO AUTO QUE DISPARA\MAIN.CPP
/c /ZI /JMC /nologo /W3 /WX- /diagnostics:column /sdl /Od /D _MBCS /Gm- /EHsc /RTC1 /MDd /GS /fp:precise /permissive- /Zc:wchar_t /Zc:forScope /Zc:inline /Fo"X64\DEBUG\\" /Fd"X64\DEBUG\VC142.PDB" /Gd /TP /FC D:\GAME DEV\JUEGUITO AUTO QUE DISPARA\MAIN.CPP
^D:\GAME DEV\JUEGUITO AUTO QUE DISPARA\CARSHOOTER\SOURCE\ANIMATION.CPP
/c /I"D:\GAME DEV\JUEGUITO AUTO QUE DISPARA\CARSHOOTER\SFML\INCLUDE" /ZI /JMC /nologo /W3 /WX- /diagnostics:column /sdl /Od /D _MBCS /Gm- /EHsc /RTC1 /MDd /GS /fp:precise /permissive- /Zc:wchar_t /Zc:forScope /Zc:inline /Fo"X64\DEBUG\\" /Fd"X64\DEBUG\VC142.PDB" /Gd /TP /FC D:\GAME DEV\JUEGUITO AUTO QUE DISPARA\CARSHOOTER\SOURCE\ANIMATION.CPP
^D:\GAME DEV\JUEGUITO AUTO QUE DISPARA\CARSHOOTER\SOURCE\EXPLOTION.CPP
/c /I"D:\GAME DEV\JUEGUITO AUTO QUE DISPARA\CARSHOOTER\SFML\INCLUDE" /ZI /JMC /nologo /W3 /WX- /diagnostics:column /sdl /Od /D _MBCS /Gm- /EHsc /RTC1 /MDd /GS /fp:precise /permissive- /Zc:wchar_t /Zc:forScope /Zc:inline /Fo"X64\DEBUG\\" /Fd"X64\DEBUG\VC142.PDB" /Gd /TP /FC D:\GAME DEV\JUEGUITO AUTO QUE DISPARA\CARSHOOTER\SOURCE\EXPLOTION.CPP
^D:\GAME DEV\JUEGUITO AUTO QUE DISPARA\CARSHOOTER\SOURCE\GAMESTATE.CPP
/c /I"D:\GAME DEV\JUEGUITO AUTO QUE DISPARA\CARSHOOTER\SFML\INCLUDE" /ZI /JMC /nologo /W3 /WX- /diagnostics:column /sdl /Od /D _MBCS /Gm- /EHsc /RTC1 /MDd /GS /fp:precise /permissive- /Zc:wchar_t /Zc:forScope /Zc:inline /Fo"X64\DEBUG\\" /Fd"X64\DEBUG\VC142.PDB" /Gd /TP /FC D:\GAME DEV\JUEGUITO AUTO QUE DISPARA\CARSHOOTER\SOURCE\GAMESTATE.CPP
^D:\GAME DEV\JUEGUITO AUTO QUE DISPARA\CARSHOOTER\SOURCE\GENERALMENU.CPP
/c /I"D:\GAME DEV\JUEGUITO AUTO QUE DISPARA\CARSHOOTER\SFML\INCLUDE" /ZI /JMC /nologo /W3 /WX- /diagnostics:column /sdl /Od /D _MBCS /Gm- /EHsc /RTC1 /MDd /GS /fp:precise /permissive- /Zc:wchar_t /Zc:forScope /Zc:inline /Fo"X64\DEBUG\\" /Fd"X64\DEBUG\VC142.PDB" /Gd /TP /FC D:\GAME DEV\JUEGUITO AUTO QUE DISPARA\CARSHOOTER\SOURCE\GENERALMENU.CPP
^D:\GAME DEV\JUEGUITO AUTO QUE DISPARA\CARSHOOTER\SOURCE\HUD.CPP
/c /I"D:\GAME DEV\JUEGUITO AUTO QUE DISPARA\CARSHOOTER\SFML\INCLUDE" /ZI /JMC /nologo /W3 /WX- /diagnostics:column /sdl /Od /D _MBCS /Gm- /EHsc /RTC1 /MDd /GS /fp:precise /permissive- /Zc:wchar_t /Zc:forScope /Zc:inline /Fo"X64\DEBUG\\" /Fd"X64\DEBUG\VC142.PDB" /Gd /TP /FC D:\GAME DEV\JUEGUITO AUTO QUE DISPARA\CARSHOOTER\SOURCE\HUD.CPP
^D:\GAME DEV\JUEGUITO AUTO QUE DISPARA\CARSHOOTER\SOURCE\MAINMENU.CPP
/c /I"D:\GAME DEV\JUEGUITO AUTO QUE DISPARA\CARSHOOTER\SFML\INCLUDE" /ZI /JMC /nologo /W3 /WX- /diagnostics:column /sdl /Od /D _MBCS /Gm- /EHsc /RTC1 /MDd /GS /fp:precise /permissive- /Zc:wchar_t /Zc:forScope /Zc:inline /Fo"X64\DEBUG\\" /Fd"X64\DEBUG\VC142.PDB" /Gd /TP /FC D:\GAME DEV\JUEGUITO AUTO QUE DISPARA\CARSHOOTER\SOURCE\MAINMENU.CPP
^D:\GAME DEV\JUEGUITO AUTO QUE DISPARA\CARSHOOTER\SOURCE\SOURCE.CPP
/c /I"D:\GAME DEV\JUEGUITO AUTO QUE DISPARA\CARSHOOTER\SFML\INCLUDE" /ZI /JMC /nologo /W3 /WX- /diagnostics:column /sdl /Od /D _MBCS /Gm- /EHsc /RTC1 /MDd /GS /fp:precise /permissive- /Zc:wchar_t /Zc:forScope /Zc:inline /Fo"X64\DEBUG\\" /Fd"X64\DEBUG\VC142.PDB" /Gd /TP /FC D:\GAME DEV\JUEGUITO AUTO QUE DISPARA\CARSHOOTER\SOURCE\SOURCE.CPP
^D:\GAME DEV\JUEGUITO AUTO QUE DISPARA\CARSHOOTER\SOURCE\TEXTUREHANDLER.CPP
/c /I"D:\GAME DEV\JUEGUITO AUTO QUE DISPARA\CARSHOOTER\SFML\INCLUDE" /ZI /JMC /nologo /W3 /WX- /diagnostics:column /sdl /Od /D _MBCS /Gm- /EHsc /RTC1 /MDd /GS /fp:precise /permissive- /Zc:wchar_t /Zc:forScope /Zc:inline /Fo"X64\DEBUG\\" /Fd"X64\DEBUG\VC142.PDB" /Gd /TP /FC D:\GAME DEV\JUEGUITO AUTO QUE DISPARA\CARSHOOTER\SOURCE\TEXTUREHANDLER.CPP
^D:\GAME DEV\JUEGUITO AUTO QUE DISPARA\CARSHOOTER\SOURCE\WONSCREEN.CPP
/c /I"D:\GAME DEV\JUEGUITO AUTO QUE DISPARA\CARSHOOTER\SFML\INCLUDE" /ZI /JMC /nologo /W3 /WX- /diagnostics:column /sdl /Od /D _MBCS /Gm- /EHsc /RTC1 /MDd /GS /fp:precise /permissive- /Zc:wchar_t /Zc:forScope /Zc:inline /Fo"X64\DEBUG\\" /Fd"X64\DEBUG\VC142.PDB" /Gd /TP /FC D:\GAME DEV\JUEGUITO AUTO QUE DISPARA\CARSHOOTER\SOURCE\WONSCREEN.CPP
^D:\GAME DEV\JUEGUITO AUTO QUE DISPARA\CARSHOOTER\SOURCE\BULLET.CPP
/c /I"D:\GAME DEV\JUEGUITO AUTO QUE DISPARA\CARSHOOTER\SFML\INCLUDE" /ZI /JMC /nologo /W3 /WX- /diagnostics:column /sdl /Od /D _MBCS /Gm- /EHsc /RTC1 /MDd /GS /fp:precise /permissive- /Zc:wchar_t /Zc:forScope /Zc:inline /Fo"X64\DEBUG\\" /Fd"X64\DEBUG\VC142.PDB" /Gd /TP /FC D:\GAME DEV\JUEGUITO AUTO QUE DISPARA\CARSHOOTER\SOURCE\BULLET.CPP
^D:\GAME DEV\JUEGUITO AUTO QUE DISPARA\CARSHOOTER\SOURCE\OBSTACLE.CPP
/c /I"D:\GAME DEV\JUEGUITO AUTO QUE DISPARA\CARSHOOTER\SFML\INCLUDE" /ZI /JMC /nologo /W3 /WX- /diagnostics:column /sdl /Od /D _MBCS /Gm- /EHsc /RTC1 /MDd /GS /fp:precise /permissive- /Zc:wchar_t /Zc:forScope /Zc:inline /Fo"X64\DEBUG\\" /Fd"X64\DEBUG\VC142.PDB" /Gd /TP /FC D:\GAME DEV\JUEGUITO AUTO QUE DISPARA\CARSHOOTER\SOURCE\OBSTACLE.CPP
^D:\GAME DEV\JUEGUITO AUTO QUE DISPARA\CARSHOOTER\SOURCE\COREGAME.CPP
/c /I"D:\GAME DEV\JUEGUITO AUTO QUE DISPARA\CARSHOOTER\SFML\INCLUDE" /ZI /JMC /nologo /W3 /WX- /diagnostics:column /sdl /Od /D _MBCS /Gm- /EHsc /RTC1 /MDd /GS /fp:precise /permissive- /Zc:wchar_t /Zc:forScope /Zc:inline /Fo"X64\DEBUG\\" /Fd"X64\DEBUG\VC142.PDB" /Gd /TP /FC D:\GAME DEV\JUEGUITO AUTO QUE DISPARA\CARSHOOTER\SOURCE\COREGAME.CPP
^D:\GAME DEV\JUEGUITO AUTO QUE DISPARA\CARSHOOTER\SOURCE\ENEMYVEHICLE.CPP
/c /I"D:\GAME DEV\JUEGUITO AUTO QUE DISPARA\CARSHOOTER\SFML\INCLUDE" /ZI /JMC /nologo /W3 /WX- /diagnostics:column /sdl /Od /D _MBCS /Gm- /EHsc /RTC1 /MDd /GS /fp:precise /permissive- /Zc:wchar_t /Zc:forScope /Zc:inline /Fo"X64\DEBUG\\" /Fd"X64\DEBUG\VC142.PDB" /Gd /TP /FC D:\GAME DEV\JUEGUITO AUTO QUE DISPARA\CARSHOOTER\SOURCE\ENEMYVEHICLE.CPP
^D:\GAME DEV\JUEGUITO AUTO QUE DISPARA\CARSHOOTER\SOURCE\MAIN.CPP
/c /I"D:\GAME DEV\JUEGUITO AUTO QUE DISPARA\CARSHOOTER\SFML\INCLUDE" /ZI /JMC /nologo /W3 /WX- /diagnostics:column /sdl /Od /D _MBCS /Gm- /EHsc /RTC1 /MDd /GS /fp:precise /permissive- /Zc:wchar_t /Zc:forScope /Zc:inline /Fo"X64\DEBUG\\" /Fd"X64\DEBUG\VC142.PDB" /Gd /TP /FC D:\GAME DEV\JUEGUITO AUTO QUE DISPARA\CARSHOOTER\SOURCE\MAIN.CPP
^D:\GAME DEV\JUEGUITO AUTO QUE DISPARA\CARSHOOTER\SOURCE\PLAYERVEHICLE.CPP
/c /I"D:\GAME DEV\JUEGUITO AUTO QUE DISPARA\CARSHOOTER\SFML\INCLUDE" /ZI /JMC /nologo /W3 /WX- /diagnostics:column /sdl /Od /D _MBCS /Gm- /EHsc /RTC1 /MDd /GS /fp:precise /permissive- /Zc:wchar_t /Zc:forScope /Zc:inline /Fo"X64\DEBUG\\" /Fd"X64\DEBUG\VC142.PDB" /Gd /TP /FC D:\GAME DEV\JUEGUITO AUTO QUE DISPARA\CARSHOOTER\SOURCE\PLAYERVEHICLE.CPP
