%YAML 1.1
%TAG !u! tag:unity3d.com,2011:
--- !u!1001 &7198174016444925140
PrefabInstance:
  m_ObjectHideFlags: 0
  serializedVersion: 2
  m_Modification:
    m_TransformParent: {fileID: 0}
    m_Modifications:
    - target: {fileID: 5296599253901895452, guid: 79fd4150876d5b04db97ca22b97c0185, type: 3}
      propertyPath: m_Name
      value: Tile_Corner_180
      objectReference: {fileID: 0}
    - target: {fileID: 5296599253901895455, guid: 79fd4150876d5b04db97ca22b97c0185, type: 3}
      propertyPath: m_RootOrder
      value: 0
      objectReference: {fileID: 0}
    - target: {fileID: 5296599253901895455, guid: 79fd4150876d5b04db97ca22b97c0185, type: 3}
      propertyPath: m_LocalPosition.x
      value: 0
      objectReference: {fileID: 0}
    - target: {fileID: 5296599253901895455, guid: 79fd4150876d5b04db97ca22b97c0185, type: 3}
      propertyPath: m_LocalPosition.y
      value: 0
      objectReference: {fileID: 0}
    - target: {fileID: 5296599253901895455, guid: 79fd4150876d5b04db97ca22b97c0185, type: 3}
      propertyPath: m_LocalPosition.z
      value: 0
      objectReference: {fileID: 0}
    - target: {fileID: 5296599253901895455, guid: 79fd4150876d5b04db97ca22b97c0185, type: 3}
      propertyPath: m_LocalRotation.w
      value: 0.7071068
      objectReference: {fileID: 0}
    - target: {fileID: 5296599253901895455, guid: 79fd4150876d5b04db97ca22b97c0185, type: 3}
      propertyPath: m_LocalRotation.x
      value: 0
      objectReference: {fileID: 0}
    - target: {fileID: 5296599253901895455, guid: 79fd4150876d5b04db97ca22b97c0185, type: 3}
      propertyPath: m_LocalRotation.y
      value: 0.7071068
      objectReference: {fileID: 0}
    - target: {fileID: 5296599253901895455, guid: 79fd4150876d5b04db97ca22b97c0185, type: 3}
      propertyPath: m_LocalRotation.z
      value: 0
      objectReference: {fileID: 0}
    - target: {fileID: 5296599253901895455, guid: 79fd4150876d5b04db97ca22b97c0185, type: 3}
      propertyPath: m_LocalEulerAnglesHint.x
      value: 0
      objectReference: {fileID: 0}
    - target: {fileID: 5296599253901895455, guid: 79fd4150876d5b04db97ca22b97c0185, type: 3}
      propertyPath: m_LocalEulerAnglesHint.y
      value: 90
      objectReference: {fileID: 0}
    - target: {fileID: 5296599253901895455, guid: 79fd4150876d5b04db97ca22b97c0185, type: 3}
      propertyPath: m_LocalEulerAnglesHint.z
      value: 0
      objectReference: {fileID: 0}
    - target: {fileID: 7530268391409406941, guid: 79fd4150876d5b04db97ca22b97c0185, type: 3}
      propertyPath: m_LocalRotation.w
      value: 0
      objectReference: {fileID: 0}
    - target: {fileID: 7530268391409406941, guid: 79fd4150876d5b04db97ca22b97c0185, type: 3}
      propertyPath: m_LocalRotation.x
      value: 0
      objectReference: {fileID: 0}
    - target: {fileID: 7530268391409406941, guid: 79fd4150876d5b04db97ca22b97c0185, type: 3}
      propertyPath: m_LocalRotation.y
      value: 1
      objectReference: {fileID: 0}
    - target: {fileID: 7530268391409406941, guid: 79fd4150876d5b04db97ca22b97c0185, type: 3}
      propertyPath: m_LocalRotation.z
      value: 0
      objectReference: {fileID: 0}
    - target: {fileID: 7530268391409406941, guid: 79fd4150876d5b04db97ca22b97c0185, type: 3}
      propertyPath: m_LocalEulerAnglesHint.y
      value: 180
      objectReference: {fileID: 0}
    m_RemovedComponents: []
  m_SourcePrefab: {fileID: 100100000, guid: 79fd4150876d5b04db97ca22b97c0185, type: 3}
