%YAML 1.1
%TAG !u! tag:unity3d.com,2011:
--- !u!1001 &5505252960788536501
PrefabInstance:
  m_ObjectHideFlags: 0
  serializedVersion: 2
  m_Modification:
    m_TransformParent: {fileID: 0}
    m_Modifications:
    - target: {fileID: 562317794074669663, guid: 08d409ccf768e0648968b26ab2958846, type: 3}
      propertyPath: m_Mesh
      value: 
      objectReference: {fileID: -2432090755550338912, guid: a847eae99d42cdf49b01d8ca9f52e595, type: 3}
    - target: {fileID: 1016478230698606548, guid: 08d409ccf768e0648968b26ab2958846, type: 3}
      propertyPath: m_Name
      value: Tile_Water
      objectReference: {fileID: 0}
    - target: {fileID: 1016478230698606551, guid: 08d409ccf768e0648968b26ab2958846, type: 3}
      propertyPath: m_RootOrder
      value: 0
      objectReference: {fileID: 0}
    - target: {fileID: 1016478230698606551, guid: 08d409ccf768e0648968b26ab2958846, type: 3}
      propertyPath: m_LocalPosition.x
      value: 0
      objectReference: {fileID: 0}
    - target: {fileID: 1016478230698606551, guid: 08d409ccf768e0648968b26ab2958846, type: 3}
      propertyPath: m_LocalPosition.y
      value: 0
      objectReference: {fileID: 0}
    - target: {fileID: 1016478230698606551, guid: 08d409ccf768e0648968b26ab2958846, type: 3}
      propertyPath: m_LocalPosition.z
      value: 0
      objectReference: {fileID: 0}
    - target: {fileID: 1016478230698606551, guid: 08d409ccf768e0648968b26ab2958846, type: 3}
      propertyPath: m_LocalRotation.w
      value: 0.7071068
      objectReference: {fileID: 0}
    - target: {fileID: 1016478230698606551, guid: 08d409ccf768e0648968b26ab2958846, type: 3}
      propertyPath: m_LocalRotation.x
      value: 0
      objectReference: {fileID: 0}
    - target: {fileID: 1016478230698606551, guid: 08d409ccf768e0648968b26ab2958846, type: 3}
      propertyPath: m_LocalRotation.y
      value: 0.7071068
      objectReference: {fileID: 0}
    - target: {fileID: 1016478230698606551, guid: 08d409ccf768e0648968b26ab2958846, type: 3}
      propertyPath: m_LocalRotation.z
      value: 0
      objectReference: {fileID: 0}
    - target: {fileID: 1016478230698606551, guid: 08d409ccf768e0648968b26ab2958846, type: 3}
      propertyPath: m_LocalEulerAnglesHint.x
      value: 0
      objectReference: {fileID: 0}
    - target: {fileID: 1016478230698606551, guid: 08d409ccf768e0648968b26ab2958846, type: 3}
      propertyPath: m_LocalEulerAnglesHint.y
      value: 90
      objectReference: {fileID: 0}
    - target: {fileID: 1016478230698606551, guid: 08d409ccf768e0648968b26ab2958846, type: 3}
      propertyPath: m_LocalEulerAnglesHint.z
      value: 0
      objectReference: {fileID: 0}
    - target: {fileID: 2168903249191228051, guid: 08d409ccf768e0648968b26ab2958846, type: 3}
      propertyPath: isPlacable
      value: 0
      objectReference: {fileID: 0}
    - target: {fileID: 2693132595602029760, guid: 08d409ccf768e0648968b26ab2958846, type: 3}
      propertyPath: m_text
      value: (0, 0)
      objectReference: {fileID: 0}
    m_RemovedComponents:
    - {fileID: 5220619588510633675, guid: 08d409ccf768e0648968b26ab2958846, type: 3}
  m_SourcePrefab: {fileID: 100100000, guid: 08d409ccf768e0648968b26ab2958846, type: 3}
