%YAML 1.1
%TAG !u! tag:unity3d.com,2011:
--- !u!1001 &71764468286956754
PrefabInstance:
  m_ObjectHideFlags: 0
  serializedVersion: 2
  m_Modification:
    m_TransformParent: {fileID: 0}
    m_Modifications:
    - target: {fileID: 2484555128194186283, guid: 51fdf8ef97e167d41b9acaeced06857a, type: 3}
      propertyPath: m_Mesh
      value: 
      objectReference: {fileID: 0}
    - target: {fileID: 2484555128194186292, guid: 51fdf8ef97e167d41b9acaeced06857a, type: 3}
      propertyPath: m_Mesh
      value: 
      objectReference: {fileID: 0}
    - target: {fileID: 2484555128194186294, guid: 51fdf8ef97e167d41b9acaeced06857a, type: 3}
      propertyPath: m_Mesh
      value: 
      objectReference: {fileID: 0}
    - target: {fileID: 4468086079236087900, guid: 51fdf8ef97e167d41b9acaeced06857a, type: 3}
      propertyPath: m_LocalScale.x
      value: 0.5
      objectReference: {fileID: 0}
    - target: {fileID: 4468086079236087900, guid: 51fdf8ef97e167d41b9acaeced06857a, type: 3}
      propertyPath: m_LocalScale.y
      value: 0.5
      objectReference: {fileID: 0}
    - target: {fileID: 4468086079236087900, guid: 51fdf8ef97e167d41b9acaeced06857a, type: 3}
      propertyPath: m_LocalScale.z
      value: 0.5
      objectReference: {fileID: 0}
    - target: {fileID: 4625010917539584129, guid: 51fdf8ef97e167d41b9acaeced06857a, type: 3}
      propertyPath: m_Mesh
      value: 
      objectReference: {fileID: 4300004, guid: 00718395eefb6084bb25555f962f25c0, type: 3}
    - target: {fileID: 4970902933271541764, guid: 51fdf8ef97e167d41b9acaeced06857a, type: 3}
      propertyPath: m_Mesh
      value: 
      objectReference: {fileID: 0}
    - target: {fileID: 4970902933271541766, guid: 51fdf8ef97e167d41b9acaeced06857a, type: 3}
      propertyPath: m_Mesh
      value: 
      objectReference: {fileID: 0}
    - target: {fileID: 4970902933271541785, guid: 51fdf8ef97e167d41b9acaeced06857a, type: 3}
      propertyPath: m_Mesh
      value: 
      objectReference: {fileID: 0}
    - target: {fileID: 5676168816382920687, guid: 51fdf8ef97e167d41b9acaeced06857a, type: 3}
      propertyPath: m_Mesh
      value: 
      objectReference: {fileID: 0}
    - target: {fileID: 5676168816382920688, guid: 51fdf8ef97e167d41b9acaeced06857a, type: 3}
      propertyPath: m_Mesh
      value: 
      objectReference: {fileID: 0}
    - target: {fileID: 5676168816382920690, guid: 51fdf8ef97e167d41b9acaeced06857a, type: 3}
      propertyPath: m_Mesh
      value: 
      objectReference: {fileID: 0}
    - target: {fileID: 5882681881456661256, guid: 51fdf8ef97e167d41b9acaeced06857a, type: 3}
      propertyPath: m_Name
      value: AmmoShutgunPickUp
      objectReference: {fileID: 0}
    - target: {fileID: 6530817832787207743, guid: 51fdf8ef97e167d41b9acaeced06857a, type: 3}
      propertyPath: ammoType
      value: 2
      objectReference: {fileID: 0}
    - target: {fileID: 7972369976016945398, guid: 51fdf8ef97e167d41b9acaeced06857a, type: 3}
      propertyPath: m_RootOrder
      value: 0
      objectReference: {fileID: 0}
    - target: {fileID: 7972369976016945398, guid: 51fdf8ef97e167d41b9acaeced06857a, type: 3}
      propertyPath: m_LocalPosition.x
      value: 0
      objectReference: {fileID: 0}
    - target: {fileID: 7972369976016945398, guid: 51fdf8ef97e167d41b9acaeced06857a, type: 3}
      propertyPath: m_LocalPosition.y
      value: 0
      objectReference: {fileID: 0}
    - target: {fileID: 7972369976016945398, guid: 51fdf8ef97e167d41b9acaeced06857a, type: 3}
      propertyPath: m_LocalPosition.z
      value: 0
      objectReference: {fileID: 0}
    - target: {fileID: 7972369976016945398, guid: 51fdf8ef97e167d41b9acaeced06857a, type: 3}
      propertyPath: m_LocalRotation.w
      value: 1
      objectReference: {fileID: 0}
    - target: {fileID: 7972369976016945398, guid: 51fdf8ef97e167d41b9acaeced06857a, type: 3}
      propertyPath: m_LocalRotation.x
      value: 0
      objectReference: {fileID: 0}
    - target: {fileID: 7972369976016945398, guid: 51fdf8ef97e167d41b9acaeced06857a, type: 3}
      propertyPath: m_LocalRotation.y
      value: 0
      objectReference: {fileID: 0}
    - target: {fileID: 7972369976016945398, guid: 51fdf8ef97e167d41b9acaeced06857a, type: 3}
      propertyPath: m_LocalRotation.z
      value: 0
      objectReference: {fileID: 0}
    - target: {fileID: 7972369976016945398, guid: 51fdf8ef97e167d41b9acaeced06857a, type: 3}
      propertyPath: m_LocalEulerAnglesHint.x
      value: 0
      objectReference: {fileID: 0}
    - target: {fileID: 7972369976016945398, guid: 51fdf8ef97e167d41b9acaeced06857a, type: 3}
      propertyPath: m_LocalEulerAnglesHint.y
      value: 0
      objectReference: {fileID: 0}
    - target: {fileID: 7972369976016945398, guid: 51fdf8ef97e167d41b9acaeced06857a, type: 3}
      propertyPath: m_LocalEulerAnglesHint.z
      value: 0
      objectReference: {fileID: 0}
    m_RemovedComponents:
    - {fileID: 545569776924148913, guid: 51fdf8ef97e167d41b9acaeced06857a, type: 3}
  m_SourcePrefab: {fileID: 100100000, guid: 51fdf8ef97e167d41b9acaeced06857a, type: 3}
