{
	"data": [
		{
			"id": "1000",
			"code": "f230fh0g3",
			"name": "La Semilla Feliz",
			"description": "Veronica Corredor",
			"image": "bamboo-watch.jpg",
			"price": 65,
			"category": "ficción",
			"quantity": 24,
			"inventoryStatus": "INSTOCK",
			"rating": 5
		},
		{
			"id": "1001",
			"code": "nvklal433",
			"name": "Los Hombres del Norte",
			"description": "Jhon Haywood",
			"image": "black-watch.jpg",
			"price": 72,	
			"category": "Ficción",
			"quantity": 61,
			"inventoryStatus": "INSTOCK",
			"rating": 4
		},
		{
			"id": "1002",
			"code": "zz21cz3c1",
			"name": "Viaje Sentimental",
			"description": "Victor Shklovski",
			"image": "blue-band.jpg",
			"price": 79,
			"category": "Biografico",
			"quantity": 2,
			"inventoryStatus": "LOWSTOCK",
			"rating": 3
		},
		{
			"id": "1003",
			"code": "244wgerg2",
			"name": "Viaje al Centro de la Tierra",
			"description": "Julio Verne",
			"image": "blue-t-shirt.jpg",
			"price": 29,
			"category": "Ficción",
			"quantity": 25,
			"inventoryStatus": "INSTOCK",
			"rating": 5
		},
		{
			"id": "1004",
			"code": "h456wer53",
			"name": "Batman: The Killing Joke",
			"description": "Alan Moore",
			"image": "bracelet.jpg",
			"price": 999,
			"category": "Comics",
			"quantity": 73,
			"inventoryStatus": "OUTOFSTOCK",
			"rating": 5
		},
		{
			"id": "1005",
			"code": "av2231fwg",
			"name": "Arsène Lupin",
			"description": "Maurice LeBlanc",
			"image": "brown-purse.jpg",
			"price": 120,
			"category": "Ficción",
			"quantity": 0,
			"inventoryStatus": "OUTOFSTOCK",
			"rating": 4
		},
		{
			"id": "1006",
			"code": "bib36pfvm",
			"name": "Álgebra BALDOR",
			"description": "Aurelio Baldor",
			"image": "chakra-bracelet.jpg",
			"price": 32,
			"category": "Educativo",
			"quantity": 5,
			"inventoryStatus": "LOWSTOCK",
			"rating": 3
		},
		{
			"id": "1007",
			"code": "mbvjkgip5",
			"name": "Aproximación a la Ing. Software",
			"description": "Eduardo Moraleda",
			"image": "galaxy-earrings.jpg",
			"price": 34,
			"category": "Educativo",
			"quantity": 23,
			"inventoryStatus": "INSTOCK",
			"rating": 5
		},
		{
			"id": "1008",
			"code": "vbb124btr",
			"name": "Gravity Falls",
			"description": "Andrea Muriel",
			"image": "game-controller.jpg",
			"price": 99,
			"category": "Infantil",
			"quantity": 2,
			"inventoryStatus": "LOWSTOCK",
			"rating": 4
		},
		{
			"id": "1009",
			"code": "cm230f032",
			"name": "WIGETTA y el Báculo Dorado",
			"description": "Samuel de luque",
			"image": "gaming-set.jpg",
			"price": 299,
			"category": "Infantil",
			"quantity": 63,
			"inventoryStatus": "INSTOCK",
			"rating": 3
		},
		{
			"id": "1010",
			"code": "plb34234v",
			"name": "Mi Viaje sin Ti",
			"description": "Alejandro Sequera",
			"image": "gold-phone-case.jpg",
			"price": 24,
			"category": "Auto ayuda",
			"quantity": 0,
			"inventoryStatus": "OUTOFSTOCK",
			"rating": 4
		},
		{
			"id": "1011",
			"code": "4920nnc2d",
			"name": "Domina tu mente",
			"description": "Steve Allen",
			"image": "green-earbuds.jpg",
			"price": 89,
			"category": "Auto ayuda",
			"quantity": 23,
			"inventoryStatus": "INSTOCK",
			"rating": 4
		},
		{
			"id": "1012",
			"code": "250vm23cc",
			"name": "Yo Antes de Ti",
			"description": "Jojo Moyes",
			"image": "green-t-shirt.jpg",
			"price": 49,
			"category": "Novela",
			"quantity": 74,
			"inventoryStatus": "INSTOCK",
			"rating": 5
		},
		{
			"id": "1013",
			"code": "fldsmn31b",
			"name": "Fundamentos en Sistemas Operativos",
			"description": "Silberschatz Galvin",
			"image": "grey-t-shirt.jpg",
			"price": 48,
			"category": "Educativo",
			"quantity": 0,
			"inventoryStatus": "OUTOFSTOCK",
			"rating": 3
		},
		{
			"id": "1014",
			"code": "waas1x2as",
			"name": "Invincible",
			"description": "Robert Kirkman",
			"image": "headphones.jpg",
			"price": 175,
			"category": "Comics",
			"quantity": 8,
			"inventoryStatus": "LOWSTOCK",
			"rating": 5
		},
		{
			"id": "1015",
			"code": "vb34btbg5",
			"name": "Kick Ass",
			"description": "Jhon Romita",
			"image": "light-green-t-shirt.jpg",
			"price": 49,
			"category": "Comics",
			"quantity": 34,
			"inventoryStatus": "INSTOCK",
			"rating": 4
		},
		{
			"id": "1016",
			"code": "k8l6j58jl",
			"name": "Las Ventajas de Ser Invisible",
			"description": "Stephen Chbosky",
			"image": "lime-band.jpg",
			"price": 79,
			"category": "Novela",
			"quantity": 12,
			"inventoryStatus": "INSTOCK",
			"rating": 3
		},
		{
			"id": "1017",
			"code": "v435nn85n",
			"name": "Nacho Lee",
			"description": "Product Description",
			"image": "mini-speakers.jpg",
			"price": 85,
			"category": "Clothing",
			"quantity": 42,
			"inventoryStatus": "INSTOCK",
			"rating": 4
		},
		{
			"id": "1018",
			"code": "09zx9c0zc",
			"name": "CUADRADO: Panita esta es mi historia",
			"description": "Juan Guillermo Cuadrado",
			"image": "painted-phone-case.jpg",
			"price": 56,
			"category": "Biografico",
			"quantity": 41,
			"inventoryStatus": "INSTOCK",
			"rating": 5
		},
		{
			"id": "1019",
			"code": "mnb5mb2m5",
			"name": "LOS AMANTES DE ARGEL",
			"description": "Anouar Benmalek",
			"image": "pink-band.jpg",
			"price": 79,
			"category": "Ficción",
			"quantity": 63,
			"inventoryStatus": "INSTOCK",
			"rating": 4
		},
		{
			"id": "1020",
			"code": "r23fwf2w3",
			"name": "Despúes",
			"description": "Stephen King",
			"image": "pink-purse.jpg",
			"price": 110,
			"category": "Ficción",
			"quantity": 0,
			"inventoryStatus": "OUTOFSTOCK",
			"rating": 4
		},
		{
			"id": "1021",
			"code": "pxpzczo23",
			"name": "Asados ",
			"description": "Autores Varios",
			"image": "purple-band.jpg",
			"price": 79,
			"category": "Cocina",
			"quantity": 6,
			"inventoryStatus": "LOWSTOCK",
			"rating": 3
		},
		{
			"id": "1022",
			"code": "2c42cb5cb",
			"name": "COMIDA RAW. Recetas y Preparación",
			"description": "Saskia Fraser",
			"image": "purple-gemstone-necklace.jpg",
			"price": 45,
			"category": "Cocina",
			"quantity": 62,
			"inventoryStatus": "INSTOCK",
			"rating": 4
		},
		{
			"id": "1023",
			"code": "5k43kkk23",
			"name": "Comida Sana en BOWL",
			"description": "Ana Martinez",
			"image": "purple-t-shirt.jpg",
			"price": 49,
			"category": "Cocina",
			"quantity": 2,
			"inventoryStatus": "LOWSTOCK",
			"rating": 5
		},
		{
			"id": "1024",
			"code": "lm2tny2k4",
			"name": "Una Tierra Prometida",
			"description": "Barack Obama",
			"image": "shoes.jpg",
			"price": 64,
			"category": "Biografia",
			"quantity": 0,
			"inventoryStatus": "INSTOCK",
			"rating": 4
		},
		{
			"id": "1025",
			"code": "nbm5mv45n",
			"name": "civil War II",
			"description": "Brian Bendis",
			"image": "sneakers.jpg",
			"price": 78,
			"category": "Comics",
			"quantity": 52,
			"inventoryStatus": "INSTOCK",
			"rating": 4
		},
		{
			"id": "1026",
			"code": "zx23zc42c",
			"name": "El último día",
			"description": "Millar Salter",
			"image": "teal-t-shirt.jpg",
			"price": 49,
			"category": "Novela",
			"quantity": 3,
			"inventoryStatus": "LOWSTOCK",
			"rating": 3
		},
		{
			"id": "1027",
			"code": "acvx872gc",
			"name": "El Cosmos y la Materia Oscura",
			"description": "National Graphic",
			"image": "yellow-earbuds.jpg",
			"price": 89,
			"category": "Educativo",
			"quantity": 35,
			"inventoryStatus": "INSTOCK",
			"rating": 3
		},
		{
			"id": "1028",
			"code": "tx125ck42",
			"name": "El Buen Hijo",
			"description": "You-Jeong Jeong",
			"image": "yoga-mat.jpg",
			"price": 20,
			"category": "Ficción",
			"quantity": 15,
			"inventoryStatus": "INSTOCK",
			"rating": 5
		},
		{
			"id": "1029",
			"code": "gwuby345v",
			"name": "Las Almas de Brandon",
			"description": "César Ndjocu",
			"image": "yoga-set.jpg",
			"price": 20,
			"category": "Auto ayuda",
			"quantity": 25,
			"inventoryStatus": "INSTOCK",
			"rating": 8
		}
	]
}
