# Alias OBJ Model File
# Exported from SketchUp, (c) 2000-2012 Trimble Navigation Limited
# File units = meters

mtllib Dish 1.mtl

g Mesh1 Group3 Group2 Group1 Model

usemtl matchpole62k_2
v 0.379012 0.814519 -0.372922
vt 0.378941 -0.390584
vn -0.0784591 1.48552e-08 0.996917
v 0.321583 0.807187 -0.377442
vt 0.378941 0.969766
v 0.363685 0.724233 -0.374129
vt 0.994452 0.969766
v 0.421114 0.731565 -0.369609
vt 0.994452 -0.390584
f 1/1/1 2/2/1 3/3/1 4/4/1 

v 0.379873 0.814519 -0.383867
vn -0.452297 0.891157 -0.0355966
v 0.322444 0.807187 -0.388387
f 5/1/2 6/2/2 2/2/2 1/1/2 

vn 0.0784591 -1.48552e-08 -0.996917
v 0.421976 0.731565 -0.380553
v 0.364546 0.724233 -0.385073
f 6/2/3 5/1/3 7/4/3 8/3/3 

vn 0.988939 0.126259 0.0778312
f 5/1/4 1/1/4 4/4/4 7/4/4 

vn 0.452297 -0.891157 0.0355966
f 8/3/5 7/4/5 4/4/5 3/3/5 

vn -0.988939 -0.126259 -0.0778312
f 2/2/6 6/2/6 8/3/6 3/3/6 

g Mesh2 Group5 Group4 Group2 Group1 Model

usemtl gregg65
v 0.317136 1.05742 -0.454712
vt 0.468903 0.45047
vn 0.996917 1.16958e-09 0.0784591
v 0.317956 1.06445 -0.465131
vt 0.457205 0.459559
v 0.318585 1.07362 -0.473126
vt 0.448228 0.471404
v 0.318981 1.0843 -0.478152
vt 0.442585 0.485198
v 0.319116 1.09576 -0.479866
vt 0.44066 0.5
v 0.318981 1.10721 -0.478152
vt 0.442585 0.514802
v 0.318585 1.11789 -0.473126
vt 0.448228 0.528596
v 0.317956 1.12706 -0.465131
vt 0.457205 0.540441
v 0.317136 1.13409 -0.454712
vt 0.468903 0.54953
v 0.316181 1.13852 -0.442578
vt 0.482527 0.555244
v 0.315156 1.14002 -0.429557
vt 0.497147 0.557192
v 0.314131 1.13852 -0.416536
vt 0.511766 0.555244
v 0.313176 1.13409 -0.404403
vt 0.52539 0.54953
v 0.312356 1.12706 -0.393983
vt 0.537088 0.540441
v 0.311727 1.11789 -0.385988
vt 0.546065 0.528596
v 0.311332 1.10721 -0.380962
vt 0.551708 0.514802
v 0.311197 1.09576 -0.379248
vt 0.553633 0.5
v 0.311332 1.0843 -0.380962
vt 0.551708 0.485198
v 0.311727 1.07362 -0.385988
vt 0.546065 0.471404
v 0.312356 1.06445 -0.393983
vt 0.537088 0.459559
v 0.313176 1.05742 -0.404403
vt 0.52539 0.45047
v 0.314131 1.053 -0.416536
vt 0.511766 0.444756
v 0.315156 1.05149 -0.429557
vt 0.497147 0.442808
v 0.316181 1.053 -0.442578
vt 0.482527 0.444756
f 9/5/7 10/6/7 11/7/7 12/8/7 13/9/7 14/10/7 15/11/7 16/12/7 17/13/7 18/14/7 19/15/7 20/16/7 21/17/7 22/18/7 23/19/7 24/20/7 25/21/7 26/22/7 27/23/7 28/24/7 29/25/7 30/26/7 31/27/7 32/28/7 

vn 0.989033 0.0749017 0.12729
v 0.343115 0.979585 -0.504055
vt 0.411561 0.349909
v 0.3456 1.0009 -0.535629
vt 0.37611 0.377451
vn 0.987155 0.0611398 0.147606
f 9/5/8 33/29/8 34/30/9 10/6/9 

vn 0.991102 0.0835591 0.103604
v 0.340222 0.966184 -0.467286
vt 0.452844 0.332595
f 32/28/10 35/31/10 33/29/8 9/5/8 

vn 0.992077 0.086506 0.0911014
v 0.337116 0.961613 -0.427829
vt 0.497147 0.32669
f 31/27/11 36/32/11 35/31/10 32/28/10 

vn 0.995108 0.0835591 0.0527136
v 0.334011 0.966184 -0.388371
vt 0.541449 0.332595
vn 0.994115 0.086506 0.0652152
f 30/26/12 37/33/12 36/32/13 31/27/13 

vn 0.996769 0.0749017 0.0289963
v 0.331117 0.979585 -0.351603
vt 0.582732 0.349909
f 29/25/14 38/34/14 37/33/12 30/26/12 

vn 0.998092 0.0611398 0.00863658
v 0.328632 1.0009 -0.320029
vt 0.618183 0.377451
f 28/24/15 39/35/15 38/34/14 29/25/14 

v 0.326725 1.02868 -0.295802
vt 0.645385 0.413345
vn 0.999041 0.0432203 -0.00697777
f 40/36/16 39/35/15 28/24/15 27/23/16 

vn 0.996022 0.0866661 -0.0207163
vn 0.997203 0.0612477 -0.0428284
v 0.363 0.961613 -0.160102
vt 0.793623 0.32669
v 0.366814 0.906049 -0.208557
vt 0.739219 0.254902
f 39/35/17 40/36/18 41/37/18 42/38/17 

v 0.325527 1.06104 -0.280572
vt 0.662485 0.455144
vn 0.997887 0.0316911 -0.0567126
v 0.360603 1.02632 -0.129642
vt 0.827823 0.410288
f 40/36/18 43/39/19 44/40/19 41/37/18 

vn 0.999609 0.0223679 -0.0167884
f 43/39/20 40/36/16 27/23/16 26/22/20 

v 0.325118 1.09576 -0.275377
vt 0.668317 0.5
vn 0.999797 -2.99563e-10 -0.0201336
f 45/41/21 43/39/20 26/22/20 25/21/21 

vn 0.99811 -9.15154e-10 -0.061445
v 0.359785 1.09576 -0.119252
vt 0.839488 0.5
f 43/39/19 45/41/22 46/42/22 44/40/19 

v 0.325527 1.13048 -0.280572
vt 0.662485 0.544856
vn 0.997887 -0.0316911 -0.0567126
v 0.360603 1.16519 -0.129642
vt 0.827823 0.589712
f 47/43/23 48/44/23 46/42/22 45/41/22 

v 0.326725 1.16283 -0.295802
vt 0.645385 0.586655
vn 0.997203 -0.0612477 -0.0428284
v 0.363 1.2299 -0.160102
vt 0.793623 0.67331
f 49/45/24 50/46/24 48/44/23 47/43/23 

v 0.328632 1.19061 -0.320029
vt 0.618183 0.622549
vn 0.996022 -0.0866661 -0.0207163
v 0.366814 1.28546 -0.208557
vt 0.739219 0.745098
f 51/47/25 52/48/25 50/46/24 49/45/24 

v 0.331117 1.21193 -0.351603
vt 0.582732 0.650091
vn 0.994311 -0.106204 0.00813678
v 0.371783 1.3281 -0.271704
vt 0.668317 0.800183
f 53/49/26 54/50/26 52/48/25 51/47/25 

v 0.334011 1.22533 -0.388371
vt 0.541449 0.667405
vn 0.992075 -0.118504 0.0417677
v 0.377571 1.3549 -0.345241
vt 0.585751 0.83481
f 55/51/27 56/52/27 54/50/26 53/49/26 

v 0.337116 1.2299 -0.427829
vt 0.497147 0.67331
vn 0.990661 -0.122682 0.0594972
v 0.383782 1.36404 -0.424156
vt 0.497147 0.846621
f 57/53/28 58/54/28 56/52/27 55/51/27 

v 0.389992 1.3549 -0.503071
vt 0.408542 0.83481
vn 0.986395 -0.118504 0.113941
vn 0.987772 -0.122682 0.0962088
v 0.340222 1.22533 -0.467286
vt 0.452844 0.667405
f 59/55/29 58/54/30 57/53/30 60/56/29 

vn 0.972313 -0.190759 0.134973
v 0.438563 1.43439 -0.523604
vt 0.381364 0.937508
v 0.430447 1.44634 -0.420484
vt 0.497147 0.952941
vn 0.974513 -0.197479 0.106426
f 59/55/31 61/57/31 62/58/32 58/54/32 

v 0.39578 1.3281 -0.576608
vt 0.325976 0.800183
vn 0.96702 -0.170847 0.188902
v 0.446125 1.39937 -0.619697
vt 0.273472 0.892259
f 63/59/33 64/60/33 61/57/31 59/55/31 

v 0.40075 1.28546 -0.639756
vt 0.255074 0.745098
vn 0.961964 -0.139293 0.234994
v 0.45262 1.34365 -0.702215
vt 0.180823 0.820278
f 65/61/34 66/62/34 64/60/33 63/59/33 

v 0.404563 1.2299 -0.688211
vt 0.20067 0.67331
vn 0.957773 -0.0983524 0.270179
v 0.457603 1.27105 -0.765532
vt 0.109731 0.726471
f 65/61/34 67/63/35 68/64/35 66/62/34 

vn 0.978226 -0.0612477 0.198298
vn 0.980519 -0.0866661 0.176273
v 0.3456 1.19061 -0.535629
vt 0.37611 0.622549
v 0.347507 1.16283 -0.559856
vt 0.348908 0.586655
f 67/63/36 65/61/37 69/65/37 70/66/36 

vn 0.983342 -0.106204 0.147508
v 0.343115 1.21193 -0.504055
vt 0.411561 0.650091
f 65/61/37 63/59/38 71/67/38 69/65/37 

f 63/59/38 59/55/29 60/56/29 71/67/38 

vn 0.989033 -0.0749017 0.12729
vn 0.991102 -0.0835591 0.103605
f 17/13/39 71/67/39 60/56/40 18/14/40 

vn 0.987155 -0.0611398 0.147606
f 16/12/41 69/65/41 71/67/39 17/13/39 

vn 0.98565 -0.0432203 0.163176
f 16/12/41 15/11/42 70/66/42 69/65/41 

vn 0.984676 -0.0223679 0.172955
v 0.348706 1.13048 -0.575086
vt 0.331808 0.544856
f 15/11/42 14/10/43 72/68/43 70/66/42 

vn 0.984339 2.62735e-09 0.176288
v 0.349114 1.09576 -0.580281
vt 0.325976 0.5
f 14/10/43 13/9/44 73/69/44 72/68/43 

vn 0.984676 0.0223679 0.172955
v 0.348706 1.06104 -0.575086
vt 0.331808 0.455144
f 13/9/44 12/8/45 74/70/45 73/69/44 

vn 0.98565 0.0432203 0.163176
v 0.347507 1.02868 -0.559856
vt 0.348908 0.413345
f 12/8/45 11/7/46 75/71/46 74/70/45 

f 11/7/46 10/6/9 34/30/9 75/71/46 

v 0.404563 0.961613 -0.688211
vt 0.20067 0.32669
vn 0.978226 0.0612478 0.198298
vn 0.980519 0.0866661 0.176273
v 0.40075 0.906049 -0.639756
vt 0.255074 0.254902
f 76/72/47 75/71/47 34/30/48 77/73/48 

v 0.40696 1.02632 -0.718671
vt 0.16647 0.410288
vn 0.97673 0.0316911 0.212118
f 78/74/49 74/70/49 75/71/47 76/72/47 

v 0.407778 1.09576 -0.72906
vt 0.154805 0.5
vn 0.97621 3.23143e-09 0.216827
f 79/75/50 73/69/50 74/70/49 78/74/49 

v 0.40696 1.16519 -0.718671
vt 0.16647 0.589712
vn 0.97673 -0.0316911 0.212118
f 79/75/50 80/76/51 72/68/51 73/69/50 

vn 0.955003 -0.050857 0.292203
vn 0.954035 4.46626e-09 0.299696
v 0.461804 1.09576 -0.818911
vt 0.0497972 0.5
v 0.460735 1.18649 -0.805335
vt 0.0650403 0.61723
f 80/76/52 79/75/53 81/77/53 82/78/52 

vn 0.955003 0.050857 0.292203
v 0.460735 1.00502 -0.805335
vt 0.0650403 0.38277
f 79/75/53 78/74/54 83/79/54 81/77/53 

vn 0.957773 0.0983524 0.270179
v 0.457603 0.920467 -0.765532
vt 0.109731 0.273529
f 78/74/54 76/72/55 84/80/55 83/79/54 

vn 0.961964 0.139293 0.234994
v 0.45262 0.84786 -0.702215
vt 0.180823 0.179722
f 76/72/55 77/73/56 85/81/56 84/80/55 

v 0.39578 0.863413 -0.576608
vt 0.325976 0.199817
vn 0.96702 0.170847 0.188902
v 0.446125 0.792146 -0.619697
vt 0.273472 0.107741
f 86/82/57 87/83/57 85/81/56 77/73/56 

v 0.389992 0.836612 -0.503071
vt 0.408542 0.16519
vn 0.972313 0.190759 0.134973
v 0.438563 0.757123 -0.523604
vt 0.381364 0.0624924
f 88/84/58 89/85/58 87/83/57 86/82/57 

v 0.383782 0.82747 -0.424156
vt 0.497147 0.153379
vn 0.974513 0.197479 0.106426
v 0.430447 0.745178 -0.420484
vt 0.497147 0.0470588
f 90/86/59 91/87/59 89/85/58 88/84/58 

v 0.377571 0.836612 -0.345241
vt 0.585751 0.16519
vn 0.981457 0.190759 0.0187925
v 0.422331 0.757123 -0.317363
vt 0.612929 0.0624924
vn 0.979164 0.197479 0.0473318
f 92/88/60 93/89/60 91/87/61 90/86/61 

v 0.371783 0.863413 -0.271704
vt 0.668317 0.199817
vn 0.984665 0.170847 -0.035301
v 0.414768 0.792146 -0.22127
vt 0.720821 0.107741
f 94/90/62 95/91/62 93/89/60 92/88/60 

vn 0.986882 0.139293 -0.0816161
v 0.408274 0.84786 -0.138753
vt 0.81347 0.179722
f 42/38/63 96/92/63 95/91/62 94/90/62 

v 0.403291 0.920467 -0.0754349
vt 0.884562 0.273529
vn 0.988247 0.0983524 -0.117024
f 97/93/64 96/92/63 42/38/63 41/37/64 

v 0.400158 1.00502 -0.0356318
vt 0.929253 0.38277
v 0.39909 1.09576 -0.0220557
vt 0.944496 0.5
v 0.400158 1.18649 -0.0356318
vt 0.929253 0.61723
v 0.403291 1.27105 -0.0754349
vt 0.884562 0.726471
v 0.408274 1.34365 -0.138753
vt 0.81347 0.820278
v 0.414768 1.39937 -0.22127
vt 0.720821 0.892259
v 0.422331 1.43439 -0.317363
vt 0.612929 0.937508
v 0.430447 1.46412 -0.420484
vt 0.497147 0.975919
v 0.421919 1.45157 -0.312132
vt 0.618803 0.959702
v 0.413973 1.41477 -0.211164
vt 0.732168 0.912158
v 0.407149 1.35623 -0.124461
vt 0.829517 0.836525
v 0.401913 1.27994 -0.0579309
vt 0.904216 0.737959
v 0.398622 1.1911 -0.0161086
vt 0.951173 0.623177
v 0.397499 1.09576 -0.0018438
vt 0.96719 0.5
v 0.398622 1.00042 -0.0161086
vt 0.951173 0.376823
v 0.401913 0.911575 -0.0579309
vt 0.904216 0.262041
v 0.407149 0.835284 -0.124461
vt 0.829517 0.163475
v 0.413973 0.776744 -0.211164
vt 0.732168 0.0878425
v 0.421919 0.739945 -0.312132
vt 0.618803 0.040298
v 0.430447 0.727393 -0.420484
vt 0.497147 0.0240815
f 93/89/7 95/91/7 96/92/7 97/93/7 98/94/7 99/95/7 100/96/7 101/97/7 102/98/7 103/99/7 104/100/7 62/58/7 105/101/7 106/102/7 107/103/7 108/104/7 109/105/7 110/106/7 111/107/7 112/108/7 113/109/7 114/110/7 115/111/7 116/112/7 117/113/7 91/87/7 

vn 0.988956 0.050857 -0.13921
f 98/94/65 97/93/64 41/37/64 44/40/65 

vn 0.989172 -2.18649e-09 -0.146762
f 99/95/66 98/94/65 44/40/65 46/42/66 

vn 0.988956 -0.050857 -0.13921
f 100/96/67 99/95/66 46/42/66 48/44/67 

vn 0.988247 -0.0983524 -0.117024
f 101/97/68 100/96/67 48/44/67 50/46/68 

vn 0.986882 -0.139293 -0.0816161
f 102/98/69 101/97/68 50/46/68 52/48/69 

vn 0.984665 -0.170847 -0.035301
f 54/50/70 103/99/70 102/98/69 52/48/69 

vn 0.981457 -0.190759 0.0187925
f 56/52/71 104/100/71 103/99/70 54/50/70 

vn 0.979164 -0.197479 0.0473318
f 58/54/72 62/58/72 104/100/71 56/52/71 

v 0.438974 0.739945 -0.528835
vt 0.37549 0.040298
v 0.446921 0.776744 -0.629803
vt 0.262125 0.0878425
v 0.453744 0.835284 -0.716507
vt 0.164776 0.163475
v 0.45898 0.911575 -0.783036
vt 0.0900774 0.262041
v 0.462272 1.00042 -0.824858
vt 0.0431199 0.376823
v 0.463395 1.09576 -0.839123
vt 0.0271036 0.5
v 0.462272 1.1911 -0.824858
vt 0.0431199 0.623177
v 0.45898 1.27994 -0.783036
vt 0.0900774 0.737959
v 0.453744 1.35623 -0.716507
vt 0.164776 0.836525
v 0.446921 1.41477 -0.629803
vt 0.262125 0.912158
v 0.438974 1.45157 -0.528835
vt 0.37549 0.959702
f 118/114/7 119/115/7 120/116/7 121/117/7 122/118/7 123/119/7 124/120/7 125/121/7 126/122/7 127/123/7 128/124/7 105/101/7 62/58/7 61/57/7 64/60/7 66/62/7 68/64/7 82/78/7 81/77/7 83/79/7 84/80/7 85/81/7 87/83/7 89/85/7 91/87/7 117/113/7 

vn -0.00103787 -0.9561 -0.293037
v 0.400536 0.740265 -0.531762
vt 0.3756 0.0407117
v 0.408476 0.777031 -0.63264
vt 0.262337 0.0882134
vn 0.0197901 -0.835079 -0.549774
f 118/114/73 129/125/73 130/126/74 119/115/74 

vn -0.0122816 -0.988639 -0.149804
v 0.392017 0.727724 -0.423508
vt 0.497147 0.0245098
f 117/113/75 131/127/75 129/125/73 118/114/73 

vn -0.0468662 -0.9561 0.289267
v 0.383497 0.740265 -0.315254
vt 0.618693 0.0407117
vn -0.0355649 -0.988639 0.146039
f 116/112/76 132/128/76 131/127/77 117/113/77 

vn -0.0664571 -0.835079 0.546101
v 0.375558 0.777031 -0.214377
vt 0.731957 0.0882134
f 115/111/78 133/129/78 132/128/76 116/112/76 

vn -0.0815283 -0.659269 0.747474
v 0.36874 0.835519 -0.127751
vt 0.829218 0.163778
f 114/110/79 134/130/79 133/129/78 115/111/78 

vn -0.0918383 -0.451701 0.88743
v 0.363509 0.91174 -0.0612817
vt 0.903849 0.262255
f 114/110/79 113/109/80 135/131/80 134/130/79 

vn -0.0977475 -0.228755 0.968564
v 0.36022 1.0005 -0.0194971
vt 0.950765 0.376934
f 113/109/80 112/108/81 136/132/81 135/131/80 

vn -0.099663 1.4827e-08 0.995021
v 0.359099 1.09576 -0.0052451
vt 0.966767 0.5
f 112/108/81 111/107/82 137/133/82 136/132/81 

vn -0.0977475 0.228755 0.968564
v 0.36022 1.19101 -0.0194971
vt 0.950765 0.623066
f 111/107/82 110/106/83 138/134/83 137/133/82 

vn -0.0918383 0.451701 0.88743
v 0.363509 1.27977 -0.0612817
vt 0.903849 0.737745
f 109/105/84 139/135/84 138/134/83 110/106/83 

vn -0.0815283 0.659269 0.747474
v 0.36874 1.35599 -0.127751
vt 0.829218 0.836222
f 108/104/85 140/136/85 139/135/84 109/105/84 

vn -0.0664571 0.835079 0.546101
v 0.375558 1.41448 -0.214377
vt 0.731957 0.911787
f 107/103/86 141/137/86 140/136/85 108/104/85 

vn -0.0468662 0.9561 0.289267
v 0.383497 1.45125 -0.315254
vt 0.618693 0.959288
f 106/102/87 142/138/87 141/137/86 107/103/86 

vn -0.0355649 0.988639 0.146039
v 0.392017 1.46379 -0.423508
vt 0.497147 0.97549
f 105/101/88 143/139/88 142/138/87 106/102/87 

vn -0.00103787 0.9561 -0.293037
v 0.400536 1.45125 -0.531762
vt 0.3756 0.959288
vn -0.0122816 0.988639 -0.149804
f 128/124/89 144/140/89 143/139/90 105/101/90 

vn 0.0197901 0.835079 -0.549774
v 0.408476 1.41448 -0.63264
vt 0.262337 0.911787
f 127/123/91 145/141/91 144/140/89 128/124/89 

vn 0.0364061 0.659269 -0.751025
v 0.415293 1.35599 -0.719265
vt 0.165075 0.836222
f 126/122/92 146/142/92 145/141/91 127/123/91 

v 0.420524 1.27977 -0.785734
vt 0.0904438 0.737745
vn 0.048117 0.451701 -0.890871
f 147/143/93 146/142/92 126/122/92 125/121/93 

vn -0.99866 -0.039455 -0.0334785
vn -0.999337 -0.0278957 -0.0233982
v 0.421918 1.27105 -0.768341
v 0.416934 1.34365 -0.705023
f 146/142/94 147/143/95 148/64/95 149/62/94 

v 0.423813 1.19101 -0.827519
vt 0.0435285 0.623066
vn -0.99975 -0.0144386 -0.0170624
v 0.42505 1.18649 -0.808144
f 147/143/95 150/144/96 151/78/96 148/64/95 

vn 0.0549727 0.228755 -0.971931
f 150/144/97 147/143/93 125/121/93 124/120/97 

v 0.424935 1.09576 -0.841771
vt 0.0275266 0.5
vn 0.0572196 -1.48768e-08 -0.998362
f 152/145/98 150/144/97 124/120/97 123/119/98 

vn -0.999889 -2.22504e-10 -0.0149016
v 0.426119 1.09576 -0.82172
f 150/144/96 152/145/99 153/77/99 151/78/96 

v 0.423813 1.0005 -0.827519
vt 0.0435285 0.376934
vn -0.99975 0.0144386 -0.0170624
v 0.42505 1.00502 -0.808144
f 153/77/99 152/145/99 154/146/100 155/79/100 

vn 0.0549727 -0.228755 -0.971931
f 152/145/98 123/119/98 122/118/101 154/146/101 

vn 0.048117 -0.451701 -0.890871
v 0.420524 0.91174 -0.785734
vt 0.0904438 0.262255
f 154/146/101 122/118/101 121/117/102 156/147/102 

vn 0.0364061 -0.659269 -0.751025
v 0.415293 0.835519 -0.719265
vt 0.165075 0.163778
f 156/147/102 121/117/102 120/116/103 157/148/103 

f 119/115/74 130/126/74 157/148/103 120/116/103 

v 0.416934 0.84786 -0.705023
vn -0.99866 0.039455 -0.0334785
vn -0.997743 0.048328 -0.0466172
v 0.41044 0.792146 -0.622506
f 158/81/104 157/148/104 130/126/105 159/83/105 

v 0.421918 0.920467 -0.768341
vn -0.999337 0.0278957 -0.0233982
f 160/80/106 156/147/106 157/148/104 158/81/104 

f 155/79/100 154/146/100 156/147/106 160/80/106 

v 0.368878 0.961613 -0.691019
vn -0.957773 -0.0983524 -0.270179
v 0.371275 1.02632 -0.721479
vn -0.955003 -0.050857 -0.292203
f 161/72/107 162/74/108 155/79/108 160/80/107 

v 0.31302 1.06104 -0.577894
vn -0.97673 -0.0316911 -0.212118
vn -0.978226 -0.0612478 -0.198298
v 0.311822 1.02868 -0.562664
f 163/70/109 162/74/109 161/72/110 164/71/110 

v 0.313429 1.09576 -0.583089
vn -0.97621 -3.23143e-09 -0.216827
v 0.372093 1.09576 -0.731868
f 165/69/111 166/75/111 162/74/109 163/70/109 

v 0.371275 1.16519 -0.721479
vn -0.97673 0.0316911 -0.212118
v 0.31302 1.13048 -0.577894
f 167/76/112 166/75/111 165/69/111 168/68/112 

vn -0.954035 -4.46626e-09 -0.299696
vn -0.955003 0.050857 -0.292203
f 166/75/113 167/76/114 151/78/114 153/77/113 

v 0.368878 1.2299 -0.691019
vn -0.957773 0.0983524 -0.270179
f 167/76/114 169/63/115 148/64/115 151/78/114 

vn -0.978226 0.0612477 -0.198298
v 0.311822 1.16283 -0.562664
f 169/63/116 167/76/112 168/68/112 170/66/116 

v 0.283295 1.10721 -0.48096
vn -0.984676 0.0223679 -0.172955
v 0.2829 1.11789 -0.475935
vn -0.98565 0.0432203 -0.163176
f 171/10/117 172/11/118 170/66/118 168/68/117 

v 0.278446 1.053 -0.419345
vn -0.996917 -1.16958e-09 -0.0784591
v 0.277491 1.05742 -0.407211
v 0.276671 1.06445 -0.396792
v 0.276042 1.07362 -0.388797
v 0.275646 1.0843 -0.383771
v 0.275511 1.09576 -0.382056
v 0.275646 1.10721 -0.383771
v 0.276042 1.11789 -0.388797
v 0.276671 1.12706 -0.396792
v 0.277491 1.13409 -0.407211
v 0.278446 1.13852 -0.419345
v 0.279471 1.14002 -0.432366
v 0.280496 1.13852 -0.445387
v 0.281451 1.13409 -0.45752
v 0.282271 1.12706 -0.46794
v 0.28343 1.09576 -0.482675
v 0.283295 1.0843 -0.48096
v 0.2829 1.07362 -0.475935
v 0.282271 1.06445 -0.46794
v 0.281451 1.05742 -0.45752
v 0.280496 1.053 -0.445387
v 0.279471 1.05149 -0.432366
f 173/26/119 174/25/119 175/24/119 176/23/119 177/22/119 178/21/119 179/20/119 180/19/119 181/18/119 182/17/119 183/16/119 184/15/119 185/14/119 186/13/119 187/12/119 172/11/119 171/10/119 188/9/119 189/8/119 190/7/119 191/6/119 192/5/119 193/28/119 194/27/119 

v 0.295432 0.979585 -0.354411
vn -0.996769 -0.0749017 -0.0289963
vn -0.995108 -0.0835591 -0.0527136
v 0.298326 0.966184 -0.39118
f 195/34/120 174/25/120 173/26/121 196/33/121 

v 0.292947 1.0009 -0.322838
vn -0.998092 -0.0611398 -0.00863658
f 197/35/122 175/24/122 174/25/120 195/34/120 

v 0.29104 1.02868 -0.29861
vn -0.999041 -0.0432203 0.00697777
f 197/35/122 198/36/123 176/23/123 175/24/122 

vn -0.997203 -0.0612477 0.0428284
vn -0.996022 -0.0866661 0.0207163
v 0.331128 0.906049 -0.211365
v 0.327315 0.961613 -0.16291
f 198/36/124 197/35/125 199/38/125 200/37/124 

vn -0.994311 -0.106204 -0.00813678
v 0.336098 0.863413 -0.274513
f 197/35/125 195/34/126 201/90/126 199/38/125 

vn -0.992075 -0.118504 -0.0417677
v 0.341886 0.836612 -0.34805
f 195/34/126 196/33/127 202/88/127 201/90/126 

v 0.301431 0.961613 -0.430637
vn -0.990661 -0.122682 -0.0594972
v 0.348096 0.82747 -0.426965
f 196/33/127 203/32/128 204/86/128 202/88/127 

vn -0.994115 -0.086506 -0.0652152
f 196/33/121 173/26/121 194/27/129 203/32/129 

vn -0.992077 -0.086506 -0.0911014
vn -0.991102 -0.0835591 -0.103604
v 0.304536 0.966184 -0.470095
f 203/32/130 194/27/130 193/28/131 205/31/131 

vn -0.989033 -0.0749017 -0.12729
v 0.30743 0.979585 -0.506863
f 205/31/131 193/28/131 192/5/132 206/29/132 

vn -0.987155 -0.0611398 -0.147606
v 0.309915 1.0009 -0.538437
f 206/29/132 192/5/132 191/6/133 207/30/133 

vn -0.98565 -0.0432203 -0.163176
f 191/6/133 190/7/134 164/71/134 207/30/133 

vn -0.984676 -0.0223679 -0.172955
f 190/7/134 189/8/135 163/70/135 164/71/134 

vn -0.984339 -2.62735e-09 -0.176288
f 189/8/135 188/9/136 165/69/136 163/70/135 

f 188/9/136 171/10/117 168/68/117 165/69/136 

v 0.365064 0.906049 -0.642564
vn -0.980519 -0.0866661 -0.176273
f 164/71/110 161/72/110 208/73/137 207/30/137 

vn -0.961964 -0.139293 -0.234994
f 208/73/138 161/72/107 160/80/107 158/81/138 

vn -0.96702 -0.170847 -0.188902
v 0.360095 0.863413 -0.579416
f 159/83/139 209/82/139 208/73/138 158/81/138 

v 0.402877 0.757123 -0.526413
vn -0.972313 -0.190759 -0.134973
v 0.354307 0.836612 -0.50588
f 210/85/140 211/84/140 209/82/139 159/83/139 

v 0.394762 0.745178 -0.423292
vn -0.974513 -0.197479 -0.106426
f 212/87/141 204/86/141 211/84/140 210/85/140 

v 0.386646 0.757123 -0.320171
vn -0.981457 -0.190759 -0.0187925
vn -0.979164 -0.197479 -0.0473318
f 213/89/142 202/88/142 204/86/143 212/87/143 

v 0.379083 0.792146 -0.224078
vn -0.984665 -0.170847 0.035301
f 214/91/144 201/90/144 202/88/142 213/89/142 

v 0.372589 0.84786 -0.141561
vn -0.986882 -0.139293 0.0816161
f 215/92/145 199/38/145 201/90/144 214/91/144 

v 0.367606 0.920467 -0.0782434
vn -0.988247 -0.0983524 0.117024
f 215/92/145 216/93/146 200/37/146 199/38/145 

vn -0.990694 0.0278957 -0.133221
vn -0.991602 0.039455 -0.123159
f 216/93/147 215/92/148 134/130/148 135/131/147 

vn -0.992752 0.048328 -0.110038
f 215/92/148 214/91/149 133/129/149 134/130/148 

vn -0.99404 0.0539074 -0.0947503
f 214/91/149 213/89/150 132/128/150 133/129/149 

vn -0.994671 0.0558089 -0.0866842
f 213/89/150 212/87/151 131/127/151 132/128/150 

vn -0.996624 0.0539074 -0.0619184
vn -0.995986 0.0558089 -0.0699839
f 210/85/152 129/125/152 131/127/153 212/87/153 

f 159/83/105 130/126/105 129/125/152 210/85/152 

v 0.364473 1.00502 -0.0384403
vn -0.990111 0.0144386 -0.139543
f 217/94/154 216/93/147 135/131/147 136/132/154 

vn -0.988956 -0.050857 0.13921
v 0.324918 1.02632 -0.13245
f 216/93/146 217/94/155 218/40/155 200/37/146 

v 0.363405 1.09576 -0.0248642
vn -0.989172 2.18649e-09 0.146762
v 0.3241 1.09576 -0.122061
f 217/94/155 219/95/156 220/42/156 218/40/155 

vn -0.98991 -2.11193e-09 -0.141699
f 219/95/157 217/94/154 136/132/154 137/133/157 

vn -0.990111 -0.0144386 -0.139543
v 0.364473 1.18649 -0.0384403
f 138/134/158 221/96/158 219/95/157 137/133/157 

vn -0.990694 -0.0278957 -0.133221
v 0.367606 1.27105 -0.0782434
f 139/135/159 222/97/159 221/96/158 138/134/158 

vn -0.991602 -0.039455 -0.123159
v 0.372589 1.34365 -0.141561
f 140/136/160 223/98/160 222/97/159 139/135/159 

vn -0.992752 -0.048328 -0.110038
v 0.379083 1.39937 -0.224078
f 141/137/161 224/99/161 223/98/160 140/136/160 

vn -0.99404 -0.0539074 -0.0947503
v 0.386646 1.43439 -0.320171
f 142/138/162 225/100/162 224/99/161 141/137/161 

vn -0.994671 -0.0558089 -0.0866842
v 0.394762 1.44634 -0.423292
f 143/139/163 226/58/163 225/100/162 142/138/162 

vn -0.995986 -0.0558089 -0.0699839
vn -0.996624 -0.0539074 -0.0619184
v 0.402877 1.43439 -0.526413
f 143/139/164 144/140/165 227/57/165 226/58/164 

vn -0.997743 -0.048328 -0.0466172
v 0.41044 1.39937 -0.622506
f 144/140/165 145/141/166 228/60/166 227/57/165 

f 145/141/166 146/142/94 149/62/94 228/60/166 

vn -0.961964 0.139293 -0.234994
v 0.365064 1.28546 -0.642564
v 0.360095 1.3281 -0.579417
vn -0.96702 0.170847 -0.188902
f 149/62/167 229/61/167 230/59/168 228/60/168 

f 169/63/115 229/61/167 149/62/167 148/64/115 

vn -0.980519 0.0866661 -0.176273
v 0.309915 1.19061 -0.538437
f 229/61/169 169/63/116 170/66/116 231/65/169 

vn -0.987155 0.0611398 -0.147606
f 172/11/118 187/12/170 231/65/170 170/66/118 

vn -0.989033 0.0749017 -0.12729
v 0.30743 1.21193 -0.506863
f 231/65/170 187/12/170 186/13/171 232/67/171 

vn -0.991102 0.0835591 -0.103605
v 0.304536 1.22533 -0.470095
f 232/67/171 186/13/171 185/14/172 233/56/172 

vn -0.992077 0.086506 -0.0911015
v 0.301431 1.2299 -0.430637
f 233/56/172 185/14/172 184/15/173 234/53/173 

vn -0.994115 0.086506 -0.0652152
vn -0.995108 0.0835591 -0.0527136
v 0.298326 1.22533 -0.39118
f 234/53/174 184/15/174 183/16/175 235/51/175 

vn -0.996769 0.0749017 -0.0289963
v 0.295432 1.21193 -0.354411
f 235/51/175 183/16/175 182/17/176 236/49/176 

vn -0.998092 0.0611398 -0.00863658
v 0.292947 1.19061 -0.322838
f 236/49/176 182/17/176 181/18/177 237/47/177 

v 0.29104 1.16283 -0.29861
vn -0.999041 0.0432203 0.00697777
f 238/45/178 237/47/177 181/18/177 180/19/178 

v 0.331128 1.28546 -0.211365
vn -0.996022 0.0866661 0.0207163
vn -0.997203 0.0612477 0.0428284
v 0.327315 1.2299 -0.16291
f 239/48/179 237/47/179 238/45/180 240/46/180 

v 0.336098 1.3281 -0.274513
vn -0.994311 0.106204 -0.00813678
f 241/50/181 236/49/181 237/47/179 239/48/179 

v 0.341886 1.3549 -0.34805
vn -0.992075 0.118504 -0.0417677
f 242/52/182 235/51/182 236/49/181 241/50/181 

v 0.348096 1.36404 -0.426965
vn -0.990661 0.122682 -0.0594972
f 243/54/183 234/53/183 235/51/182 242/52/182 

vn -0.987772 0.122682 -0.0962088
v 0.354307 1.3549 -0.50588
vn -0.986395 0.118504 -0.113941
f 243/54/184 244/55/185 233/56/185 234/53/184 

vn -0.972313 0.190759 -0.134973
vn -0.974513 0.197479 -0.106426
f 227/57/186 244/55/186 243/54/187 226/58/187 

f 228/60/168 230/59/168 244/55/186 227/57/186 

vn -0.983342 0.106204 -0.147508
f 244/55/185 230/59/188 232/67/188 233/56/185 

f 230/59/188 229/61/169 231/65/169 232/67/188 

vn -0.979164 0.197479 -0.0473318
vn -0.981457 0.190759 -0.0187925
f 226/58/189 243/54/189 242/52/190 225/100/190 

vn -0.984665 0.170847 0.035301
f 225/100/190 242/52/190 241/50/191 224/99/191 

vn -0.986882 0.139293 0.0816161
f 224/99/191 241/50/191 239/48/192 223/98/192 

vn -0.988247 0.0983524 0.117024
f 222/97/193 223/98/192 239/48/192 240/46/193 

vn -0.988956 0.050857 0.13921
v 0.324918 1.16519 -0.13245
f 221/96/194 222/97/193 240/46/193 245/44/194 

v 0.289842 1.13048 -0.28338
vn -0.997887 0.0316911 0.0567126
f 240/46/180 238/45/180 246/43/195 245/44/195 

vn -0.999609 0.0223679 0.0167884
f 246/43/196 238/45/178 180/19/178 179/20/196 

v 0.289433 1.09576 -0.278185
vn -0.999797 2.99563e-10 0.0201336
f 247/41/197 246/43/196 179/20/196 178/21/197 

vn -0.99811 9.15154e-10 0.061445
f 245/44/195 246/43/195 247/41/198 220/42/198 

v 0.289842 1.06104 -0.28338
vn -0.997887 -0.0316911 0.0567126
f 247/41/198 248/39/199 218/40/199 220/42/198 

vn -0.999609 -0.0223679 0.0167884
f 248/39/200 247/41/197 178/21/197 177/22/200 

f 198/36/123 248/39/200 177/22/200 176/23/123 

f 248/39/199 198/36/124 200/37/124 218/40/199 

f 219/95/156 221/96/194 245/44/194 220/42/156 

vn -0.986395 -0.118504 -0.113941
vn -0.987772 -0.122682 -0.0962088
f 205/31/201 211/84/201 204/86/202 203/32/202 

vn -0.983342 -0.106204 -0.147508
f 206/29/203 209/82/203 211/84/201 205/31/201 

f 207/30/137 208/73/137 209/82/203 206/29/203 

f 162/74/108 166/75/113 153/77/113 155/79/108 

f 67/63/35 80/76/52 82/78/52 68/64/35 

f 80/76/51 67/63/36 70/66/36 72/68/51 

vn 0.994311 0.106204 0.00813678
f 38/34/204 39/35/17 42/38/17 94/90/204 

vn 0.992075 0.118504 0.0417677
f 37/33/205 38/34/204 94/90/204 92/88/205 

vn 0.990661 0.122682 0.0594972
f 36/32/206 37/33/205 92/88/205 90/86/206 

vn 0.986395 0.118504 0.113941
vn 0.987772 0.122682 0.0962088
f 88/84/207 35/31/207 36/32/208 90/86/208 

vn 0.983342 0.106204 0.147508
f 86/82/209 33/29/209 35/31/207 88/84/207 

f 77/73/48 34/30/48 33/29/209 86/82/209 

vn 0.992077 -0.086506 0.0911015
f 18/14/40 60/56/40 57/53/210 19/15/210 

vn 0.994115 -0.086506 0.0652152
vn 0.995108 -0.0835591 0.0527136
f 19/15/211 57/53/211 55/51/212 20/16/212 

vn 0.996769 -0.0749017 0.0289963
f 20/16/212 55/51/212 53/49/213 21/17/213 

vn 0.998092 -0.0611398 0.00863658
f 21/17/213 53/49/213 51/47/214 22/18/214 

vn 0.999041 -0.0432203 -0.00697777
f 51/47/214 49/45/215 23/19/215 22/18/214 

vn 0.999609 -0.0223679 -0.0167884
f 49/45/215 47/43/216 24/20/216 23/19/215 

f 47/43/216 45/41/21 25/21/21 24/20/216 

g Mesh3 Group7 Group6 Group4 Group2 Group1 Model

usemtl zscrewthis__24__1
v 0.353085 0.956843 -0.47117
vt 0.181389 0.191769
v 0.35333 0.964791 -0.474289
vt 0.0856822 0.512177
v 0.353062 0.972643 -0.470873
vt 0.190501 0.828751
v 0.352404 0.976727 -0.462519
vt 0.446799 0.993361
v 0.351666 0.97513 -0.453137
vt 0.734652 0.928986
v 0.351192 0.9686 -0.447116
vt 0.91937 0.665746
v 0.351204 0.960193 -0.447274
vt 0.914521 0.326815
v 0.351697 0.953842 -0.453537
vt 0.722375 0.070782
v 0.35244 0.952519 -0.462974
vt 0.432838 0.017448
f 249/149/7 250/150/7 251/151/7 252/152/7 253/153/7 254/154/7 255/155/7 256/156/7 257/157/7 

vn 0.0750891 -0.289928 -0.954098
v 0.294772 0.956843 -0.475759
v 0.295018 0.964791 -0.478879
f 250/150/217 249/149/217 258/149/217 259/150/217 

vn 0.044276 -0.825556 -0.56258
v 0.294127 0.952519 -0.467563
f 249/149/218 257/157/218 260/157/218 258/149/218 

vn -0.0140209 -0.983903 0.178153
v 0.293384 0.953842 -0.458126
f 257/157/219 256/156/219 261/156/219 260/157/219 

vn -0.0624323 -0.60565 0.793278
v 0.292892 0.960193 -0.451863
f 256/156/220 255/155/220 262/155/220 261/156/220 

vn -0.0784508 -0.0145073 0.996812
v 0.292879 0.9686 -0.451705
f 255/155/221 254/154/221 263/154/221 262/155/221 

vn -0.0639239 0.579824 0.81223
v 0.293353 0.97513 -0.457726
f 254/154/222 253/153/222 264/153/222 263/154/222 

vn -0.0168952 0.97654 0.214674
v 0.294091 0.976727 -0.467108
f 253/153/223 252/152/223 265/152/223 264/153/223 

vn 0.041977 0.844841 -0.533368
v 0.294749 0.972643 -0.475462
f 252/152/224 251/151/224 266/151/224 265/152/224 

vn 0.0743775 0.318334 -0.945056
f 251/151/225 250/150/225 259/150/225 266/151/225 

f 262/155/119 263/154/119 264/153/119 265/152/119 266/151/119 259/150/119 258/149/119 260/157/119 261/156/119 

g Mesh4 Group8 Group6 Group4 Group2 Group1 Model

v 0.417088 0.783717 -0.40522
v 0.417334 0.791664 -0.40834
v 0.417065 0.799517 -0.404923
v 0.416408 0.8036 -0.396569
v 0.415669 0.802004 -0.387187
v 0.415195 0.795474 -0.381166
v 0.415208 0.787066 -0.381324
v 0.415701 0.780715 -0.387587
v 0.416443 0.779392 -0.397024
f 267/149/7 268/150/7 269/151/7 270/152/7 271/153/7 272/154/7 273/155/7 274/156/7 275/157/7 

v 0.36043 0.783717 -0.409679
v 0.360675 0.791664 -0.412799
f 268/150/217 267/149/217 276/149/217 277/150/217 

v 0.359785 0.779392 -0.401484
f 267/149/218 275/157/218 278/157/218 276/149/218 

v 0.359042 0.780715 -0.392046
f 275/157/219 274/156/219 279/156/219 278/157/219 

v 0.358549 0.787066 -0.385784
f 274/156/220 273/155/220 280/155/220 279/156/220 

v 0.358536 0.795474 -0.385626
f 273/155/221 272/154/221 281/154/221 280/155/221 

v 0.35901 0.802004 -0.391646
f 272/154/222 271/153/222 282/153/222 281/154/222 

v 0.359749 0.8036 -0.401029
f 271/153/223 270/152/223 283/152/223 282/153/223 

v 0.360406 0.799517 -0.409382
f 270/152/224 269/151/224 284/151/224 283/152/224 

f 269/151/225 268/150/225 277/150/225 284/151/225 

f 280/155/119 281/154/119 282/153/119 283/152/119 284/151/119 277/150/119 276/149/119 278/157/119 279/156/119 

g Mesh5 Group9 Group6 Group4 Group2 Group1 Model

v 0.348321 0.956843 -0.410632
v 0.348566 0.964791 -0.413752
v 0.348297 0.972643 -0.410335
v 0.34764 0.976727 -0.401982
v 0.346901 0.97513 -0.392599
v 0.346428 0.9686 -0.386579
v 0.34644 0.960193 -0.386737
v 0.346933 0.953842 -0.392999
v 0.347676 0.952519 -0.402437
f 285/149/7 286/150/7 287/151/7 288/152/7 289/153/7 290/154/7 291/155/7 292/156/7 293/157/7 

v 0.290008 0.956843 -0.415222
v 0.290253 0.964791 -0.418341
f 286/150/217 285/149/217 294/149/217 295/150/217 

v 0.289363 0.952519 -0.407026
f 285/149/218 293/157/218 296/157/218 294/149/218 

v 0.28862 0.953842 -0.397589
f 293/157/219 292/156/219 297/156/219 296/157/219 

v 0.288127 0.960193 -0.391326
f 292/156/220 291/155/220 298/155/220 297/156/220 

v 0.288115 0.9686 -0.391168
f 291/155/221 290/154/221 299/154/221 298/155/221 

v 0.288589 0.97513 -0.397189
f 290/154/222 289/153/222 300/153/222 299/154/222 

v 0.289327 0.976727 -0.406571
f 289/153/223 288/152/223 301/152/223 300/153/223 

v 0.289984 0.972643 -0.414925
f 288/152/224 287/151/224 302/151/224 301/152/224 

f 287/151/225 286/150/225 295/150/225 302/151/225 

f 298/155/119 299/154/119 300/153/119 301/152/119 302/151/119 295/150/119 294/149/119 296/157/119 297/156/119 

g Mesh6 Group10 Group6 Group4 Group2 Group1 Model

v 0.421853 0.783717 -0.465758
v 0.422098 0.791664 -0.468877
v 0.42183 0.799517 -0.465461
v 0.421172 0.8036 -0.457107
v 0.420434 0.802004 -0.447725
v 0.41996 0.795474 -0.441704
v 0.419972 0.787066 -0.441862
v 0.420465 0.780715 -0.448125
v 0.421208 0.779392 -0.457562
f 303/149/7 304/150/7 305/151/7 306/152/7 307/153/7 308/154/7 309/155/7 310/156/7 311/157/7 

v 0.365194 0.783717 -0.470217
v 0.365439 0.791664 -0.473336
f 304/150/217 303/149/217 312/149/217 313/150/217 

v 0.364549 0.779392 -0.462021
f 303/149/218 311/157/218 314/157/218 312/149/218 

v 0.363806 0.780715 -0.452584
f 311/157/219 310/156/219 315/156/219 314/157/219 

v 0.363313 0.787066 -0.446321
f 310/156/220 309/155/220 316/155/220 315/156/220 

v 0.363301 0.795474 -0.446163
f 309/155/221 308/154/221 317/154/221 316/155/221 

v 0.363775 0.802004 -0.452184
f 308/154/222 307/153/222 318/153/222 317/154/222 

v 0.364513 0.8036 -0.461566
f 307/153/223 306/152/223 319/152/223 318/153/223 

v 0.365171 0.799517 -0.46992
f 306/152/224 305/151/224 320/151/224 319/152/224 

f 305/151/225 304/150/225 313/150/225 320/151/225 

f 316/155/119 317/154/119 318/153/119 319/152/119 320/151/119 313/150/119 312/149/119 314/157/119 315/156/119 

g Mesh7 Group11 Group2 Group1 Model

usemtl matchpole62k_2
v 0.386775 0.814519 -0.471556
v 0.329345 0.807187 -0.476076
v 0.371448 0.724233 -0.472762
v 0.428877 0.731565 -0.468243
f 321/1/1 322/2/1 323/3/1 324/4/1 

v 0.387636 0.814519 -0.4825
v 0.330207 0.807187 -0.48702
f 325/1/2 326/2/2 322/2/2 321/1/2 

v 0.429738 0.731565 -0.479187
v 0.372309 0.724233 -0.483707
f 326/2/3 325/1/3 327/4/3 328/3/3 

f 325/1/4 321/1/4 324/4/4 327/4/4 

f 328/3/5 327/4/5 324/4/5 323/3/5 

f 322/2/6 326/2/6 328/3/6 323/3/6 

g Mesh8 Group12 Group2 Group1 Model

v 0.421114 0.721935 -0.369609
vt 0.378941 0.044728
vn 4.96271e-13 -1 1.49012e-08
v 0.380817 0.721935 -0.37278
v 0.388633 0.721935 -0.47209
vt 1.00727 0.969766
v 0.42893 0.721935 -0.468918
vt 1.00727 0.044728
f 329/158/226 330/2/226 331/159/226 332/160/226 

v 0.421114 0.731565 -0.369609
v 0.380817 0.731565 -0.37278
f 333/158/1 334/2/1 330/2/1 329/158/1 

vn -4.96271e-13 1 -1.49012e-08
v 0.42893 0.731565 -0.468918
v 0.388633 0.731565 -0.47209
f 334/2/227 333/158/227 335/160/227 336/159/227 

vn 0.996917 1.1696e-09 0.0784591
vt 1.00727 -0.390584
f 333/1/228 329/1/228 332/161/228 335/161/228 

vt 0.994452 0.044728
f 336/3/3 335/162/3 332/162/3 331/3/3 

vn -0.996917 -1.1696e-09 -0.0784591
f 330/2/229 334/2/229 336/159/229 331/159/229 

g Mesh9 Group13 Group2 Group1 Model

v 0.388176 0.833149 -0.53276
vt 0.847076 0.288904
v 0.357789 0.848562 -0.535151
vt 0.819202 0.969766
v 0.330472 0.825505 -0.537301
vt 0.955982 0.969766
v 0.382193 0.810091 -0.533231
vt 0.955982 -0.00968596
f 337/163/1 338/164/1 339/165/1 340/166/1 

vn 0.89367 0.443179 0.0703333
vt 0.406815 0.288904
v 0.390095 0.833149 -0.557141
v 0.359708 0.848562 -0.559533
f 338/2/230 337/167/230 341/167/230 342/2/230 

vt 0.847076 -0.0919942
vn 0.994813 -0.0649347 0.0782935
vt 0.955982 -0.390584
v 0.384111 0.810091 -0.557612
f 341/168/231 337/168/231 340/169/231 343/169/231 

vt 0.994452 -0.00968596
vn -0.762788 -0.643856 -0.0600327
v 0.332391 0.825505 -0.561683
f 340/170/232 339/3/232 344/3/232 343/170/232 

vn -0.955634 0.284793 -0.07521
f 338/164/233 342/164/233 344/165/233 339/165/233 

f 342/164/3 341/163/3 343/166/3 344/165/3 

g Mesh10 Group13 Group2 Group1 Model

v 0.340533 0.848562 -0.315892
v 0.37092 0.833149 -0.3135
v 0.364936 0.810091 -0.313971
v 0.313216 0.825505 -0.318041
f 345/164/3 346/163/3 347/166/3 348/165/3 

v 0.338614 0.848562 -0.29151
v 0.369001 0.833149 -0.289118
f 346/167/230 345/2/230 349/2/230 350/167/230 

v 0.311297 0.825505 -0.29366
f 349/164/233 345/164/233 348/165/233 351/165/233 

v 0.363018 0.810091 -0.289589
f 348/3/232 347/170/232 352/170/232 351/3/232 

f 346/168/231 350/168/231 352/169/231 347/169/231 

f 350/163/1 349/164/1 351/165/1 352/166/1 

g Mesh11 Group14 Group2 Group1 Model

usemtl matchpole54k_4
v 0.151392 1.01304 -0.460094
vt 0.36137 0.630857
v 0.107163 0.992582 -0.463575
vt 0.310954 0.0565287
v 0.107163 1.09773 -0.463575
vt 0.57011 0.0565287
v 0.151392 1.04228 -0.460094
vt 0.433452 0.630857
f 353/171/3 354/172/3 355/173/3 356/174/3 

v 0.148734 1.01304 -0.426327
vt 0.76086 0.225373
vn 0.304001 -0.952371 0.0239254
v 0.104506 0.992582 -0.429808
vt 0.667306 0.225373
vt 0.667306 0.996382
vt 0.76086 0.996382
f 357/175/234 358/176/234 354/177/234 353/178/234 

v 0.148734 1.04228 -0.426327
v 0.104506 1.09773 -0.429808
f 359/174/1 360/173/1 358/172/1 357/171/1 

vt 1.14821 0.225373
vn 0.653452 0.755219 0.0514277
vt 0.89462 0.225373
vt 0.89462 0.996382
vt 1.14821 0.996382
f 360/179/235 359/180/235 356/181/235 355/182/235 

vn 0.996917 -7.77123e-09 0.0784591
f 359/174/236 357/171/236 353/171/236 356/174/236 

vn -0.996917 7.77123e-09 -0.0784591
f 358/176/237 360/179/237 355/182/237 354/177/237 

g Mesh12 Group15 Group2 Group1 Model

usemtl matchpole64k_1
v 0.157706 1.0363 -0.437084
vt 1.29894 0.653269
vn 0.943497 -0.322955 0.0742548
v 0.158467 1.0363 -0.446754
vt 1.29894 0.367968
v 0.293172 1.09775 -0.436152
vt 0.533504 0.367968
v 0.292411 1.09775 -0.426482
vt 0.533504 0.653269
f 361/183/238 362/184/238 363/185/238 364/186/238 

v 0.14682 1.03991 -0.433662
vt 1.25395 0.778714
vn -0.907481 -0.413977 -0.0714203
v 0.146088 1.0404 -0.442863
vt 1.24778 0.510618
v 0.14825 1.03991 -0.451836
vt 1.25395 0.242523
v 0.152295 1.03865 -0.456382
vt 1.26957 0.0998722
v 0.15633 1.03723 -0.454375
vt 1.28734 0.149414
v 0.154403 1.03723 -0.42989
vt 1.28734 0.871822
v 0.150104 1.03865 -0.428539
vt 1.26957 0.921364
f 365/187/239 366/188/239 367/189/239 368/190/239 369/191/239 362/184/239 361/183/239 370/192/239 371/193/239 

v 0.281524 1.10136 -0.423061
vt 0.488514 0.778714
vn -0.789892 0.253766 0.558277
v 0.280792 1.10185 -0.432262
vt 0.482343 0.510618
f 372/194/240 373/195/240 366/188/240 365/187/240 

vn 0.907481 0.413977 0.0714203
v 0.291035 1.09868 -0.443774
vt 0.521906 0.149414
v 0.287 1.1001 -0.445781
vt 0.504138 0.0998722
v 0.282955 1.10136 -0.441234
vt 0.488514 0.242523
v 0.284808 1.1001 -0.417938
vt 0.504138 0.921364
v 0.289108 1.09868 -0.419289
vt 0.521906 0.871822
f 364/186/241 363/185/241 374/196/241 375/197/241 376/198/241 373/195/241 372/194/241 377/199/241 378/200/241 

vn 0.524064 -0.155864 -0.837295
f 369/191/242 374/196/242 363/185/242 362/184/242 

vn 0.154868 -0.0262433 -0.987587
f 368/190/243 375/197/243 374/196/243 369/191/243 

vn -0.167543 0.0832969 -0.98234
f 367/189/244 376/198/244 375/197/244 368/190/244 

vn -0.692834 0.253766 -0.67497
f 373/195/245 376/198/245 367/189/245 366/188/245 

vn -0.319152 0.083297 0.944036
f 377/199/246 372/194/246 365/187/246 371/193/246 

vn -0.00153128 -0.0262433 0.999654
f 378/200/247 377/199/247 371/193/247 370/192/247 

vn 0.386631 -0.155864 0.908968
f 364/186/248 378/200/248 370/192/248 361/183/248 

g Mesh13 Group16 Group2 Group1 Model

usemtl matchpole54k_4
v 0.0793636 0.972731 -0.429687
vt 0.576518 0.225373
v 0.0793636 1.00344 -0.429687
vt 0.716958 0.225373
v 0.0823495 1.00344 -0.467627
vt 0.716958 0.996382
v 0.0823495 0.972731 -0.467627
vt 0.576518 0.996382
f 379/201/237 380/202/237 381/203/237 382/204/237 

v 0.0859114 1.08771 -0.429172
vt 0.611568 0.0876882
v 0.0859114 1.1141 -0.429172
vt 0.676617 0.0876882
v 0.14857 1.04228 -0.42424
vt 0.499614 0.90134
v 0.14857 1.01304 -0.42424
vt 0.427532 0.90134
v 0.0870675 0.987032 -0.429081
vt 0.363438 0.1027
v 0.0870675 1.00344 -0.429081
vt 0.403874 0.1027
vt 0.403874 0.00266162
vt 0.328192 0.00266162
v 0.154091 1.00712 -0.423806
vt 0.412945 0.973032
v 0.154091 1.04564 -0.423806
vt 0.507882 0.973032
v 0.0793636 1.13323 -0.429687
vt 0.723761 0.00266162
v 0.0793636 1.08771 -0.429687
vt 0.611568 0.00266162
f 383/205/1 384/206/1 385/207/1 386/208/1 387/209/1 388/210/1 380/211/1 379/212/1 389/213/1 390/214/1 391/215/1 392/216/1 

vt 1.22308 0.225373
vt 1.10237 0.225373
v 0.0888974 1.08771 -0.467112
vt 1.10237 0.996382
v 0.0888974 1.1141 -0.467112
vt 1.22308 0.996382
f 384/217/236 383/218/236 393/219/236 394/220/236 

vn -2.47586e-08 -1 1.29526e-08
v 0.0823495 1.08771 -0.467627
f 383/205/249 392/216/249 395/216/249 393/205/249 

vt 1.31056 0.225373
v 0.0823495 1.13323 -0.467627
vt 1.31056 0.996382
f 392/218/237 391/221/237 396/222/237 395/219/237 

vn 0.628173 0.776502 0.0494382
vt 0.909962 0.225373
v 0.157077 1.04564 -0.461746
vt 0.909962 0.996382
f 391/221/250 390/223/250 397/224/250 396/222/250 

vt 0.733791 0.225373
v 0.157077 1.00712 -0.461746
vt 0.733791 0.996382
f 390/223/236 389/225/236 398/226/236 397/224/236 

vn 0.302615 -0.952815 0.0238163
f 389/225/251 379/201/251 382/204/251 398/226/251 

v 0.0900534 1.00344 -0.467021
v 0.0900534 0.987032 -0.467021
v 0.151556 1.01304 -0.46218
v 0.151556 1.04228 -0.46218
f 397/214/3 398/213/3 382/212/3 381/211/3 399/210/3 400/209/3 401/208/3 402/207/3 394/206/3 393/205/3 395/216/3 396/215/3 

vn 2.47586e-08 1 -1.29526e-08
f 380/211/252 388/210/252 399/210/252 381/211/252 

vt 0.641922 0.225373
vt 0.641922 0.996382
f 388/202/236 387/227/236 400/228/236 399/203/236 

vn -0.280079 0.959724 -0.0220427
f 387/227/253 386/175/253 401/178/253 400/228/253 

f 386/208/237 385/207/237 402/207/237 401/208/237 

vn -0.619669 -0.783346 -0.048769
f 385/180/254 384/217/254 394/220/254 402/181/254 

g Mesh14 Group1 Model

usemtl Color_M04
v 0.0185831 2.16283 -0.415761
vt 16.772 0.731616
vn -4.75244e-12 1 -1.8497e-12
v 0.0302869 2.16283 -0.408166
vt 17.0711 1.1924
v 0.0435577 2.16283 -0.403859
vt 17.2406 1.71487
v 0.0574911 2.16283 -0.403133
vt 17.2692 2.26343
v 0.0711375 2.16283 -0.406039
vt 17.1548 2.80069
v 0.083567 2.16283 -0.412377
vt 16.9053 3.29004
v 0.0907996 2.16283 -0.418894
vt 16.6487 3.57479
v 0.0939324 2.16283 -0.421717
vt 16.5376 3.69813
v 0.101527 2.16283 -0.43342
vt 16.0768 3.99714
v 0.105834 2.16283 -0.446691
vt 15.5543 4.16671
v 0.106341 2.16283 -0.456413
vt 15.1716 4.18664
v 0.10656 2.16283 -0.460625
vt 15.0058 4.19528
v 0.103655 2.16283 -0.474271
vt 14.4685 4.08089
v 0.0973163 2.16283 -0.4867
vt 13.9792 3.83135
v 0.0907996 2.16283 -0.493933
vt 13.6944 3.57479
v 0.087977 2.16283 -0.497066
vt 13.5711 3.46366
v 0.0762731 2.16283 -0.504661
vt 13.2721 3.00288
v 0.0630023 2.16283 -0.508968
vt 13.1025 2.48041
v 0.05328 2.16283 -0.509474
vt 13.0826 2.09764
v 0.0490689 2.16283 -0.509694
vt 13.0739 1.93185
v 0.0354225 2.16283 -0.506788
vt 13.1883 1.39459
v 0.0229931 2.16283 -0.50045
vt 13.4378 0.90524
v 0.0126277 2.16283 -0.49111
vt 13.8055 0.497152
v 0.00503262 2.16283 -0.479407
vt 14.2663 0.198135
v 0.000725559 2.16283 -0.466136
vt 14.7888 0.0285653
v -3.06821e-16 2.16283 -0.452202
vt 15.3373 4.04674e-10
v 0.00290539 2.16283 -0.438556
vt 15.8746 0.114385
v 0.00924372 2.16283 -0.426127
vt 16.364 0.363926
f 403/229/255 404/230/255 405/231/255 406/232/255 407/233/255 408/234/255 409/235/255 410/236/255 411/237/255 412/238/255 413/239/255 414/240/255 415/241/255 416/242/255 417/243/255 418/244/255 419/245/255 420/246/255 421/247/255 422/248/255 423/249/255 424/250/255 425/251/255 426/252/255 427/253/255 428/254/255 429/255/255 430/256/255 

vt 9.74374 85.1507
vn -0.649194 0 0.760622
v 0.0185831 0 -0.415761
vt 9.74374 0
v 0.0302869 0 -0.408166
vt 10.293 0
vn -0.43021 -1.12999e-30 0.902729
vt 10.293 85.1507
f 403/257/256 431/258/256 432/259/257 404/260/257 

vt 12.4007 85.1507
vn -0.823937 3.70878e-20 0.566681
v 0.00924372 0 -0.426127
vt 12.4007 0
vt 12.95 0
vt 12.95 85.1507
f 430/261/258 433/262/258 431/263/256 403/264/256 

vt 14.1939 85.1507
vn -0.94253 3.70878e-20 0.334121
v 0.00290539 0 -0.438556
vt 14.1939 -5.22858e-19
vt 14.7432 -5.22858e-19
vt 14.7432 85.1507
f 429/265/259 434/266/259 433/267/258 430/268/258 

vt 15.0011 85.1507
vn -0.996891 0 0.0787915
v -3.06821e-16 0 -0.452202
vt 15.0011 0
vt 15.5504 0
vt 15.5504 85.1507
f 428/269/260 435/270/260 434/271/259 429/272/259 

vt 14.7673 85.1507
vn -0.983316 3.66739e-31 -0.181908
v 0.000725559 0 -0.466136
vt 14.7673 0
vt 15.3166 0
vt 15.3166 85.1507
f 427/273/261 436/274/261 435/275/260 428/276/260 

vt 13.5084 85.1507
vn -0.902729 3.66739e-31 -0.43021
v 0.00503262 0 -0.479407
vt 13.5084 3.33966e-30
vt 14.0577 3.33966e-30
vt 14.0577 85.1507
f 426/277/262 437/278/262 436/279/261 427/280/261 

vt 11.3102 85.1507
vn -0.760622 0 -0.649194
v 0.0126277 0 -0.49111
vt 11.3102 0
vt 11.8595 0
vt 11.8595 85.1507
f 425/281/263 438/282/263 437/283/262 426/284/262 

vt 8.32248 85.1507
vn -0.566681 0 -0.823937
v 0.0229931 0 -0.50045
vt 8.32248 0
vt 8.87178 0
vt 8.87178 85.1507
f 424/285/264 439/286/264 438/287/263 425/288/263 

vt 5.29821 85.1507
vt 4.74891 85.1507
vn -0.334121 0 -0.94253
v 0.0354225 0 -0.506788
vt 4.74891 0
vt 5.29821 0
f 424/289/264 423/290/265 440/291/265 439/292/264 

vt 1.38229 0
vt 1.38229 85.1507
vt 0.832986 85.1507
vn -0.0787915 -4.91872e-15 -0.996891
v 0.0490689 0 -0.509694
vt 0.832986 0
f 440/293/265 423/294/265 422/295/266 441/296/266 

vt -3.15842 85.1507
vn 0.181908 -4.91872e-15 -0.983316
v 0.0630023 0 -0.508968
vt -3.15842 -1.26361e-13
vt -2.60912 -1.26361e-13
vt -2.60912 85.1507
vt -2.77513 85.1507
vn 0.052003 -9.75328e-15 -0.998647
f 420/297/267 442/298/267 441/299/266 422/300/266 421/301/268 

vt -6.9533 85.1507
vn 0.43021 3.00365e-18 -0.902729
v 0.0762731 0 -0.504661
vt -6.9533 2.62085e-29
vt -6.404 2.62085e-29
vt -6.404 85.1507
f 419/302/269 443/303/269 442/304/267 420/305/267 

vt -10.293 85.1507
vn 0.649194 -2.08412e-15 -0.760622
v 0.087977 0.294496 -0.497066
vt -10.293 11.5943
vn 0.681917 -1.16762e-18 -0.731429
v 0.087977 0 -0.497066
vt -10.293 5.6573e-17
vn 0.649194 2.08537e-15 -0.760622
vt -9.74374 5.6573e-17
vt -9.74374 85.1507
f 418/306/270 444/307/271 445/308/272 443/309/269 419/310/269 

vt -12.5668 85.1507
vn 0.742922 -4.94185e-15 -0.669378
v 0.0907996 0.29471 -0.493933
vt -12.5668 11.6028
vn 0.742922 -1.9182e-15 -0.669378
vt -12.4007 11.5943
vt -12.4007 85.1507
f 417/311/273 446/312/274 444/313/271 418/314/270 

v 0.0907996 0.210815 -0.493933
vt -12.5668 8.2998
vn 0.742922 1.59596e-15 -0.669378
vt -12.95 85.1507
vn 0.823937 -2.91482e-15 -0.566681
v 0.0973163 0.211309 -0.4867
vt -12.95 8.31924
vn 0.798301 2.09656e-16 -0.602259
f 447/315/275 446/312/274 417/311/273 416/316/276 448/317/277 

v 0.0907996 0 -0.493933
vt -12.5668 2.68844e-14
vn 0.742922 5.26653e-15 -0.669378
vt -12.4007 2.68844e-14
f 446/312/274 447/315/275 449/318/278 445/319/272 444/313/271 

vt -12.5668 4.16958e-14
v 0.0973163 0 -0.4867
vt -12.95 4.16958e-14
vn 0.823937 3.21216e-15 -0.566681
f 449/320/278 447/315/275 448/317/277 450/321/279 

vt -14.7432 85.1507
vn 0.94253 -1.7448e-17 -0.334121
v 0.103655 0 -0.474271
vt -14.7432 -1.01626e-16
vt -14.1939 -1.01626e-16
vt -14.1939 8.31924
vt -14.1939 85.1507
f 415/322/280 451/323/280 450/324/279 448/325/277 416/326/276 

v 0.10656 0 -0.460625
vt -15.5504 0
vn 0.996891 6.47907e-13 -0.0787915
vt -15.0011 0
vt -15.0011 85.1507
vt -15.5504 85.1507
f 452/327/281 451/328/280 415/329/280 414/330/281 

usemtl _Color_001_1
vt -13.5711 3.46366
vn 0 -1 0
vt -13.6944 3.57479
vt -13.9792 3.83135
vt -14.4685 4.08089
vt -15.0058 4.19528
v 0.105834 0 -0.446691
vt -15.5543 4.16671
v 0.101527 0 -0.43342
vt -16.0768 3.99714
v 0.0939324 0 -0.421717
vt -16.5376 3.69813
v 0.083567 0 -0.412377
vt -16.9053 3.29004
v 0.0711375 0 -0.406039
vt -17.1548 2.80069
v 0.0574911 0 -0.403133
vt -17.2692 2.26343
v 0.0435577 0 -0.403859
vt -17.2406 1.71487
vt -17.0711 1.1924
vt -16.772 0.731616
vt -16.364 0.363926
vt -15.8746 0.114385
vt -15.3373 0
vt -14.7888 0.0285653
vt -14.2663 0.198135
vt -13.8055 0.497152
vt -13.4378 0.90524
vt -13.1883 1.39459
vt -13.0739 1.93185
vt -13.1025 2.48041
vt -13.2721 3.00288
f 445/331/282 449/332/282 450/333/282 451/334/282 452/335/282 453/336/282 454/337/282 455/338/282 456/339/282 457/340/282 458/341/282 459/342/282 432/343/282 431/344/282 433/345/282 434/346/282 435/347/282 436/348/282 437/349/282 438/350/282 439/351/282 440/352/282 441/353/282 442/354/282 443/355/282 

usemtl Color_M04
vt -14.9333 85.1507
vn 0.998647 1.28473e-12 0.052003
vt -15.3166 85.1507
vt -15.3166 -6.38503e-12
vt -14.7673 -6.38503e-12
vt -14.7673 85.1507
f 413/356/283 412/357/283 453/358/283 452/359/281 414/360/281 

usemtl _Color_001_1
vt -13.5084 -3.10051e-11
vn 0.951159 3.53745e-12 0.3087
vt -13.5084 85.1507
vt -14.0577 85.1507
vt -14.0577 -3.10051e-11
f 453/361/284 412/362/284 411/363/284 454/364/284 

usemtl Color_M04
vt -11.3102 85.1507
vn 0.838852 1.36301e-12 0.544359
vt -11.8595 85.1507
vn 0.760622 6.98483e-13 0.649194
vt -11.8595 -1.64987e-11
vt -11.3102 -1.64987e-11
f 411/365/285 410/366/286 455/367/286 454/368/285 

vt -8.87178 85.1507
vn 0.566681 1.10955e-14 0.823937
vt -8.87178 -3.24771e-13
vt -8.32248 -3.24771e-13
vt -8.32248 85.1507
vt -8.4885 85.1507
vn 0.669378 2.20011e-14 0.742922
f 408/369/287 456/370/287 455/371/286 410/372/286 409/373/288 

vt -5.29821 85.1507
vn 0.334121 0 0.94253
vt -5.29821 0
vt -4.74891 0
vt -4.74891 85.1507
f 407/374/289 457/375/289 456/376/287 408/377/287 

vt -1.38229 85.1507
vn 0.0787915 0 0.996891
vt -1.38229 0
vt -0.832986 0
vt -0.832986 85.1507
f 406/378/290 458/379/290 457/380/289 407/381/289 

vt 2.60912 85.1507
vn -0.181908 -1.12999e-30 0.983316
vt 2.60912 0
vt 3.15842 0
vt 3.15842 85.1507
f 405/382/291 459/383/291 458/384/290 406/385/290 

vt 6.404 85.1507
vt 6.404 3.55572e-29
vt 6.9533 3.55572e-29
vt 6.9533 85.1507
f 404/386/257 432/387/257 459/388/291 405/389/291 

