<svg xmlns="http://www.w3.org/2000/svg" width="21.116" height="21.116" viewBox="0 0 21.116 21.116">
  <g id="facebook-color" transform="translate(0 0.362) rotate(-1)">
    <g id="Group_54" data-name="Group 54" transform="translate(0 0)">
      <path id="Path_40" data-name="Path 40" d="M11.087,20.757H1.146A1.146,1.146,0,0,1,0,19.611V1.146A1.146,1.146,0,0,1,1.146,0H19.611a1.146,1.146,0,0,1,1.146,1.146V19.611a1.146,1.146,0,0,1-1.146,1.146H14.322V12.719h2.7l.4-3.133h-3.1v-2c0-.907.252-1.525,1.552-1.525h1.659v-2.8a22.22,22.22,0,0,0-2.417-.123,3.775,3.775,0,0,0-4.029,4.141v2.31h-2.7v3.133h2.7v8.038Z" transform="translate(0 0)" fill="#4460a0"/>
    </g>
  </g>
</svg>
