<svg id="sort-downaya" xmlns="http://www.w3.org/2000/svg" width="10.142" height="5.705" viewBox="0 0 10.142 5.705">
  <path id="Path_4" data-name="Path 4" d="M9.953,64.141a.609.609,0,0,0-.446-.188H.634a.609.609,0,0,0-.446.188.622.622,0,0,0,0,.891L4.625,69.47a.622.622,0,0,0,.891,0l4.437-4.437a.622.622,0,0,0,0-.891Z" transform="translate(0 -63.953)" fill="#ff0003"/>
</svg>
