<svg id="Component_11_2" data-name="Component 11 – 2" xmlns="http://www.w3.org/2000/svg" width="20.846" height="24" viewBox="0 0 20.846 24">
  <path id="ic_notifications_none_24px" d="M13.846,26.5a2.469,2.469,0,0,0,2.462-2.462H11.385A2.469,2.469,0,0,0,13.846,26.5Zm7.385-7.385V12.962c0-3.778-2.006-6.942-5.538-7.778V4.346a1.846,1.846,0,1,0-3.692,0v.837c-3.52.837-5.538,3.988-5.538,7.778v6.154L4,21.577v1.231H23.692V21.577Zm-2.462,1.231H8.923V12.962c0-3.052,1.858-5.538,4.923-5.538s4.923,2.486,4.923,5.538Z" transform="translate(-4 -2.5)" fill="#001011" opacity="0.5"/>
  <circle id="ayo-ogunseinde-RrD8ypt8cjY-unsplash" cx="4" cy="4" r="4" transform="translate(12.846 3)" fill="red"/>
</svg>
