<svg id="linkedin-color" xmlns="http://www.w3.org/2000/svg" width="19.591" height="17.81" viewBox="0 0 19.591 17.81">
  <g id="Group_50" data-name="Group 50" transform="translate(0 0)">
    <path id="Path_36" data-name="Path 36" d="M19.591,17.81h-4.33V11.549c0-1.639-.677-2.757-2.167-2.757a2.185,2.185,0,0,0-2.067,1.483,2.748,2.748,0,0,0-.093.989V17.81H6.644s.055-11.091,0-12.1h4.29v1.9c.253-.83,1.624-2.015,3.811-2.015,2.714,0,4.846,1.74,4.846,5.488V17.81ZM2.306,4.2H2.278A2.111,2.111,0,0,1,0,2.1,2.133,2.133,0,0,1,2.333,0a2.12,2.12,0,0,1,2.3,2.1A2.128,2.128,0,0,1,2.306,4.2ZM.494,5.711H4.313v12.1H.494V5.711Z" transform="translate(0 0)" fill="#007ebb"/>
  </g>
</svg>
