<svg id="linkedin-color" xmlns="http://www.w3.org/2000/svg" width="10.242" height="9.311" viewBox="0 0 10.242 9.311">
  <g id="linkedin-color-2" data-name="linkedin-color">
    <g id="Group_50" data-name="Group 50" transform="translate(0 0)">
      <path id="Path_36" data-name="Path 36" d="M10.242,9.311H7.978V6.037c0-.857-.354-1.442-1.133-1.442a1.142,1.142,0,0,0-1.081.775,1.437,1.437,0,0,0-.049.517V9.311H3.473s.029-5.8,0-6.325H5.716v.993A2.05,2.05,0,0,1,7.708,2.925c1.419,0,2.533.91,2.533,2.869V9.311ZM1.205,2.195H1.191A1.1,1.1,0,0,1,0,1.1,1.115,1.115,0,0,1,1.219,0a1.108,1.108,0,0,1,1.2,1.1,1.112,1.112,0,0,1-1.218,1.1Zm-.947.791h2V9.311h-2V2.986Z" transform="translate(0 0)" fill="#007ebb"/>
    </g>
  </g>
</svg>
