<svg id="instagram-color" xmlns="http://www.w3.org/2000/svg" xmlns:xlink="http://www.w3.org/1999/xlink" width="11.003" height="10.997" viewBox="0 0 11.003 10.997">
  <defs>
    <linearGradient id="linear-gradient" x1="0.326" y1="-0.08" x2="0.654" y2="1.016" gradientUnits="objectBoundingBox">
      <stop offset="0" stop-color="#4367dc"/>
      <stop offset="0.043" stop-color="#4c62d6"/>
      <stop offset="0.114" stop-color="#6654c7"/>
      <stop offset="0.205" stop-color="#8f3dae"/>
      <stop offset="0.234" stop-color="#9e35a5"/>
      <stop offset="0.451" stop-color="#d42f7f"/>
      <stop offset="0.824" stop-color="#d73578"/>
    </linearGradient>
    <linearGradient id="linear-gradient-2" x1="0.739" y1="0.099" x2="0.227" y2="0.959" gradientUnits="objectBoundingBox">
      <stop offset="0.33" stop-color="#d42f7f"/>
      <stop offset="1" stop-color="#f7772e"/>
    </linearGradient>
    <linearGradient id="linear-gradient-3" x1="0.624" y1="0.206" x2="0.301" y2="0.975" gradientUnits="objectBoundingBox">
      <stop offset="0" stop-color="#9e35a5" stop-opacity="0"/>
      <stop offset="0.451" stop-color="#d42f7f" stop-opacity="0.502"/>
      <stop offset="0.752" stop-color="#f7772e"/>
      <stop offset="1" stop-color="#fef780"/>
    </linearGradient>
  </defs>
  <path id="Path_33" data-name="Path 33" d="M10.963,3.231A4.059,4.059,0,0,0,10.707,1.9a2.711,2.711,0,0,0-.633-.974A2.671,2.671,0,0,0,9.1.289,4.059,4.059,0,0,0,7.765.033C7.177.006,6.99,0,5.5,0S3.816.006,3.231.033A4.059,4.059,0,0,0,1.9.289,2.711,2.711,0,0,0,.922.922,2.671,2.671,0,0,0,.289,1.9,4.059,4.059,0,0,0,.033,3.231C.006,3.819,0,4.006,0,5.5S.006,7.18.033,7.765A4.059,4.059,0,0,0,.289,9.1a2.711,2.711,0,0,0,.633.974,2.671,2.671,0,0,0,.974.633,4.059,4.059,0,0,0,1.335.256c.588.027.775.033,2.267.033s1.682-.006,2.267-.033A4.059,4.059,0,0,0,9.1,10.707a2.711,2.711,0,0,0,.974-.633,2.671,2.671,0,0,0,.633-.974,4.059,4.059,0,0,0,.256-1.335C10.991,7.177,11,6.99,11,5.5S10.991,3.816,10.963,3.231ZM9.975,7.72a3.027,3.027,0,0,1-.19,1.022,1.709,1.709,0,0,1-.413.633,1.747,1.747,0,0,1-.633.413,3.027,3.027,0,0,1-1.022.19c-.579.027-.754.033-2.222.033S3.852,10,3.274,9.978a3.027,3.027,0,0,1-1.022-.19,1.709,1.709,0,0,1-.633-.413,1.747,1.747,0,0,1-.413-.633,3.027,3.027,0,0,1-.19-1.022C.989,7.141.983,6.966.983,5.5s.006-1.643.033-2.222a3.027,3.027,0,0,1,.19-1.022,1.708,1.708,0,0,1,.413-.633,1.747,1.747,0,0,1,.633-.413,3.027,3.027,0,0,1,1.022-.19C3.852.992,4.027.986,5.5.986s1.643.006,2.222.033a3.027,3.027,0,0,1,1.022.19,1.709,1.709,0,0,1,.633.413,1.747,1.747,0,0,1,.413.633,3.027,3.027,0,0,1,.19,1.022c.027.579.033.754.033,2.222S10,7.141,9.975,7.72Z" transform="translate(0.006)" fill="url(#linear-gradient)"/>
  <path id="Path_34" data-name="Path 34" d="M2.824,0A2.825,2.825,0,1,0,5.649,2.825,2.824,2.824,0,0,0,2.824,0Zm0,4.657A1.833,1.833,0,1,1,4.657,2.825,1.832,1.832,0,0,1,2.824,4.657Z" transform="translate(2.677 2.674)" fill="url(#linear-gradient-2)"/>
  <ellipse id="Ellipse_1" data-name="Ellipse 1" cx="0.66" cy="0.66" rx="0.66" ry="0.66" transform="translate(7.777 1.902)" fill="#bc30a0"/>
  <path id="Path_35" data-name="Path 35" d="M0,5.5c0,1.5.006,1.682.033,2.267A4.059,4.059,0,0,0,.289,9.1a2.711,2.711,0,0,0,.633.974,2.671,2.671,0,0,0,.974.633,4.059,4.059,0,0,0,1.335.256c.588.027.775.033,2.267.033s1.682-.006,2.267-.033A4.059,4.059,0,0,0,9.1,10.707a2.711,2.711,0,0,0,.974-.633,2.671,2.671,0,0,0,.633-.974,4.059,4.059,0,0,0,.256-1.335C10.991,7.177,11,6.99,11,5.5s-.006-1.682-.033-2.267A4.059,4.059,0,0,0,10.707,1.9a2.711,2.711,0,0,0-.633-.974A2.671,2.671,0,0,0,9.1.289,4.059,4.059,0,0,0,7.765.033C7.177.006,6.99,0,5.5,0S3.816.006,3.231.033A4.059,4.059,0,0,0,1.9.289,2.711,2.711,0,0,0,.922.922,2.671,2.671,0,0,0,.289,1.9,4.059,4.059,0,0,0,.033,3.231C.006,3.816,0,4,0,5.5Zm.992,0c0-1.468.006-1.643.033-2.222a3.027,3.027,0,0,1,.19-1.022,1.709,1.709,0,0,1,.413-.633,1.747,1.747,0,0,1,.633-.413,3.027,3.027,0,0,1,1.022-.19C3.861.992,4.036.986,5.5.986s1.643.006,2.222.033a3.027,3.027,0,0,1,1.022.19,1.709,1.709,0,0,1,.633.413,1.747,1.747,0,0,1,.413.633,3.027,3.027,0,0,1,.19,1.022c.027.579.033.754.033,2.222s-.006,1.643-.033,2.222a3.027,3.027,0,0,1-.19,1.022,1.709,1.709,0,0,1-.413.633,1.747,1.747,0,0,1-.633.413,3.027,3.027,0,0,1-1.022.19c-.579.027-.754.033-2.222.033S3.861,10,3.283,9.978a3.027,3.027,0,0,1-1.022-.19,1.709,1.709,0,0,1-.633-.413,1.747,1.747,0,0,1-.413-.633,3.027,3.027,0,0,1-.19-1.022C1,7.141.992,6.966.992,5.5Z" fill="url(#linear-gradient-3)"/>
</svg>
