<svg id="Layer_1" xmlns="http://www.w3.org/2000/svg" width="15.431" height="31.192" viewBox="0 0 15.431 31.192">
  <g id="XMLID_643_">
    <path id="XMLID_235_" d="M759.081,488.4a.142.142,0,0,1,.2-.2c.044.03.092.065.148.11.193.145.364.281.507.4a.147.147,0,0,0,.228-.175,7.4,7.4,0,0,0-2.557-2.983.141.141,0,0,0-.21.169c.711,1.834,1.392,6.277.391,7.853-1.348,2.121-4.195.874-4.319-4.094-.03-1.182-.012-2.29.018-3.179l.036-.6a.143.143,0,0,1,.044-.095l.216-.2a.149.149,0,0,0,.042-.142l-1.218-4.316a.142.142,0,0,0-.273,0l-1.2,4.266a.146.146,0,0,0,.03.133l.228.255a.14.14,0,0,1,.036.089c.042.96.08,2.317.042,3.786-.124,4.968-2.971,6.215-4.319,4.094-1-1.579-.317-6.031.4-7.862a.141.141,0,0,0-.21-.169,7.305,7.305,0,0,0-2.568,3.013.142.142,0,0,0,.219.169c.092-.074.193-.157.308-.246a.141.141,0,0,1,.222.151,22.871,22.871,0,0,0-.533,9.3.141.141,0,0,0,.246.077,3.788,3.788,0,0,1,2.281-1.212,4.175,4.175,0,0,1,3.042.741.148.148,0,0,1,.059.1,9.223,9.223,0,0,1-.166,2.894.023.023,0,0,1,.012,0,1.2,1.2,0,0,1,.96,1.179v6.325a.142.142,0,0,0,.142.142h1.813a.142.142,0,0,0,.142-.142v-6.333a1.2,1.2,0,0,1,.96-1.179.022.022,0,0,0,.012,0,9.242,9.242,0,0,1-.213-2.059.141.141,0,0,0-.169-.139,4.147,4.147,0,0,0-.569.145.142.142,0,0,1-.145-.234,5.643,5.643,0,0,1,1.961-1.226,4.128,4.128,0,0,1,2.068-.219,3.782,3.782,0,0,1,2.284,1.212.141.141,0,0,0,.246-.077,23.305,23.305,0,0,0-.4-8.807.1.1,0,0,0-.018-.041C759.345,488.791,759.2,488.568,759.081,488.4Z" transform="translate(-744.751 -480.85)" fill="#b6b6b6"/>
    <g id="XMLID_725_" transform="translate(0.04 29.118)">
      <path id="XMLID_730_" d="M757.241,1465.874a5.355,5.355,0,0,1-1.973-.335,3.921,3.921,0,0,0-1.493-.258,3.864,3.864,0,0,0-1.493.258,5.982,5.982,0,0,1-3.946,0,3.933,3.933,0,0,0-1.481-.258.757.757,0,0,1-.755-.75.741.741,0,0,1,.741-.732,5.354,5.354,0,0,1,1.973.335,3.924,3.924,0,0,0,1.493.258,3.865,3.865,0,0,0,1.493-.258,5.982,5.982,0,0,1,3.946,0,3.924,3.924,0,0,0,1.493.258,3.865,3.865,0,0,0,1.493-.258,5.282,5.282,0,0,1,1.955-.335.751.751,0,0,1,.758.726.739.739,0,0,1-.741.755,3.865,3.865,0,0,0-1.493.258A5.359,5.359,0,0,1,757.241,1465.874Z" transform="translate(-746.099 -1463.8)" fill="#b6b6b6"/>
    </g>
    <g id="XMLID_734_" transform="translate(0.043 26.289)">
      <path id="XMLID_735_" d="M754.915,1368.383a5.967,5.967,0,0,0-1.049-.083,5.355,5.355,0,0,0-1.973.335,3.921,3.921,0,0,1-1.493.258,3.864,3.864,0,0,1-1.493-.258,5.283,5.283,0,0,0-1.955-.335.751.751,0,0,0-.758.726.739.739,0,0,0,.741.755,3.867,3.867,0,0,1,1.493.258,5.982,5.982,0,0,0,3.946,0,4.551,4.551,0,0,1,2.542-.139Z" transform="translate(-746.194 -1368.3)" fill="#b6b6b6"/>
      <path id="XMLID_741_" d="M1115.653,1368.3a5.408,5.408,0,0,0-1.955.335,3.924,3.924,0,0,1-1.493.258c-.109,0-.21,0-.305-.009v1.481c.1,0,.2.006.305.006a5.352,5.352,0,0,0,1.973-.335,3.923,3.923,0,0,1,1.493-.258.74.74,0,0,0,.741-.755A.749.749,0,0,0,1115.653,1368.3Z" transform="translate(-1101.066 -1368.3)" fill="#b6b6b6"/>
    </g>
    <path id="XMLID_1_" d="M1216.029,727.613c.492-3.632.222-8.25-.717-10.155l-.512-.258" transform="translate(-1200.876 -710.198)" fill="#b6b6b6"/>
  </g>
</svg>
