<svg id="user" xmlns="http://www.w3.org/2000/svg" width="21.333" height="24" viewBox="0 0 21.333 24">
  <g id="User-2" data-name="User">
    <g id="_2-user" data-name="2-user">
      <path id="Vector" d="M20,12.06H10.667a1.333,1.333,0,1,1,0-2.667h8V5.234a2.573,2.573,0,0,0-3-2.507L11.56,6.407a1.333,1.333,0,0,1-1.787,0L5.667,2.727a2.573,2.573,0,0,0-3,2.507v4.16H12a1.333,1.333,0,1,1,0,2.667H1.333A1.333,1.333,0,0,1,0,10.727V5.234A5.253,5.253,0,0,1,6.667.194a1.547,1.547,0,0,1,.52.293l3.48,3.12L14.133.487a1.547,1.547,0,0,1,.533-.293,5.253,5.253,0,0,1,6.667,5.04v5.493A1.333,1.333,0,0,1,20,12.06Z" transform="translate(0 11.94)" fill="#b6b6b6"/>
      <path id="Vector-2" data-name="Vector" d="M6.667,13.333a6.667,6.667,0,1,1,4.714-1.953,6.667,6.667,0,0,1-4.714,1.953Zm0-10.667A4,4,0,1,0,9.5,3.838,4,4,0,0,0,6.667,2.667Z" transform="translate(4)" fill="#b6b6b6"/>
    </g>
  </g>
</svg>
