<svg xmlns="http://www.w3.org/2000/svg" width="8.717" height="14" viewBox="0 0 8.717 14">
  <path id="arrow_simple_chock" d="M424.932,718.091a.867.867,0,0,1-.617-.256l-6.1-6.126a.881.881,0,0,1,.042-1.277l6.975-6.126a.874.874,0,1,1,1.145,1.321l-6.273,5.511,5.443,5.461a.881.881,0,0,1,0,1.233A.866.866,0,0,1,424.932,718.091Z" transform="translate(-417.959 -704.091)" fill="#081037"/>
</svg>
