<svg id="Checklistsuccess" xmlns="http://www.w3.org/2000/svg" xmlns:xlink="http://www.w3.org/1999/xlink" width="68.055" height="68.118" viewBox="0 0 68.055 68.118">
  <defs>
    <linearGradient id="linear-gradient" y1="0.5" x2="1" y2="0.5" gradientUnits="objectBoundingBox">
      <stop offset="0" stop-color="#9cb5ff"/>
      <stop offset="1" stop-color="#7966ff"/>
    </linearGradient>
    <linearGradient id="linear-gradient-2" x1="6.538" y1="-0.021" x2="7.532" y2="-0.021" xlink:href="#linear-gradient"/>
    <linearGradient id="linear-gradient-3" x1="1.037" y1="1.045" x2="0.012" y2="0.004" gradientUnits="objectBoundingBox">
      <stop offset="0" stop-color="#9c97ff"/>
      <stop offset="1" stop-color="#625aff"/>
    </linearGradient>
    <linearGradient id="linear-gradient-4" x1="0.146" y1="0.146" x2="0.854" y2="0.854" gradientUnits="objectBoundingBox">
      <stop offset="0" stop-color="#ff4e50"/>
      <stop offset="1" stop-color="#f9d423"/>
    </linearGradient>
  </defs>
  <g id="Group_8276" data-name="Group 8276">
    <g id="Group_8273" data-name="Group 8273">
      <path id="Path_43435" data-name="Path 43435" d="M226.481,79.266a34.029,34.029,0,1,0,15.374,28.462A33.841,33.841,0,0,0,226.481,79.266Z" transform="translate(-173.8 -73.7)" fill="#efecfa"/>
    </g>
    <g id="Group_8274" data-name="Group 8274" transform="translate(5.009 0)" opacity="0.1">
      <path id="Path_43436" data-name="Path 43436" d="M254.772,79.266c-3.731,10.771-13.118,24.6-36.269,14.652a75.222,75.222,0,0,0-11.4-3.971,34.039,34.039,0,0,1,47.672-10.681Z" transform="translate(-207.1 -73.7)" fill="url(#linear-gradient)"/>
    </g>
    <g id="Group_8275" data-name="Group 8275" transform="translate(14.441 44.571)" opacity="0.1">
      <path id="Path_43437" data-name="Path 43437" d="M269.8,387.379c4.062-10.651,13.885-24.159,36.705-13.509a74.45,74.45,0,0,0,11.267,4.332,34.056,34.056,0,0,1-47.972,9.176Z" transform="translate(-269.8 -369.987)" fill="url(#linear-gradient-2)"/>
    </g>
  </g>
  <g id="Group_8279" data-name="Group 8279" transform="translate(16.066 11.959)">
    <path id="Path_43438" data-name="Path 43438" d="M313.213,153.2H284.225a3.627,3.627,0,0,0-3.625,3.625V195.1a3.627,3.627,0,0,0,3.625,3.625h28.988a3.627,3.627,0,0,0,3.625-3.625v-38.27A3.627,3.627,0,0,0,313.213,153.2Zm0,41.9H284.225v-38.27h28.988Z" transform="translate(-280.6 -153.2)" fill="#fff"/>
    <g id="Group_8277" data-name="Group 8277" transform="translate(1.58 1.504)">
      <path id="Path_43439" data-name="Path 43439" d="M321.532,163.2H293.251a2.151,2.151,0,0,0-2.151,2.151V203.38a2.151,2.151,0,0,0,2.151,2.151h28.281a2.151,2.151,0,0,0,2.151-2.151V165.351A2.151,2.151,0,0,0,321.532,163.2Z" transform="translate(-291.1 -163.2)" fill="url(#linear-gradient-3)"/>
    </g>
    <path id="Path_43440" data-name="Path 43440" d="M324.893,162.6,308.3,205.277h14.11L339.018,162.6Z" transform="translate(-304.133 -161.186)" fill="#fff" opacity="0.05"/>
    <g id="Group_8278" data-name="Group 8278" transform="translate(7.236 13.689)">
      <path id="Path_43441" data-name="Path 43441" d="M343.517,314.3h-14.1a.722.722,0,0,0-.722.722h0a.722.722,0,0,0,.722.722h14.1a.722.722,0,0,0,.722-.722h0A.713.713,0,0,0,343.517,314.3Z" transform="translate(-328.7 -303.755)" fill="#fff"/>
      <path id="Path_43442" data-name="Path 43442" d="M343.517,349.3h-14.1a.722.722,0,0,0-.722.722h0a.722.722,0,0,0,.722.722h14.1a.722.722,0,0,0,.722-.722h0A.722.722,0,0,0,343.517,349.3Z" transform="translate(-328.7 -333.49)" fill="#fff"/>
      <path id="Path_43443" data-name="Path 43443" d="M343.517,280.3h-14.1a.722.722,0,0,0-.722.722.713.713,0,0,0,.722.722h14.1a.722.722,0,0,0,.722-.722A.713.713,0,0,0,343.517,280.3Z" transform="translate(-328.7 -274.869)" fill="#fff"/>
      <path id="Path_43444" data-name="Path 43444" d="M343.517,244.2h-14.1a.722.722,0,0,0-.722.722h0a.722.722,0,0,0,.722.722h14.1a.722.722,0,0,0,.722-.722h0A.713.713,0,0,0,343.517,244.2Z" transform="translate(-328.7 -244.2)" fill="#fff"/>
    </g>
  </g>
  <g id="Group_8282" data-name="Group 8282" transform="translate(43.414 25.287)">
    <circle id="Ellipse_1241" data-name="Ellipse 1241" cx="9.116" cy="9.116" r="9.116" fill="url(#linear-gradient-4)"/>
    <g id="Group_8281" data-name="Group 8281" transform="translate(4.117 5.962)">
      <g id="Group_8280" data-name="Group 8280">
        <path id="Path_43445" data-name="Path 43445" d="M493.321,288.184h-.03a.8.8,0,0,1-.526-.256l-2.813-3.174a.746.746,0,1,1,1.113-.993l2.3,2.6,5.024-4.724a.74.74,0,0,1,1.053.03.754.754,0,0,1-.03,1.053l-5.581,5.265A.754.754,0,0,1,493.321,288.184Z" transform="translate(-489.766 -281.435)" fill="#fff"/>
      </g>
    </g>
  </g>
</svg>
