<svg id="Component_31_1" data-name="Component 31 – 1" xmlns="http://www.w3.org/2000/svg" width="264.797" height="267.785" viewBox="0 0 264.797 267.785">
  <g id="Group_32178" data-name="Group 32178" transform="translate(-48.785 -45.261)">
    <path id="_7787567_wrong_delete_remove_trash_minus_icon" data-name="7787567_wrong_delete_remove_trash_minus_icon" d="M38.144,37.436l2.48-2.48a.5.5,0,1,0-.709-.709l-2.48,2.48-2.48-2.48a.5.5,0,1,0-.709.709l2.48,2.48-2.48,2.48a.5.5,0,1,0,.709.709l2.48-2.48,2.48,2.48a.5.5,0,1,0,.709-.709Z" transform="matrix(0.996, 0.087, -0.087, 0.996, 217.619, 39.944)" fill="#ff0003"/>
    <path id="_7787567_wrong_delete_remove_trash_minus_icon-2" data-name="7787567_wrong_delete_remove_trash_minus_icon" d="M35.748,35.459l1.011-1.011a.2.2,0,1,0-.289-.289L35.459,35.17,34.449,34.16a.2.2,0,1,0-.289.289l1.011,1.011L34.16,36.47a.2.2,0,1,0,.289.289l1.011-1.011,1.011,1.011a.2.2,0,1,0,.289-.289Z" transform="matrix(0.996, 0.087, -0.087, 0.996, 139.416, 79.085)" fill="#ff0003"/>
    <path id="_7787567_wrong_delete_remove_trash_minus_icon-3" data-name="7787567_wrong_delete_remove_trash_minus_icon" d="M35.487,35.244l.851-.851a.172.172,0,1,0-.243-.243L35.244,35l-.851-.851a.172.172,0,1,0-.243.243l.851.851-.851.851a.172.172,0,1,0,.243.243l.851-.851.851.851a.172.172,0,1,0,.243-.243Z" transform="matrix(0.996, 0.087, -0.087, 0.996, 139.611, 8.318)" fill="#ff0003"/>
    <path id="_7787567_wrong_delete_remove_trash_minus_icon-4" data-name="7787567_wrong_delete_remove_trash_minus_icon" d="M35.862,35.553l1.081-1.081a.218.218,0,1,0-.309-.309l-1.081,1.081-1.081-1.081a.218.218,0,1,0-.309.309l1.081,1.081-1.081,1.081a.218.218,0,1,0,.309.309l1.081-1.081,1.081,1.081a.218.218,0,1,0,.309-.309Z" transform="matrix(0.996, 0.087, -0.087, 0.996, 75.33, 49.983)" fill="#ff0003"/>
    <path id="_7787567_wrong_delete_remove_trash_minus_icon-5" data-name="7787567_wrong_delete_remove_trash_minus_icon" d="M36.263,35.884l1.327-1.327a.268.268,0,1,0-.379-.379l-1.327,1.327-1.327-1.327a.268.268,0,1,0-.379.379l1.327,1.327-1.327,1.327a.268.268,0,1,0,.379.379l1.327-1.327,1.327,1.327a.268.268,0,1,0,.379-.379Z" transform="matrix(0.996, 0.087, -0.087, 0.996, 279.029, 117.625)" fill="#ff0003"/>
  </g>
  <g id="Group_32179" data-name="Group 32179" transform="matrix(-0.995, 0.105, -0.105, -0.995, 362.311, 276.651)">
    <path id="_7787567_wrong_delete_remove_trash_minus_icon-6" data-name="7787567_wrong_delete_remove_trash_minus_icon" d="M4.672,3.854,7.538.988A.579.579,0,1,0,6.719.17L3.854,3.035.988.17A.579.579,0,1,0,.17.988L3.035,3.854.17,6.719a.579.579,0,1,0,.819.819L3.854,4.672,6.719,7.538a.579.579,0,1,0,.819-.819Z" transform="matrix(0.996, 0.087, -0.087, 0.996, 270.753, 81.798)" fill="#d5c3c3"/>
    <path id="_7787567_wrong_delete_remove_trash_minus_icon-7" data-name="7787567_wrong_delete_remove_trash_minus_icon" d="M1.9,1.57,3.072.4A.236.236,0,1,0,2.738.069L1.57,1.237.4.069A.236.236,0,1,0,.069.4L1.237,1.57.069,2.738A.236.236,0,1,0,.4,3.072L1.57,1.9,2.738,3.072a.236.236,0,1,0,.334-.334Z" transform="matrix(0.996, 0.087, -0.087, 0.996, 180.405, 127.017)" fill="#d5c3c3"/>
    <path id="_7787567_wrong_delete_remove_trash_minus_icon-8" data-name="7787567_wrong_delete_remove_trash_minus_icon" d="M1.6,1.322,2.585.339A.2.2,0,1,0,2.3.058l-.983.983L.339.058A.2.2,0,1,0,.058.339l.983.983L.058,2.3a.2.2,0,0,0,.281.281L1.322,1.6l.983.983A.2.2,0,1,0,2.585,2.3Z" transform="matrix(0.996, 0.087, -0.087, 0.996, 180.631, 45.261)" fill="#d5c3c3"/>
    <path id="_7787567_wrong_delete_remove_trash_minus_icon-9" data-name="7787567_wrong_delete_remove_trash_minus_icon" d="M2.036,1.679,3.284.431A.252.252,0,1,0,2.928.074L1.679,1.322.431.074A.252.252,0,1,0,.074.431L1.322,1.679.074,2.928a.252.252,0,1,0,.357.357L1.679,2.036,2.928,3.284a.252.252,0,1,0,.357-.357Z" transform="matrix(0.996, 0.087, -0.087, 0.996, 106.367, 93.396)" fill="#d5c3c3"/>
    <path id="_7787567_wrong_delete_remove_trash_minus_icon-10" data-name="7787567_wrong_delete_remove_trash_minus_icon" d="M2.5,2.062,4.032.529A.31.31,0,1,0,3.594.091L2.062,1.624.529.091A.31.31,0,1,0,.091.529L1.624,2.062.091,3.594a.31.31,0,1,0,.438.438L2.062,2.5,3.594,4.032a.31.31,0,1,0,.438-.438Z" transform="matrix(0.996, 0.087, -0.087, 0.996, 341.7, 171.542)" fill="#d5c3c3"/>
  </g>
</svg>
