<svg id="Trading" xmlns="http://www.w3.org/2000/svg" width="17.933" height="22.725" viewBox="0 0 17.933 22.725">
  <g id="Trading-2" data-name="Trading" opacity="0.5">
    <g id="wbtc_colour" data-name="wbtc colour">
      <path id="Shape" d="M51.871,34.587c-.26-2.712-2.6-3.621-5.557-3.9V28H44.027v2.619H42.2V28h-2.27v2.715H35.29v2.447s1.689-.03,1.663,0a1.183,1.183,0,0,1,1.3,1V44.459a.8.8,0,0,1-.277.559.793.793,0,0,1-.589.2c.03.026-1.663,0-1.663,0L35.29,47.95h4.6v2.775h2.287V48.006H44v2.7h2.291V47.976c3.864-.234,6.558-1.187,6.9-4.8.273-2.911-1.1-4.21-3.283-4.734A3.536,3.536,0,0,0,51.871,34.587Zm-3.205,8.135c0,2.842-4.869,2.517-6.419,2.517V40.2C43.8,40.2,48.666,39.755,48.666,42.722Zm-1.061-7.1c0,2.6-4.063,2.283-5.354,2.283V33.318C43.542,33.318,47.6,32.911,47.6,35.618Z" transform="translate(-35.29 -28)" fill="#707070"/>
    </g>
  </g>
</svg>
