<svg xmlns="http://www.w3.org/2000/svg" width="17.361" height="13.89" viewBox="0 0 17.361 13.89">
  <path id="Icon_awesome-user-edit" data-name="Icon awesome-user-edit" d="M6.077,6.945A3.472,3.472,0,1,0,2.6,3.472,3.472,3.472,0,0,0,6.077,6.945Zm2.431.868H8.054a4.722,4.722,0,0,1-3.955,0H3.646A3.647,3.647,0,0,0,0,11.459v1.129a1.3,1.3,0,0,0,1.3,1.3H8.76a1.3,1.3,0,0,1-.071-.578l.184-1.652.033-.3.214-.214,2.1-2.1a3.609,3.609,0,0,0-2.71-1.234Zm1.229,3.942-.184,1.655a.432.432,0,0,0,.477.477l1.652-.184,3.741-3.741L13.477,8.016,9.736,11.754Zm7.436-4.46L16.144,6.266a.65.65,0,0,0-.917,0L14.2,7.292,14.09,7.4l1.948,1.945,1.134-1.134a.653.653,0,0,0,0-.92Z" fill="#ff6200"/>
</svg>
