<svg id="Component_13_2" data-name="Component 13 – 2" xmlns="http://www.w3.org/2000/svg" width="22" height="22" viewBox="0 0 22 22">
  <circle id="Ellipse_1245" data-name="Ellipse 1245" cx="11" cy="11" r="11" fill="#f2f923"/>
  <path id="Icon_awesome-user-edit" data-name="Icon awesome-user-edit" d="M9.732,11.644l-.181,1.623a.423.423,0,0,0,.468.468l1.62-.181,3.668-3.668L13.4,7.978,9.732,11.644Zm7.291-4.373L16.015,6.263a.637.637,0,0,0-.9,0L14.111,7.268,14,7.377l1.91,1.907,1.112-1.112A.641.641,0,0,0,17.024,7.271Z" transform="translate(-2.379 1.092)" fill="#ff0003"/>
</svg>
