<svg xmlns="http://www.w3.org/2000/svg" width="24" height="24" fill="none" viewBox="0 0 24 24">
    <path fill="#000" d="M22.413 11.686C20.167 7.533 16.227 5.02 11.867 5.02c-4.36 0-8.307 2.513-10.534 6.666L1.147 12l.173.32c2.247 4.154 6.187 6.667 10.547 6.667s8.306-2.48 10.546-6.667l.174-.32-.174-.313zM11.867 17.62c-3.754 0-7.2-2.093-9.2-5.62 2-3.526 5.446-5.62 9.2-5.62 3.753 0 7.16 2.1 9.193 5.62-2.033 3.527-5.447 5.62-9.193 5.62z"/>
    <path fill="#000" d="M12.06 7.446c-.904.007-1.786.281-2.534.789-.748.507-1.329 1.225-1.67 2.062-.34.838-.424 1.757-.242 2.643.181.885.622 1.697 1.264 2.332.643.636 1.46 1.066 2.348 1.238.887.171 1.806.076 2.639-.274.833-.35 1.544-.94 2.043-1.694.499-.753.763-1.638.759-2.542-.003-.602-.124-1.197-.357-1.752-.233-.555-.574-1.058-1.002-1.481-.428-.423-.935-.757-1.492-.984-.558-.227-1.154-.341-1.756-.337zm0 7.814c-.639-.007-1.26-.202-1.789-.561-.528-.36-.938-.866-1.179-1.458-.24-.591-.3-1.24-.174-1.866.127-.626.437-1.2.89-1.65.451-.451 1.027-.758 1.653-.883.627-.124 1.276-.061 1.866.182.59.243 1.096.655 1.453 1.185s.55 1.152.553 1.79c.002.43-.081.856-.245 1.253-.164.398-.406.758-.71 1.062-.305.303-.666.543-1.064.705-.398.162-.824.244-1.254.24z"/>
</svg>
