{
    "data":[
        {
            "manager": "Hà Thị Thu Phương",
            "role": "Giám đốc",
            "id": "HDS2006000088",
            "employee":[
                {
                    "manager": "Nguyễn Ngọc Lan",
                    "role": "Quản lý",
                    "id": "HDS2006234",
                    "employee":[
                        {
                            "manager": "Lê Thị Thuý Mai",
                            "role": "Chuyên gia",
                            "id": "HDS208938696",
                            "employee":[

                            ]
                        },
                        {
                            "manager": "Lê Thị Thuý Minh",
                            "role": "Chuyên gia",
                            "id": "HDS208938699",
                            "employee":[

                            ]
                        }
                    ]
                },
                {
                    "manager": "Nguyễn Ngọc Nam",
                    "role": "Quản lý",
                    "id": "HDS2006235",
                    "employee":[
                        {
                            "manager": "Lê Thị Thuý Mai",
                            "role": "Chuyên gia",
                            "id": "HDS208938696",
                            "employee":[

                            ]
                        },
                        {
                            "manager": "Lê Thị Thuý Minh",
                            "role": "Chuyên gia",
                            "id": "HDS208938699",
                            "employee":[

                            ]
                        }
                    ]
                }
            ]
        },
        {
            "manager": "Hà Thị Thu Phương",
            "role": "Giám đốc",
            "id": "HDS2006000088",
            "employee":[
                {
                    "manager": "Nguyễn Ngọc Lan",
                    "role": "Quản lý",
                    "id": "HDS2006234",
                    "employee":[
                        {
                            "manager": "Lê Thị Thuý Mai",
                            "role": "Chuyên gia",
                            "id": "HDS208938696",
                            "employee":[

                            ]
                        },
                        {
                            "manager": "Lê Thị Thuý Minh",
                            "role": "Chuyên gia",
                            "id": "HDS208938699",
                            "employee":[

                            ]
                        }
                    ]
                },
                {
                    "manager": "Nguyễn Ngọc Nam",
                    "role": "Quản lý",
                    "id": "HDS2006235",
                    "employee":[
                        {
                            "manager": "Lê Thị Thuý Mai",
                            "role": "Chuyên gia",
                            "id": "HDS208938696",
                            "employee":[

                            ]
                        },
                        {
                            "manager": "Lê Thị Thuý Minh",
                            "role": "Chuyên gia",
                            "id": "HDS208938699",
                            "employee":[

                            ]
                        }
                    ]
                }
            ]
        }
    ]
}