<svg width="20" height="20" viewBox="0 0 20 20" fill="none" xmlns="http://www.w3.org/2000/svg">
<path fill-rule="evenodd" clip-rule="evenodd" d="M0.955358 18.8655C1.34647 19.2595 1.9837 19.2595 2.37482 18.8655L9.59101 11.5954L16.8072 18.8655C17.1983 19.2595 17.8356 19.2595 18.2267 18.8655L18.8918 18.1954C19.2788 17.8055 19.2788 17.1764 18.8918 16.7865L12.4384 10.285C12.0514 9.89506 12.0514 9.26594 12.4384 8.87603L18.8918 2.37452C19.2788 1.98461 19.2788 1.35549 18.8918 0.965578L18.2267 0.295527C17.8356 -0.0985085 17.1983 -0.0985094 16.8072 0.295526L9.59101 7.56557L2.37482 0.295526C1.9837 -0.0985094 1.34647 -0.0985085 0.955357 0.295527L0.29027 0.965578C-0.0967562 1.35549 -0.0967568 1.98461 0.290269 2.37452L6.74361 8.87603C7.13064 9.26594 7.13064 9.89506 6.74361 10.285L0.29027 16.7865C-0.096756 17.1764 -0.0967554 17.8055 0.290271 18.1954L0.955358 18.8655Z" fill="#0009DE"/>
</svg>
