// Vitest Snapshot v1, https://vitest.dev/guide/snapshot.html

exports[`App.vue > should render correctly 1`] = `
<div
  data-v-app=""
>
  
  <header>
    <div
      class="wrapper"
    >
      <navbar-stub />
    </div>
  </header>
  <router-view-stub
    name="default"
  />
  
</div>
`;
