module gitlab.com/dev.anuwong/go-soup

go 1.17

require (
	github.com/anaskhan96/soup v1.2.5 // indirect
	golang.org/x/net v0.0.0-20200114155413-6afb5195e5aa // indirect
	golang.org/x/text v0.3.0 // indirect
)
