[
  {
    "invoice_type_id": "OP701626",
    "activity_type": "activity",
    "contract_start_date": "2017-01-1",
    "contract_end_date": "2017-01-01",
    "invoiced_currency": "USD" ,
    "description": "Description" 
  }  
]