[
  {
    "code":"AAP",
    "name": "Authorized Academic Partner (AAP)"
  },
  {
    "code":"ATC",
    "name": "Authorized Training Center (ATC)"
  },
  {
    "code":"AP",
    "name": "Authors and Publishers"
  },
  {
    "code":"AC",
    "name": "Autodesk Contractor"
  },
  {
    "code":"ADN",
    "name": "Autodesk Developer Network (ADN)"
  },
  {
    "code":"AE",
    "name": "Autodesk Employee"
  },
  {
    "code":"AITC",
    "name": "Autodesk Internal Training Center (AITC)"
  },
  {
    "code":"CS",
    "name": "Certification Site"
  },
  {
    "code":"ES",
    "name": "Education Sales"
  },
  {
    "code":"GS",
    "name": "Government Sales"
  },
  {
    "code":"MED",
    "name": "Master Education Distributor (MED)"
  },
  {
    "code":"MTP",
    "name": "Membership Training Partner (MTP)"
  },
  {
    "code":"RED",
    "name": "Regional Education Distributor (RED)"
  },
  {
    "code":"R",
    "name": "Retail"
  },
  {
    "code":"VAD",
    "name": "Value Added Distributor (VAD)"
  },
  {
    "code":"VAR",
    "name": "Value Added Reseller (VAR)"
  }
]
