[
    {
        "code":1,
        "name":"Africa"
    },
    {
        "code":2,
        "name":"ASEAN"
    },
    {
        "code":3,
        "name":"Australia / New Zealand"
    },
    {
        "code":4,
        "name":"Central Europe"
    }
  ]