%YAML 1.1
%TAG !u! tag:unity3d.com,2011:
--- !u!114 &1518361041
MonoBehaviour:
  m_ObjectHideFlags: 0
  m_CorrespondingSourceObject: {fileID: 0}
  m_PrefabInstance: {fileID: 0}
  m_PrefabAsset: {fileID: 0}
  m_GameObject: {fileID: 2291913614500348030}
  m_Enabled: 1
  m_EditorHideFlags: 0
  m_Script: {fileID: 11500000, guid: 172515602e62fb746b5d573b38a5fe58, type: 3}
  m_Name: 
  m_EditorClassIdentifier: 
  isGlobal: 1
  priority: 0
  blendDistance: 0
  weight: 1
  sharedProfile: {fileID: 11400000, guid: 81b89e4c4667e154e85a63a703505c80, type: 2}
--- !u!1001 &5646218746846044949
PrefabInstance:
  m_ObjectHideFlags: 0
  serializedVersion: 2
  m_Modification:
    m_TransformParent: {fileID: 0}
    m_Modifications:
    - target: {fileID: -8880698536992543636, guid: 8f1766820ae832a4593f3b33a623d0a3, type: 3}
      propertyPath: m_BoundingSphereOverride.w
      value: 8.8294736e-27
      objectReference: {fileID: 0}
    - target: {fileID: -8679921383154817045, guid: 8f1766820ae832a4593f3b33a623d0a3, type: 3}
      propertyPath: m_RootOrder
      value: 0
      objectReference: {fileID: 0}
    - target: {fileID: -8679921383154817045, guid: 8f1766820ae832a4593f3b33a623d0a3, type: 3}
      propertyPath: m_LocalPosition.x
      value: -17.944014
      objectReference: {fileID: 0}
    - target: {fileID: -8679921383154817045, guid: 8f1766820ae832a4593f3b33a623d0a3, type: 3}
      propertyPath: m_LocalPosition.y
      value: 23.524204
      objectReference: {fileID: 0}
    - target: {fileID: -8679921383154817045, guid: 8f1766820ae832a4593f3b33a623d0a3, type: 3}
      propertyPath: m_LocalPosition.z
      value: 1.9119786
      objectReference: {fileID: 0}
    - target: {fileID: -8679921383154817045, guid: 8f1766820ae832a4593f3b33a623d0a3, type: 3}
      propertyPath: m_LocalRotation.w
      value: 1
      objectReference: {fileID: 0}
    - target: {fileID: -8679921383154817045, guid: 8f1766820ae832a4593f3b33a623d0a3, type: 3}
      propertyPath: m_LocalRotation.x
      value: 0
      objectReference: {fileID: 0}
    - target: {fileID: -8679921383154817045, guid: 8f1766820ae832a4593f3b33a623d0a3, type: 3}
      propertyPath: m_LocalRotation.y
      value: 0
      objectReference: {fileID: 0}
    - target: {fileID: -8679921383154817045, guid: 8f1766820ae832a4593f3b33a623d0a3, type: 3}
      propertyPath: m_LocalRotation.z
      value: 0
      objectReference: {fileID: 0}
    - target: {fileID: -8679921383154817045, guid: 8f1766820ae832a4593f3b33a623d0a3, type: 3}
      propertyPath: m_LocalEulerAnglesHint.x
      value: 0
      objectReference: {fileID: 0}
    - target: {fileID: -8679921383154817045, guid: 8f1766820ae832a4593f3b33a623d0a3, type: 3}
      propertyPath: m_LocalEulerAnglesHint.y
      value: 0
      objectReference: {fileID: 0}
    - target: {fileID: -8679921383154817045, guid: 8f1766820ae832a4593f3b33a623d0a3, type: 3}
      propertyPath: m_LocalEulerAnglesHint.z
      value: 0
      objectReference: {fileID: 0}
    - target: {fileID: -8552895682343167034, guid: 8f1766820ae832a4593f3b33a623d0a3, type: 3}
      propertyPath: m_Materials.Array.data[0]
      value: 
      objectReference: {fileID: 2100000, guid: f3ac4aabb8628b5408625bc5d6f9dd5d, type: 2}
    - target: {fileID: -8552895682343167034, guid: 8f1766820ae832a4593f3b33a623d0a3, type: 3}
      propertyPath: m_Materials.Array.data[1]
      value: 
      objectReference: {fileID: 2100000, guid: 39558b5ffe552fb478efb74a240122ab, type: 2}
    - target: {fileID: -8485803814584179112, guid: 8f1766820ae832a4593f3b33a623d0a3, type: 3}
      propertyPath: m_Materials.Array.data[0]
      value: 
      objectReference: {fileID: 2100000, guid: 69036dbd8f7354840bd676709a3ed9db, type: 2}
    - target: {fileID: -8355579101202053003, guid: 8f1766820ae832a4593f3b33a623d0a3, type: 3}
      propertyPath: m_BoundingSphereOverride.y
      value: 2.3510647e-38
      objectReference: {fileID: 0}
    - target: {fileID: -8266312129624321554, guid: 8f1766820ae832a4593f3b33a623d0a3, type: 3}
      propertyPath: m_Materials.Array.data[0]
      value: 
      objectReference: {fileID: 2100000, guid: 6357188d24f819242b176363059f49fe, type: 2}
    - target: {fileID: -8246912899171996075, guid: 8f1766820ae832a4593f3b33a623d0a3, type: 3}
      propertyPath: m_BoundingSphereOverride.w
      value: 3.3510984e-26
      objectReference: {fileID: 0}
    - target: {fileID: -8023441452085096315, guid: 8f1766820ae832a4593f3b33a623d0a3, type: 3}
      propertyPath: m_Materials.Array.data[0]
      value: 
      objectReference: {fileID: 2100000, guid: acd76fdda982a2a4cb4aa4465d28961f, type: 2}
    - target: {fileID: -7428788247808615214, guid: 8f1766820ae832a4593f3b33a623d0a3, type: 3}
      propertyPath: m_Materials.Array.data[0]
      value: 
      objectReference: {fileID: 2100000, guid: acd76fdda982a2a4cb4aa4465d28961f, type: 2}
    - target: {fileID: -7301720467165660256, guid: 8f1766820ae832a4593f3b33a623d0a3, type: 3}
      propertyPath: m_Materials.Array.data[0]
      value: 
      objectReference: {fileID: 2100000, guid: f3ac4aabb8628b5408625bc5d6f9dd5d, type: 2}
    - target: {fileID: -7301720467165660256, guid: 8f1766820ae832a4593f3b33a623d0a3, type: 3}
      propertyPath: m_Materials.Array.data[1]
      value: 
      objectReference: {fileID: 2100000, guid: 39558b5ffe552fb478efb74a240122ab, type: 2}
    - target: {fileID: -4413758839882372286, guid: 8f1766820ae832a4593f3b33a623d0a3, type: 3}
      propertyPath: m_Materials.Array.data[0]
      value: 
      objectReference: {fileID: 2100000, guid: 6357188d24f819242b176363059f49fe, type: 2}
    - target: {fileID: -4203813071331004368, guid: 8f1766820ae832a4593f3b33a623d0a3, type: 3}
      propertyPath: m_Materials.Array.data[0]
      value: 
      objectReference: {fileID: 2100000, guid: b48a02a58bef4ee499f211eb57a68353, type: 2}
    - target: {fileID: -4192173614459189535, guid: 8f1766820ae832a4593f3b33a623d0a3, type: 3}
      propertyPath: m_Materials.Array.data[0]
      value: 
      objectReference: {fileID: 2100000, guid: 213466e51467dc145a36e3dd4a598562, type: 2}
    - target: {fileID: -4142680732279087931, guid: 8f1766820ae832a4593f3b33a623d0a3, type: 3}
      propertyPath: m_Materials.Array.data[0]
      value: 
      objectReference: {fileID: 2100000, guid: fbe90972bed8b7d4d8ecc530ead51639, type: 2}
    - target: {fileID: -4078452390781730854, guid: 8f1766820ae832a4593f3b33a623d0a3, type: 3}
      propertyPath: m_Materials.Array.data[0]
      value: 
      objectReference: {fileID: 2100000, guid: 213466e51467dc145a36e3dd4a598562, type: 2}
    - target: {fileID: -3739573218269363339, guid: 8f1766820ae832a4593f3b33a623d0a3, type: 3}
      propertyPath: m_Materials.Array.data[0]
      value: 
      objectReference: {fileID: 2100000, guid: f3ac4aabb8628b5408625bc5d6f9dd5d, type: 2}
    - target: {fileID: -3739573218269363339, guid: 8f1766820ae832a4593f3b33a623d0a3, type: 3}
      propertyPath: m_Materials.Array.data[1]
      value: 
      objectReference: {fileID: 2100000, guid: 39558b5ffe552fb478efb74a240122ab, type: 2}
    - target: {fileID: -3651219927206906843, guid: 8f1766820ae832a4593f3b33a623d0a3, type: 3}
      propertyPath: m_Materials.Array.data[0]
      value: 
      objectReference: {fileID: 2100000, guid: f3ac4aabb8628b5408625bc5d6f9dd5d, type: 2}
    - target: {fileID: -3651219927206906843, guid: 8f1766820ae832a4593f3b33a623d0a3, type: 3}
      propertyPath: m_Materials.Array.data[1]
      value: 
      objectReference: {fileID: 2100000, guid: 39558b5ffe552fb478efb74a240122ab, type: 2}
    - target: {fileID: -2768449816148835900, guid: 8f1766820ae832a4593f3b33a623d0a3, type: 3}
      propertyPath: m_Materials.Array.data[0]
      value: 
      objectReference: {fileID: 2100000, guid: e12cf5e46b8b92b4190197b77b650f74, type: 2}
    - target: {fileID: -2165121631664275898, guid: 8f1766820ae832a4593f3b33a623d0a3, type: 3}
      propertyPath: m_Materials.Array.data[0]
      value: 
      objectReference: {fileID: 2100000, guid: f3ac4aabb8628b5408625bc5d6f9dd5d, type: 2}
    - target: {fileID: -2165121631664275898, guid: 8f1766820ae832a4593f3b33a623d0a3, type: 3}
      propertyPath: m_Materials.Array.data[1]
      value: 
      objectReference: {fileID: 2100000, guid: 39558b5ffe552fb478efb74a240122ab, type: 2}
    - target: {fileID: -934129818820872333, guid: 8f1766820ae832a4593f3b33a623d0a3, type: 3}
      propertyPath: m_Materials.Array.data[0]
      value: 
      objectReference: {fileID: 2100000, guid: acd76fdda982a2a4cb4aa4465d28961f, type: 2}
    - target: {fileID: -360460694365255274, guid: 8f1766820ae832a4593f3b33a623d0a3, type: 3}
      propertyPath: m_Materials.Array.data[0]
      value: 
      objectReference: {fileID: 2100000, guid: 6357188d24f819242b176363059f49fe, type: 2}
    - target: {fileID: 456081707162540391, guid: 8f1766820ae832a4593f3b33a623d0a3, type: 3}
      propertyPath: m_Materials.Array.data[0]
      value: 
      objectReference: {fileID: 2100000, guid: 6357188d24f819242b176363059f49fe, type: 2}
    - target: {fileID: 787385350082748039, guid: 8f1766820ae832a4593f3b33a623d0a3, type: 3}
      propertyPath: m_Materials.Array.data[2]
      value: 
      objectReference: {fileID: 2100000, guid: 416bd443fcb547f41863ea41e8ad4a5c, type: 2}
    - target: {fileID: 787385350082748039, guid: 8f1766820ae832a4593f3b33a623d0a3, type: 3}
      propertyPath: m_Materials.Array.data[3]
      value: 
      objectReference: {fileID: 2100000, guid: 0e3283c184c204441bb945770e6abc4a, type: 2}
    - target: {fileID: 919132149155446097, guid: 8f1766820ae832a4593f3b33a623d0a3, type: 3}
      propertyPath: m_Name
      value: Design UVMapping_ink_Imagebake
      objectReference: {fileID: 0}
    - target: {fileID: 1143281000823323748, guid: 8f1766820ae832a4593f3b33a623d0a3, type: 3}
      propertyPath: m_Materials.Array.data[0]
      value: 
      objectReference: {fileID: 2100000, guid: 69036dbd8f7354840bd676709a3ed9db, type: 2}
    - target: {fileID: 1558604109273116548, guid: 8f1766820ae832a4593f3b33a623d0a3, type: 3}
      propertyPath: m_Materials.Array.data[0]
      value: 
      objectReference: {fileID: 2100000, guid: 6357188d24f819242b176363059f49fe, type: 2}
    - target: {fileID: 1694516719464740891, guid: 8f1766820ae832a4593f3b33a623d0a3, type: 3}
      propertyPath: m_LocalPosition.x
      value: 12.56
      objectReference: {fileID: 0}
    - target: {fileID: 1694516719464740891, guid: 8f1766820ae832a4593f3b33a623d0a3, type: 3}
      propertyPath: m_LocalPosition.z
      value: -8.91
      objectReference: {fileID: 0}
    - target: {fileID: 2273225602877838894, guid: 8f1766820ae832a4593f3b33a623d0a3, type: 3}
      propertyPath: m_Materials.Array.data[0]
      value: 
      objectReference: {fileID: 2100000, guid: 69036dbd8f7354840bd676709a3ed9db, type: 2}
    - target: {fileID: 3474429581150714720, guid: 8f1766820ae832a4593f3b33a623d0a3, type: 3}
      propertyPath: m_Materials.Array.data[0]
      value: 
      objectReference: {fileID: 2100000, guid: acd76fdda982a2a4cb4aa4465d28961f, type: 2}
    - target: {fileID: 4210478205444547048, guid: 8f1766820ae832a4593f3b33a623d0a3, type: 3}
      propertyPath: m_Materials.Array.data[0]
      value: 
      objectReference: {fileID: 2100000, guid: 69036dbd8f7354840bd676709a3ed9db, type: 2}
    - target: {fileID: 4597820583462175096, guid: 8f1766820ae832a4593f3b33a623d0a3, type: 3}
      propertyPath: m_Materials.Array.data[0]
      value: 
      objectReference: {fileID: 2100000, guid: 2d7ced5ed9460b14eb0f12ae23bc7a96, type: 2}
    - target: {fileID: 4662430112150083444, guid: 8f1766820ae832a4593f3b33a623d0a3, type: 3}
      propertyPath: m_Materials.Array.data[0]
      value: 
      objectReference: {fileID: 2100000, guid: 5890b8006c5420940bec79155cb547fa, type: 2}
    - target: {fileID: 4662430112150083444, guid: 8f1766820ae832a4593f3b33a623d0a3, type: 3}
      propertyPath: m_Materials.Array.data[1]
      value: 
      objectReference: {fileID: 2100000, guid: 5890b8006c5420940bec79155cb547fa, type: 2}
    - target: {fileID: 5373071542470875998, guid: 8f1766820ae832a4593f3b33a623d0a3, type: 3}
      propertyPath: m_Materials.Array.data[0]
      value: 
      objectReference: {fileID: 2100000, guid: 213466e51467dc145a36e3dd4a598562, type: 2}
    - target: {fileID: 5373071542470875998, guid: 8f1766820ae832a4593f3b33a623d0a3, type: 3}
      propertyPath: m_Materials.Array.data[1]
      value: 
      objectReference: {fileID: -4282534991585152438, guid: 8f1766820ae832a4593f3b33a623d0a3, type: 3}
    - target: {fileID: 5412629725262513187, guid: 8f1766820ae832a4593f3b33a623d0a3, type: 3}
      propertyPath: m_LocalPosition.x
      value: 22.76
      objectReference: {fileID: 0}
    - target: {fileID: 5419315298555746241, guid: 8f1766820ae832a4593f3b33a623d0a3, type: 3}
      propertyPath: m_IsActive
      value: 1
      objectReference: {fileID: 0}
    - target: {fileID: 5768215699009634833, guid: 8f1766820ae832a4593f3b33a623d0a3, type: 3}
      propertyPath: m_Materials.Array.data[0]
      value: 
      objectReference: {fileID: 2100000, guid: acd76fdda982a2a4cb4aa4465d28961f, type: 2}
    - target: {fileID: 6805222444847054079, guid: 8f1766820ae832a4593f3b33a623d0a3, type: 3}
      propertyPath: m_Materials.Array.data[0]
      value: 
      objectReference: {fileID: 2100000, guid: 213466e51467dc145a36e3dd4a598562, type: 2}
    - target: {fileID: 7761594974293560822, guid: 8f1766820ae832a4593f3b33a623d0a3, type: 3}
      propertyPath: m_LocalPosition.x
      value: -2.3
      objectReference: {fileID: 0}
    - target: {fileID: 7761594974293560822, guid: 8f1766820ae832a4593f3b33a623d0a3, type: 3}
      propertyPath: m_LocalPosition.y
      value: -0.35
      objectReference: {fileID: 0}
    - target: {fileID: 7761594974293560822, guid: 8f1766820ae832a4593f3b33a623d0a3, type: 3}
      propertyPath: m_LocalPosition.z
      value: 9.1
      objectReference: {fileID: 0}
    - target: {fileID: 8555210245918711917, guid: 8f1766820ae832a4593f3b33a623d0a3, type: 3}
      propertyPath: m_BoundingSphereOverride.w
      value: -5.195333e-10
      objectReference: {fileID: 0}
    - target: {fileID: 8555210245918711917, guid: 8f1766820ae832a4593f3b33a623d0a3, type: 3}
      propertyPath: m_BoundingSphereOverride.x
      value: 7.8e-43
      objectReference: {fileID: 0}
    - target: {fileID: 8555210245918711917, guid: 8f1766820ae832a4593f3b33a623d0a3, type: 3}
      propertyPath: m_BoundingSphereOverride.y
      value: NaN
      objectReference: {fileID: 0}
    - target: {fileID: 8789217229734932203, guid: 8f1766820ae832a4593f3b33a623d0a3, type: 3}
      propertyPath: m_Materials.Array.data[0]
      value: 
      objectReference: {fileID: 2100000, guid: 69036dbd8f7354840bd676709a3ed9db, type: 2}
    m_RemovedComponents: []
  m_SourcePrefab: {fileID: 100100000, guid: 8f1766820ae832a4593f3b33a623d0a3, type: 3}
--- !u!1 &2291913614500348030 stripped
GameObject:
  m_CorrespondingSourceObject: {fileID: 5878856964959904619, guid: 8f1766820ae832a4593f3b33a623d0a3, type: 3}
  m_PrefabInstance: {fileID: 5646218746846044949}
  m_PrefabAsset: {fileID: 0}
