<mxfile host="app.diagrams.net" modified="2022-09-26T17:21:34.418Z" agent="5.0 (Macintosh; Intel Mac OS X 10_15_7) AppleWebKit/537.36 (KHTML, like Gecko) Chrome/105.0.0.0 Safari/537.36" etag="wdQtKMxuSdVxqYhhFMxe" version="20.3.6" type="gitlab">
  <diagram id="f964qBzJRkd8AtPtO_sm" name="Page-1">
    <mxGraphModel dx="2305" dy="1966" grid="1" gridSize="10" guides="1" tooltips="1" connect="1" arrows="1" fold="1" page="1" pageScale="1" pageWidth="850" pageHeight="1100" math="0" shadow="0">
      <root>
        <mxCell id="0" />
        <mxCell id="1" parent="0" />
        <mxCell id="B_fFV0W1CAFH_QomAqbt-23" style="edgeStyle=orthogonalEdgeStyle;rounded=0;orthogonalLoop=1;jettySize=auto;html=1;entryX=0;entryY=0.5;entryDx=0;entryDy=0;" edge="1" parent="1" source="B_fFV0W1CAFH_QomAqbt-1" target="B_fFV0W1CAFH_QomAqbt-12">
          <mxGeometry relative="1" as="geometry">
            <mxPoint x="610" y="100" as="targetPoint" />
          </mxGeometry>
        </mxCell>
        <mxCell id="B_fFV0W1CAFH_QomAqbt-24" style="edgeStyle=orthogonalEdgeStyle;rounded=0;orthogonalLoop=1;jettySize=auto;html=1;entryX=0;entryY=0.5;entryDx=0;entryDy=0;" edge="1" parent="1" source="B_fFV0W1CAFH_QomAqbt-1" target="B_fFV0W1CAFH_QomAqbt-14">
          <mxGeometry relative="1" as="geometry" />
        </mxCell>
        <mxCell id="B_fFV0W1CAFH_QomAqbt-19" style="edgeStyle=orthogonalEdgeStyle;rounded=0;orthogonalLoop=1;jettySize=auto;html=1;entryX=0;entryY=0.5;entryDx=0;entryDy=0;" edge="1" parent="1" source="B_fFV0W1CAFH_QomAqbt-2" target="B_fFV0W1CAFH_QomAqbt-16">
          <mxGeometry relative="1" as="geometry" />
        </mxCell>
        <mxCell id="B_fFV0W1CAFH_QomAqbt-46" style="edgeStyle=orthogonalEdgeStyle;rounded=0;orthogonalLoop=1;jettySize=auto;html=1;entryX=0.5;entryY=0;entryDx=0;entryDy=0;startArrow=none;" edge="1" parent="1" source="B_fFV0W1CAFH_QomAqbt-1" target="B_fFV0W1CAFH_QomAqbt-12">
          <mxGeometry relative="1" as="geometry" />
        </mxCell>
        <mxCell id="B_fFV0W1CAFH_QomAqbt-2" value="Platform (api)" style="rounded=1;whiteSpace=wrap;html=1;" vertex="1" parent="1">
          <mxGeometry x="100" y="40" width="120" height="70" as="geometry" />
        </mxCell>
        <mxCell id="B_fFV0W1CAFH_QomAqbt-9" style="edgeStyle=orthogonalEdgeStyle;rounded=0;orthogonalLoop=1;jettySize=auto;html=1;entryX=0.5;entryY=1;entryDx=0;entryDy=0;" edge="1" parent="1" source="B_fFV0W1CAFH_QomAqbt-3" target="B_fFV0W1CAFH_QomAqbt-1">
          <mxGeometry relative="1" as="geometry" />
        </mxCell>
        <mxCell id="B_fFV0W1CAFH_QomAqbt-49" value="" style="edgeStyle=orthogonalEdgeStyle;rounded=0;orthogonalLoop=1;jettySize=auto;html=1;" edge="1" parent="1" source="B_fFV0W1CAFH_QomAqbt-3" target="B_fFV0W1CAFH_QomAqbt-16">
          <mxGeometry relative="1" as="geometry" />
        </mxCell>
        <mxCell id="B_fFV0W1CAFH_QomAqbt-59" style="edgeStyle=orthogonalEdgeStyle;rounded=0;orthogonalLoop=1;jettySize=auto;html=1;entryX=0.5;entryY=0;entryDx=0;entryDy=0;" edge="1" parent="1" source="B_fFV0W1CAFH_QomAqbt-3" target="B_fFV0W1CAFH_QomAqbt-45">
          <mxGeometry relative="1" as="geometry" />
        </mxCell>
        <mxCell id="B_fFV0W1CAFH_QomAqbt-3" value="Own Bota&lt;br&gt;" style="shape=umlActor;verticalLabelPosition=bottom;verticalAlign=top;html=1;outlineConnect=0;" vertex="1" parent="1">
          <mxGeometry x="190" y="180" width="30" height="60" as="geometry" />
        </mxCell>
        <mxCell id="B_fFV0W1CAFH_QomAqbt-48" value="" style="edgeStyle=orthogonalEdgeStyle;rounded=0;orthogonalLoop=1;jettySize=auto;html=1;" edge="1" parent="1" source="B_fFV0W1CAFH_QomAqbt-6" target="B_fFV0W1CAFH_QomAqbt-45">
          <mxGeometry relative="1" as="geometry" />
        </mxCell>
        <mxCell id="B_fFV0W1CAFH_QomAqbt-6" value="Admin" style="shape=umlActor;verticalLabelPosition=bottom;verticalAlign=top;html=1;outlineConnect=0;" vertex="1" parent="1">
          <mxGeometry x="60" y="410" width="30" height="60" as="geometry" />
        </mxCell>
        <mxCell id="B_fFV0W1CAFH_QomAqbt-12" value="Бд (Postgres)" style="rounded=0;whiteSpace=wrap;html=1;" vertex="1" parent="1">
          <mxGeometry x="580" y="130" width="120" height="60" as="geometry" />
        </mxCell>
        <mxCell id="B_fFV0W1CAFH_QomAqbt-14" value="Редис" style="rounded=1;whiteSpace=wrap;html=1;" vertex="1" parent="1">
          <mxGeometry x="550" y="240" width="120" height="60" as="geometry" />
        </mxCell>
        <mxCell id="B_fFV0W1CAFH_QomAqbt-20" style="edgeStyle=orthogonalEdgeStyle;rounded=0;orthogonalLoop=1;jettySize=auto;html=1;entryX=0.667;entryY=1.058;entryDx=0;entryDy=0;entryPerimeter=0;" edge="1" parent="1" source="B_fFV0W1CAFH_QomAqbt-16" target="B_fFV0W1CAFH_QomAqbt-1">
          <mxGeometry relative="1" as="geometry">
            <Array as="points">
              <mxPoint x="420" y="220" />
              <mxPoint x="490" y="220" />
            </Array>
          </mxGeometry>
        </mxCell>
        <mxCell id="B_fFV0W1CAFH_QomAqbt-16" value="web socket" style="rounded=1;whiteSpace=wrap;html=1;" vertex="1" parent="1">
          <mxGeometry x="360" y="320" width="120" height="60" as="geometry" />
        </mxCell>
        <mxCell id="B_fFV0W1CAFH_QomAqbt-35" style="edgeStyle=orthogonalEdgeStyle;rounded=0;orthogonalLoop=1;jettySize=auto;html=1;entryX=1;entryY=0.5;entryDx=0;entryDy=0;" edge="1" parent="1" source="B_fFV0W1CAFH_QomAqbt-31" target="B_fFV0W1CAFH_QomAqbt-12">
          <mxGeometry relative="1" as="geometry" />
        </mxCell>
        <mxCell id="B_fFV0W1CAFH_QomAqbt-31" value="js" style="rounded=1;whiteSpace=wrap;html=1;" vertex="1" parent="1">
          <mxGeometry x="770" y="100" width="70" height="60" as="geometry" />
        </mxCell>
        <mxCell id="B_fFV0W1CAFH_QomAqbt-36" style="edgeStyle=orthogonalEdgeStyle;rounded=0;orthogonalLoop=1;jettySize=auto;html=1;entryX=0;entryY=0.5;entryDx=0;entryDy=0;" edge="1" parent="1" source="B_fFV0W1CAFH_QomAqbt-32" target="B_fFV0W1CAFH_QomAqbt-38">
          <mxGeometry relative="1" as="geometry">
            <mxPoint x="830" y="230" as="targetPoint" />
          </mxGeometry>
        </mxCell>
        <mxCell id="B_fFV0W1CAFH_QomAqbt-42" style="edgeStyle=orthogonalEdgeStyle;rounded=0;orthogonalLoop=1;jettySize=auto;html=1;" edge="1" parent="1" source="B_fFV0W1CAFH_QomAqbt-32">
          <mxGeometry relative="1" as="geometry">
            <mxPoint x="640" y="190" as="targetPoint" />
          </mxGeometry>
        </mxCell>
        <mxCell id="B_fFV0W1CAFH_QomAqbt-32" value="js (1, 2)" style="rounded=0;whiteSpace=wrap;html=1;" vertex="1" parent="1">
          <mxGeometry x="730" y="175" width="70" height="60" as="geometry" />
        </mxCell>
        <mxCell id="B_fFV0W1CAFH_QomAqbt-37" style="edgeStyle=orthogonalEdgeStyle;rounded=0;orthogonalLoop=1;jettySize=auto;html=1;entryX=0;entryY=0.5;entryDx=0;entryDy=0;" edge="1" parent="1" source="B_fFV0W1CAFH_QomAqbt-33" target="B_fFV0W1CAFH_QomAqbt-38">
          <mxGeometry relative="1" as="geometry">
            <mxPoint x="820" y="240" as="targetPoint" />
          </mxGeometry>
        </mxCell>
        <mxCell id="B_fFV0W1CAFH_QomAqbt-43" style="edgeStyle=orthogonalEdgeStyle;rounded=0;orthogonalLoop=1;jettySize=auto;html=1;" edge="1" parent="1" source="B_fFV0W1CAFH_QomAqbt-33">
          <mxGeometry relative="1" as="geometry">
            <mxPoint x="650" y="190" as="targetPoint" />
          </mxGeometry>
        </mxCell>
        <mxCell id="B_fFV0W1CAFH_QomAqbt-33" value="js (1, 2)&lt;br&gt;" style="rounded=0;whiteSpace=wrap;html=1;" vertex="1" parent="1">
          <mxGeometry x="730" y="245" width="70" height="60" as="geometry" />
        </mxCell>
        <mxCell id="B_fFV0W1CAFH_QomAqbt-40" value="" style="edgeStyle=orthogonalEdgeStyle;rounded=0;orthogonalLoop=1;jettySize=auto;html=1;" edge="1" parent="1" source="B_fFV0W1CAFH_QomAqbt-34" target="B_fFV0W1CAFH_QomAqbt-39">
          <mxGeometry relative="1" as="geometry" />
        </mxCell>
        <mxCell id="B_fFV0W1CAFH_QomAqbt-41" style="edgeStyle=orthogonalEdgeStyle;rounded=0;orthogonalLoop=1;jettySize=auto;html=1;entryX=0.5;entryY=1;entryDx=0;entryDy=0;" edge="1" parent="1" source="B_fFV0W1CAFH_QomAqbt-34" target="B_fFV0W1CAFH_QomAqbt-12">
          <mxGeometry relative="1" as="geometry">
            <Array as="points">
              <mxPoint x="735" y="280" />
              <mxPoint x="640" y="280" />
            </Array>
          </mxGeometry>
        </mxCell>
        <mxCell id="B_fFV0W1CAFH_QomAqbt-34" value="ton golang" style="rounded=0;whiteSpace=wrap;html=1;" vertex="1" parent="1">
          <mxGeometry x="695" y="370" width="80" height="60" as="geometry" />
        </mxCell>
        <mxCell id="B_fFV0W1CAFH_QomAqbt-38" value="trongrid (trc20)" style="rounded=1;whiteSpace=wrap;html=1;" vertex="1" parent="1">
          <mxGeometry x="855" y="210" width="120" height="60" as="geometry" />
        </mxCell>
        <mxCell id="B_fFV0W1CAFH_QomAqbt-39" value="ton adnl" style="rounded=0;whiteSpace=wrap;html=1;" vertex="1" parent="1">
          <mxGeometry x="855" y="370" width="80" height="60" as="geometry" />
        </mxCell>
        <mxCell id="B_fFV0W1CAFH_QomAqbt-44" value="Landing Page&lt;br&gt;" style="rounded=1;whiteSpace=wrap;html=1;" vertex="1" parent="1">
          <mxGeometry x="180" y="400" width="120" height="60" as="geometry" />
        </mxCell>
        <mxCell id="B_fFV0W1CAFH_QomAqbt-47" style="edgeStyle=orthogonalEdgeStyle;rounded=0;orthogonalLoop=1;jettySize=auto;html=1;entryX=0.5;entryY=1;entryDx=0;entryDy=0;" edge="1" parent="1" source="B_fFV0W1CAFH_QomAqbt-45" target="B_fFV0W1CAFH_QomAqbt-2">
          <mxGeometry relative="1" as="geometry">
            <Array as="points">
              <mxPoint x="155" y="200" />
              <mxPoint x="110" y="200" />
              <mxPoint x="110" y="110" />
            </Array>
          </mxGeometry>
        </mxCell>
        <mxCell id="B_fFV0W1CAFH_QomAqbt-45" value="Nextjs (react)" style="rounded=1;whiteSpace=wrap;html=1;" vertex="1" parent="1">
          <mxGeometry x="95" y="290" width="120" height="60" as="geometry" />
        </mxCell>
        <mxCell id="B_fFV0W1CAFH_QomAqbt-51" style="edgeStyle=orthogonalEdgeStyle;rounded=0;orthogonalLoop=1;jettySize=auto;html=1;exitX=0.5;exitY=0.5;exitDx=0;exitDy=0;exitPerimeter=0;" edge="1" parent="1" source="B_fFV0W1CAFH_QomAqbt-3" target="B_fFV0W1CAFH_QomAqbt-3">
          <mxGeometry relative="1" as="geometry" />
        </mxCell>
        <mxCell id="B_fFV0W1CAFH_QomAqbt-56" style="edgeStyle=orthogonalEdgeStyle;rounded=0;orthogonalLoop=1;jettySize=auto;html=1;" edge="1" parent="1" source="B_fFV0W1CAFH_QomAqbt-52" target="B_fFV0W1CAFH_QomAqbt-54">
          <mxGeometry relative="1" as="geometry" />
        </mxCell>
        <mxCell id="B_fFV0W1CAFH_QomAqbt-61" value="" style="edgeStyle=orthogonalEdgeStyle;rounded=0;orthogonalLoop=1;jettySize=auto;html=1;" edge="1" parent="1" source="B_fFV0W1CAFH_QomAqbt-52" target="B_fFV0W1CAFH_QomAqbt-60">
          <mxGeometry relative="1" as="geometry" />
        </mxCell>
        <mxCell id="B_fFV0W1CAFH_QomAqbt-52" value="User&lt;br&gt;" style="shape=umlActor;verticalLabelPosition=bottom;verticalAlign=top;html=1;outlineConnect=0;" vertex="1" parent="1">
          <mxGeometry x="405" y="-250" width="30" height="60" as="geometry" />
        </mxCell>
        <mxCell id="B_fFV0W1CAFH_QomAqbt-55" style="edgeStyle=orthogonalEdgeStyle;rounded=0;orthogonalLoop=1;jettySize=auto;html=1;entryX=0.5;entryY=1;entryDx=0;entryDy=0;" edge="1" parent="1" source="B_fFV0W1CAFH_QomAqbt-1" target="B_fFV0W1CAFH_QomAqbt-54">
          <mxGeometry relative="1" as="geometry" />
        </mxCell>
        <mxCell id="B_fFV0W1CAFH_QomAqbt-1" value="Telegram Bot Core&lt;br&gt;" style="rounded=1;whiteSpace=wrap;html=1;" vertex="1" parent="1">
          <mxGeometry x="340" y="10" width="180" height="80" as="geometry" />
        </mxCell>
        <mxCell id="B_fFV0W1CAFH_QomAqbt-53" value="" style="edgeStyle=orthogonalEdgeStyle;rounded=0;orthogonalLoop=1;jettySize=auto;html=1;entryX=0.5;entryY=0;entryDx=0;entryDy=0;endArrow=none;" edge="1" parent="1" source="B_fFV0W1CAFH_QomAqbt-2" target="B_fFV0W1CAFH_QomAqbt-1">
          <mxGeometry relative="1" as="geometry">
            <mxPoint x="220" y="75" as="sourcePoint" />
            <mxPoint x="640" y="130" as="targetPoint" />
          </mxGeometry>
        </mxCell>
        <mxCell id="B_fFV0W1CAFH_QomAqbt-57" style="edgeStyle=orthogonalEdgeStyle;rounded=0;orthogonalLoop=1;jettySize=auto;html=1;exitX=0.75;exitY=1;exitDx=0;exitDy=0;" edge="1" parent="1" source="B_fFV0W1CAFH_QomAqbt-54" target="B_fFV0W1CAFH_QomAqbt-1">
          <mxGeometry relative="1" as="geometry" />
        </mxCell>
        <mxCell id="B_fFV0W1CAFH_QomAqbt-54" value="Telegram Api" style="rounded=0;whiteSpace=wrap;html=1;" vertex="1" parent="1">
          <mxGeometry x="365" y="-140" width="120" height="60" as="geometry" />
        </mxCell>
        <mxCell id="B_fFV0W1CAFH_QomAqbt-60" value="~6000&lt;br&gt;1 недели" style="whiteSpace=wrap;html=1;verticalAlign=top;" vertex="1" parent="1">
          <mxGeometry x="470" y="-250" width="120" height="60" as="geometry" />
        </mxCell>
        <mxCell id="B_fFV0W1CAFH_QomAqbt-63" style="edgeStyle=orthogonalEdgeStyle;rounded=0;orthogonalLoop=1;jettySize=auto;html=1;" edge="1" parent="1" source="B_fFV0W1CAFH_QomAqbt-62" target="B_fFV0W1CAFH_QomAqbt-45">
          <mxGeometry relative="1" as="geometry" />
        </mxCell>
        <mxCell id="B_fFV0W1CAFH_QomAqbt-64" style="edgeStyle=orthogonalEdgeStyle;rounded=0;orthogonalLoop=1;jettySize=auto;html=1;entryX=0;entryY=0.5;entryDx=0;entryDy=0;" edge="1" parent="1" source="B_fFV0W1CAFH_QomAqbt-62" target="B_fFV0W1CAFH_QomAqbt-2">
          <mxGeometry relative="1" as="geometry" />
        </mxCell>
        <mxCell id="B_fFV0W1CAFH_QomAqbt-66" style="edgeStyle=orthogonalEdgeStyle;rounded=0;orthogonalLoop=1;jettySize=auto;html=1;entryX=0;entryY=0.5;entryDx=0;entryDy=0;" edge="1" parent="1" source="B_fFV0W1CAFH_QomAqbt-62" target="B_fFV0W1CAFH_QomAqbt-44">
          <mxGeometry relative="1" as="geometry" />
        </mxCell>
        <mxCell id="B_fFV0W1CAFH_QomAqbt-62" value="&amp;nbsp;nginx" style="rounded=0;whiteSpace=wrap;html=1;" vertex="1" parent="1">
          <mxGeometry x="-50" y="230" width="120" height="60" as="geometry" />
        </mxCell>
        <mxCell id="B_fFV0W1CAFH_QomAqbt-68" style="edgeStyle=orthogonalEdgeStyle;rounded=0;orthogonalLoop=1;jettySize=auto;html=1;" edge="1" parent="1" source="B_fFV0W1CAFH_QomAqbt-67" target="B_fFV0W1CAFH_QomAqbt-2">
          <mxGeometry relative="1" as="geometry" />
        </mxCell>
        <mxCell id="B_fFV0W1CAFH_QomAqbt-67" value="Landing" style="rounded=1;whiteSpace=wrap;html=1;" vertex="1" parent="1">
          <mxGeometry x="-120" y="110" width="120" height="60" as="geometry" />
        </mxCell>
      </root>
    </mxGraphModel>
  </diagram>
</mxfile>
