<?xml version="1.0" encoding="utf-8"?>
<!-- Generator: Adobe Illustrator 23.0.0, SVG Export Plug-In . SVG Version: 6.00 Build 0)  -->
<svg version="1.1" id="Capa_1" xmlns="http://www.w3.org/2000/svg" xmlns:xlink="http://www.w3.org/1999/xlink" x="0px" y="0px"
	 viewBox="0 0 24 24" style="enable-background:new 0 0 24 24;" xml:space="preserve">
<style type="text/css">
	.st0{fill:none;}
	.st1{fill:#92949C;}
</style>
<g>
	<rect y="0" class="st0" width="24" height="24"/>
</g>
<g>
	<g>
		<path class="st1" d="M11,8v5l4.3,2.5l0.8-1.3l-3.5-2.1V8H11z M21,10V3l-2.6,2.6C16.7,4,14.5,3,12,3c-5,0-9,4-9,9s4,9,9,9s9-4,9-9
			h-2c0,3.9-3.1,7-7,7s-7-3.1-7-7s3.1-7,7-7c1.9,0,3.7,0.8,5,2.1L14,10H21z"/>
	</g>
</g>
</svg>
