// export _McSkirmish ; starting begin _McSkirmish := McSkirmish ( 0 , [ ] , [ ] ) ;
   0: LD_ADDR_EXP 1
   4: PUSH
   5: LD_INT 0
   7: PPUSH
   8: EMPTY
   9: PPUSH
  10: EMPTY
  11: PPUSH
  12: CALL_OW 404
  16: ST_TO_ADDR
// end ; end_of_file
  17: END
// var building_positions , strategy ; export function ReplaceIn ( arr , pos , value ) ; var i , tmp , s_arr ; begin
  18: LD_INT 0
  20: PPUSH
  21: PPUSH
  22: PPUSH
  23: PPUSH
// if pos < 1 then
  24: LD_VAR 0 2
  28: PUSH
  29: LD_INT 1
  31: LESS
  32: IFFALSE 36
// exit ;
  34: GO 339
// if pos = 1 then
  36: LD_VAR 0 2
  40: PUSH
  41: LD_INT 1
  43: EQUAL
  44: IFFALSE 77
// result := Replace ( arr , pos [ 1 ] , value ) else
  46: LD_ADDR_VAR 0 4
  50: PUSH
  51: LD_VAR 0 1
  55: PPUSH
  56: LD_VAR 0 2
  60: PUSH
  61: LD_INT 1
  63: ARRAY
  64: PPUSH
  65: LD_VAR 0 3
  69: PPUSH
  70: CALL_OW 1
  74: ST_TO_ADDR
  75: GO 339
// begin tmp := arr ;
  77: LD_ADDR_VAR 0 6
  81: PUSH
  82: LD_VAR 0 1
  86: ST_TO_ADDR
// s_arr := [ tmp ] ;
  87: LD_ADDR_VAR 0 7
  91: PUSH
  92: LD_VAR 0 6
  96: PUSH
  97: EMPTY
  98: LIST
  99: ST_TO_ADDR
// for i = 1 to pos - 1 do
 100: LD_ADDR_VAR 0 5
 104: PUSH
 105: DOUBLE
 106: LD_INT 1
 108: DEC
 109: ST_TO_ADDR
 110: LD_VAR 0 2
 114: PUSH
 115: LD_INT 1
 117: MINUS
 118: PUSH
 119: FOR_TO
 120: IFFALSE 165
// begin tmp := tmp [ pos [ i ] ] ;
 122: LD_ADDR_VAR 0 6
 126: PUSH
 127: LD_VAR 0 6
 131: PUSH
 132: LD_VAR 0 2
 136: PUSH
 137: LD_VAR 0 5
 141: ARRAY
 142: ARRAY
 143: ST_TO_ADDR
// s_arr := s_arr ^ [ tmp ] ;
 144: LD_ADDR_VAR 0 7
 148: PUSH
 149: LD_VAR 0 7
 153: PUSH
 154: LD_VAR 0 6
 158: PUSH
 159: EMPTY
 160: LIST
 161: ADD
 162: ST_TO_ADDR
// end ;
 163: GO 119
 165: POP
 166: POP
// tmp := Replace ( tmp , pos [ pos ] , value ) ;
 167: LD_ADDR_VAR 0 6
 171: PUSH
 172: LD_VAR 0 6
 176: PPUSH
 177: LD_VAR 0 2
 181: PUSH
 182: LD_VAR 0 2
 186: ARRAY
 187: PPUSH
 188: LD_VAR 0 3
 192: PPUSH
 193: CALL_OW 1
 197: ST_TO_ADDR
// s_arr := Replace ( s_arr , s_arr , tmp ) ;
 198: LD_ADDR_VAR 0 7
 202: PUSH
 203: LD_VAR 0 7
 207: PPUSH
 208: LD_VAR 0 7
 212: PPUSH
 213: LD_VAR 0 6
 217: PPUSH
 218: CALL_OW 1
 222: ST_TO_ADDR
// for i = s_arr downto 2 do
 223: LD_ADDR_VAR 0 5
 227: PUSH
 228: DOUBLE
 229: LD_VAR 0 7
 233: INC
 234: ST_TO_ADDR
 235: LD_INT 2
 237: PUSH
 238: FOR_DOWNTO
 239: IFFALSE 323
// begin tmp := Replace ( s_arr [ i - 1 ] , pos [ i - 1 ] , s_arr [ i ] ) ;
 241: LD_ADDR_VAR 0 6
 245: PUSH
 246: LD_VAR 0 7
 250: PUSH
 251: LD_VAR 0 5
 255: PUSH
 256: LD_INT 1
 258: MINUS
 259: ARRAY
 260: PPUSH
 261: LD_VAR 0 2
 265: PUSH
 266: LD_VAR 0 5
 270: PUSH
 271: LD_INT 1
 273: MINUS
 274: ARRAY
 275: PPUSH
 276: LD_VAR 0 7
 280: PUSH
 281: LD_VAR 0 5
 285: ARRAY
 286: PPUSH
 287: CALL_OW 1
 291: ST_TO_ADDR
// s_arr := Replace ( s_arr , i - 1 , tmp ) ;
 292: LD_ADDR_VAR 0 7
 296: PUSH
 297: LD_VAR 0 7
 301: PPUSH
 302: LD_VAR 0 5
 306: PUSH
 307: LD_INT 1
 309: MINUS
 310: PPUSH
 311: LD_VAR 0 6
 315: PPUSH
 316: CALL_OW 1
 320: ST_TO_ADDR
// end ;
 321: GO 238
 323: POP
 324: POP
// result := s_arr [ 1 ] ;
 325: LD_ADDR_VAR 0 4
 329: PUSH
 330: LD_VAR 0 7
 334: PUSH
 335: LD_INT 1
 337: ARRAY
 338: ST_TO_ADDR
// end ; end ;
 339: LD_VAR 0 4
 343: RET
// do
 344: GO 346
 346: DISABLE
// strategy = [ ] ;
 347: LD_ADDR_LOC 2
 351: PUSH
 352: EMPTY
 353: ST_TO_ADDR
 354: END
// do
 355: GO 357
 357: DISABLE
// AddMcUnits ( _McSkirmish , hero ) ;
 358: LD_EXP 1
 362: PPUSH
 363: LD_INT 37
 365: PPUSH
 366: CALL_OW 390
 370: END
// do
 371: GO 373
 373: DISABLE
// building_positions := [ [ mcs_depot_pos ] , [ mcs_armoury_pos ] , [ mcs_fact_pos ] , [ mcs_lab_pos ] , [ mcs_power_pos ] , [ mcs_defend_pos ] , [ mcs_ext_pos ] , [ mcs_oilmine_pos ] , [ mcs_sibmine_pos ] , [ mcs_teleport_pos ] , [ mcs_tower_pos ] , [ mcs_behemoth_pos ] ] ;
 374: LD_ADDR_LOC 1
 378: PUSH
 379: LD_INT 1
 381: PUSH
 382: EMPTY
 383: LIST
 384: PUSH
 385: LD_INT 2
 387: PUSH
 388: EMPTY
 389: LIST
 390: PUSH
 391: LD_INT 3
 393: PUSH
 394: EMPTY
 395: LIST
 396: PUSH
 397: LD_INT 4
 399: PUSH
 400: EMPTY
 401: LIST
 402: PUSH
 403: LD_INT 5
 405: PUSH
 406: EMPTY
 407: LIST
 408: PUSH
 409: LD_INT 6
 411: PUSH
 412: EMPTY
 413: LIST
 414: PUSH
 415: LD_INT 7
 417: PUSH
 418: EMPTY
 419: LIST
 420: PUSH
 421: LD_INT 8
 423: PUSH
 424: EMPTY
 425: LIST
 426: PUSH
 427: LD_INT 9
 429: PUSH
 430: EMPTY
 431: LIST
 432: PUSH
 433: LD_INT 10
 435: PUSH
 436: EMPTY
 437: LIST
 438: PUSH
 439: LD_INT 11
 441: PUSH
 442: EMPTY
 443: LIST
 444: PUSH
 445: LD_INT 12
 447: PUSH
 448: EMPTY
 449: LIST
 450: PUSH
 451: EMPTY
 452: LIST
 453: LIST
 454: LIST
 455: LIST
 456: LIST
 457: LIST
 458: LIST
 459: LIST
 460: LIST
 461: LIST
 462: LIST
 463: LIST
 464: ST_TO_ADDR
 465: END
// var Debug ; on CommPanelCommand ( id , p1 , p2 , p3 , p4 , p5 ) do var un ;
 466: LD_INT 0
 468: PPUSH
// begin for un in GetMcUnits ( _McSkirmish ) do
 469: LD_ADDR_VAR 0 7
 473: PUSH
 474: LD_EXP 1
 478: PPUSH
 479: CALL_OW 389
 483: PUSH
 484: FOR_IN
 485: IFFALSE 551
// if un = id [ 1 ] then
 487: LD_VAR 0 7
 491: PUSH
 492: LD_VAR 0 1
 496: PUSH
 497: LD_INT 1
 499: ARRAY
 500: EQUAL
 501: IFFALSE 507
// break else
 503: GO 551
 505: GO 549
// if GetSide ( id [ 1 ] ) = 2 then
 507: LD_VAR 0 1
 511: PUSH
 512: LD_INT 1
 514: ARRAY
 515: PPUSH
 516: CALL_OW 255
 520: PUSH
 521: LD_INT 2
 523: EQUAL
 524: IFFALSE 549
// begin ToLua ( _McSkirmish.addUnit( & id [ 1 ] & ) ) ;
 526: LD_STRING _McSkirmish.addUnit(
 528: PUSH
 529: LD_VAR 0 1
 533: PUSH
 534: LD_INT 1
 536: ARRAY
 537: STR
 538: PUSH
 539: LD_STRING )
 541: STR
 542: PPUSH
 543: CALL_OW 559
// break ;
 547: GO 551
// end ;
 549: GO 484
 551: POP
 552: POP
// if GetMcUnits ( _McSkirmish ) = [ ] then
 553: LD_EXP 1
 557: PPUSH
 558: CALL_OW 389
 562: PUSH
 563: EMPTY
 564: EQUAL
 565: IFFALSE 588
// ToLua ( _McSkirmish.addUnit( & id [ 1 ] & ) ) ;
 567: LD_STRING _McSkirmish.addUnit(
 569: PUSH
 570: LD_VAR 0 1
 574: PUSH
 575: LD_INT 1
 577: ARRAY
 578: STR
 579: PUSH
 580: LD_STRING )
 582: STR
 583: PPUSH
 584: CALL_OW 559
// end ;
 588: PPOPN 7
 590: END
// every 0 0$10 do var un ;
 591: GO 593
 593: DISABLE
 594: LD_INT 0
 596: PPUSH
// begin for un in all_units do
 597: LD_ADDR_VAR 0 1
 601: PUSH
 602: LD_OWVAR 3
 606: PUSH
 607: FOR_IN
 608: IFFALSE 644
// if GetSide ( un ) = 2 then
 610: LD_VAR 0 1
 614: PPUSH
 615: CALL_OW 255
 619: PUSH
 620: LD_INT 2
 622: EQUAL
 623: IFFALSE 642
// ToLua ( _McSkirmish.addUnit( & un & ) ) ;
 625: LD_STRING _McSkirmish.addUnit(
 627: PUSH
 628: LD_VAR 0 1
 632: STR
 633: PUSH
 634: LD_STRING )
 636: STR
 637: PPUSH
 638: CALL_OW 559
 642: GO 607
 644: POP
 645: POP
// end ;
 646: PPOPN 1
 648: END
// every 0 0$1 do
 649: GO 651
 651: DISABLE
// begin display_strings := [ Stategy:  & strategy , Buildings:  & building_positions , Debug : & Debug ] ;
 652: LD_ADDR_OWVAR 47
 656: PUSH
 657: LD_STRING Stategy: 
 659: PUSH
 660: LD_LOC 2
 664: STR
 665: PUSH
 666: LD_STRING Buildings: 
 668: PUSH
 669: LD_LOC 1
 673: STR
 674: PUSH
 675: LD_STRING Debug :
 677: PUSH
 678: LD_LOC 3
 682: STR
 683: PUSH
 684: EMPTY
 685: LIST
 686: LIST
 687: LIST
 688: ST_TO_ADDR
// enable ;
 689: ENABLE
// end ;
 690: END
// var weapons , engines , chassis , control , vehicles , Vehicle_Groups , Parkings ; do
 691: GO 693
 693: DISABLE
// begin weapons := [ 22 , 23 , 24 , 25 , 26 , 27 , 28 , 29 , 30 , 31 , 32 ] ;
 694: LD_ADDR_LOC 4
 698: PUSH
 699: LD_INT 22
 701: PUSH
 702: LD_INT 23
 704: PUSH
 705: LD_INT 24
 707: PUSH
 708: LD_INT 25
 710: PUSH
 711: LD_INT 26
 713: PUSH
 714: LD_INT 27
 716: PUSH
 717: LD_INT 28
 719: PUSH
 720: LD_INT 29
 722: PUSH
 723: LD_INT 30
 725: PUSH
 726: LD_INT 31
 728: PUSH
 729: LD_INT 32
 731: PUSH
 732: EMPTY
 733: LIST
 734: LIST
 735: LIST
 736: LIST
 737: LIST
 738: LIST
 739: LIST
 740: LIST
 741: LIST
 742: LIST
 743: LIST
 744: ST_TO_ADDR
// engines := [ 1 , 2 , 3 ] ;
 745: LD_ADDR_LOC 5
 749: PUSH
 750: LD_INT 1
 752: PUSH
 753: LD_INT 2
 755: PUSH
 756: LD_INT 3
 758: PUSH
 759: EMPTY
 760: LIST
 761: LIST
 762: LIST
 763: ST_TO_ADDR
// chassis := [ 11 , 12 , 13 , 14 ] ;
 764: LD_ADDR_LOC 6
 768: PUSH
 769: LD_INT 11
 771: PUSH
 772: LD_INT 12
 774: PUSH
 775: LD_INT 13
 777: PUSH
 778: LD_INT 14
 780: PUSH
 781: EMPTY
 782: LIST
 783: LIST
 784: LIST
 785: LIST
 786: ST_TO_ADDR
// control := [ 1 , 2 , 3 , 4 ] ;
 787: LD_ADDR_LOC 7
 791: PUSH
 792: LD_INT 1
 794: PUSH
 795: LD_INT 2
 797: PUSH
 798: LD_INT 3
 800: PUSH
 801: LD_INT 4
 803: PUSH
 804: EMPTY
 805: LIST
 806: LIST
 807: LIST
 808: LIST
 809: ST_TO_ADDR
// vehicles := [ [ ] , [ ] , [ ] , [ ] ] ;
 810: LD_ADDR_LOC 8
 814: PUSH
 815: EMPTY
 816: PUSH
 817: EMPTY
 818: PUSH
 819: EMPTY
 820: PUSH
 821: EMPTY
 822: PUSH
 823: EMPTY
 824: LIST
 825: LIST
 826: LIST
 827: LIST
 828: ST_TO_ADDR
// Vehicle_Groups := [ ] ;
 829: LD_ADDR_LOC 9
 833: PUSH
 834: EMPTY
 835: ST_TO_ADDR
// Parkings = [ ] ;
 836: LD_ADDR_LOC 10
 840: PUSH
 841: EMPTY
 842: ST_TO_ADDR
// end ;
 843: END
// on CustomCommand ( side , category , building , x_pos , y_pos , direction ) do var ident , list , task , shape , found , component ;
 844: LD_INT 0
 846: PPUSH
 847: PPUSH
 848: PPUSH
 849: PPUSH
 850: PPUSH
 851: PPUSH
// begin case category of 0 :
 852: LD_VAR 0 2
 856: PUSH
 857: LD_INT 0
 859: DOUBLE
 860: EQUAL
 861: IFTRUE 865
 863: GO 1489
 865: POP
// begin display_strings := [ side:  & side , category:  & category , building:  & building , x_pos:  & x_pos , y_pos:  & y_pos , direction:  & direction ] ;
 866: LD_ADDR_OWVAR 47
 870: PUSH
 871: LD_STRING side: 
 873: PUSH
 874: LD_VAR 0 1
 878: STR
 879: PUSH
 880: LD_STRING category: 
 882: PUSH
 883: LD_VAR 0 2
 887: STR
 888: PUSH
 889: LD_STRING building: 
 891: PUSH
 892: LD_VAR 0 3
 896: STR
 897: PUSH
 898: LD_STRING x_pos: 
 900: PUSH
 901: LD_VAR 0 4
 905: STR
 906: PUSH
 907: LD_STRING y_pos: 
 909: PUSH
 910: LD_VAR 0 5
 914: STR
 915: PUSH
 916: LD_STRING direction: 
 918: PUSH
 919: LD_VAR 0 6
 923: STR
 924: PUSH
 925: EMPTY
 926: LIST
 927: LIST
 928: LIST
 929: LIST
 930: LIST
 931: LIST
 932: ST_TO_ADDR
// uc_nation := nation_arabian ;
 933: LD_ADDR_OWVAR 21
 937: PUSH
 938: LD_INT 2
 940: ST_TO_ADDR
// uc_side = 2 ;
 941: LD_ADDR_OWVAR 20
 945: PUSH
 946: LD_INT 2
 948: ST_TO_ADDR
// bc_type = building ;
 949: LD_ADDR_OWVAR 42
 953: PUSH
 954: LD_VAR 0 3
 958: ST_TO_ADDR
// case building of b_depot :
 959: LD_VAR 0 3
 963: PUSH
 964: LD_INT 0
 966: DOUBLE
 967: EQUAL
 968: IFTRUE 972
 970: GO 983
 972: POP
// ident := 1 ; b_armoury :
 973: LD_ADDR_VAR 0 7
 977: PUSH
 978: LD_INT 1
 980: ST_TO_ADDR
 981: GO 1193
 983: LD_INT 4
 985: DOUBLE
 986: EQUAL
 987: IFTRUE 991
 989: GO 1002
 991: POP
// ident := 2 ; b_workshop :
 992: LD_ADDR_VAR 0 7
 996: PUSH
 997: LD_INT 2
 999: ST_TO_ADDR
1000: GO 1193
1002: LD_INT 2
1004: DOUBLE
1005: EQUAL
1006: IFTRUE 1010
1008: GO 1021
1010: POP
// ident := 3 ; b_lab_basic :
1011: LD_ADDR_VAR 0 7
1015: PUSH
1016: LD_INT 3
1018: ST_TO_ADDR
1019: GO 1193
1021: LD_INT 9
1023: DOUBLE
1024: EQUAL
1025: IFTRUE 1029
1027: GO 1040
1029: POP
// ident := 4 ; b_oil_power :
1030: LD_ADDR_VAR 0 7
1034: PUSH
1035: LD_INT 4
1037: ST_TO_ADDR
1038: GO 1193
1040: LD_INT 26
1042: DOUBLE
1043: EQUAL
1044: IFTRUE 1048
1046: GO 1059
1048: POP
// ident := 5 ; b_solar_power :
1049: LD_ADDR_VAR 0 7
1053: PUSH
1054: LD_INT 5
1056: ST_TO_ADDR
1057: GO 1193
1059: LD_INT 27
1061: DOUBLE
1062: EQUAL
1063: IFTRUE 1067
1065: GO 1078
1067: POP
// ident := 5 ; b_siberite_power :
1068: LD_ADDR_VAR 0 7
1072: PUSH
1073: LD_INT 5
1075: ST_TO_ADDR
1076: GO 1193
1078: LD_INT 28
1080: DOUBLE
1081: EQUAL
1082: IFTRUE 1086
1084: GO 1097
1086: POP
// ident := 5 ; b_breastwork :
1087: LD_ADDR_VAR 0 7
1091: PUSH
1092: LD_INT 5
1094: ST_TO_ADDR
1095: GO 1193
1097: LD_INT 31
1099: DOUBLE
1100: EQUAL
1101: IFTRUE 1105
1103: GO 1116
1105: POP
// ident := 6 ; b_bunker :
1106: LD_ADDR_VAR 0 7
1110: PUSH
1111: LD_INT 6
1113: ST_TO_ADDR
1114: GO 1193
1116: LD_INT 32
1118: DOUBLE
1119: EQUAL
1120: IFTRUE 1124
1122: GO 1135
1124: POP
// ident := 6 ; b_turret :
1125: LD_ADDR_VAR 0 7
1129: PUSH
1130: LD_INT 6
1132: ST_TO_ADDR
1133: GO 1193
1135: LD_INT 33
1137: DOUBLE
1138: EQUAL
1139: IFTRUE 1143
1141: GO 1154
1143: POP
// ident := 6 ; b_oil_mine :
1144: LD_ADDR_VAR 0 7
1148: PUSH
1149: LD_INT 6
1151: ST_TO_ADDR
1152: GO 1193
1154: LD_INT 29
1156: DOUBLE
1157: EQUAL
1158: IFTRUE 1162
1160: GO 1173
1162: POP
// ident := 8 ; b_siberite_mine :
1163: LD_ADDR_VAR 0 7
1167: PUSH
1168: LD_INT 8
1170: ST_TO_ADDR
1171: GO 1193
1173: LD_INT 30
1175: DOUBLE
1176: EQUAL
1177: IFTRUE 1181
1179: GO 1192
1181: POP
// ident := 9 ; end ;
1182: LD_ADDR_VAR 0 7
1186: PUSH
1187: LD_INT 9
1189: ST_TO_ADDR
1190: GO 1193
1192: POP
// if building = b_oil_mine then
1193: LD_VAR 0 3
1197: PUSH
1198: LD_INT 29
1200: EQUAL
1201: IFFALSE 1237
// begin CreateDepositXY ( x_pos , y_pos , mat_oil ) ;
1203: LD_VAR 0 4
1207: PPUSH
1208: LD_VAR 0 5
1212: PPUSH
1213: LD_INT 2
1215: PPUSH
1216: CALL_OW 62
// SetResourceVisibility ( x_pos , y_pos , 2 ) ;
1220: LD_VAR 0 4
1224: PPUSH
1225: LD_VAR 0 5
1229: PPUSH
1230: LD_INT 2
1232: PPUSH
1233: CALL_OW 441
// end ; if building = b_siberite_mine then
1237: LD_VAR 0 3
1241: PUSH
1242: LD_INT 30
1244: EQUAL
1245: IFFALSE 1281
// begin CreateDepositXY ( x_pos , y_pos , mat_siberit ) ;
1247: LD_VAR 0 4
1251: PPUSH
1252: LD_VAR 0 5
1256: PPUSH
1257: LD_INT 3
1259: PPUSH
1260: CALL_OW 62
// SetResourceVisibility ( x_pos , y_pos , 2 ) ;
1264: LD_VAR 0 4
1268: PPUSH
1269: LD_VAR 0 5
1273: PPUSH
1274: LD_INT 2
1276: PPUSH
1277: CALL_OW 441
// end ; if not CanCreateBuildingXYD ( x_pos , y_pos , direction ) then
1281: LD_VAR 0 4
1285: PPUSH
1286: LD_VAR 0 5
1290: PPUSH
1291: LD_VAR 0 6
1295: PPUSH
1296: CALL_OW 570
1300: NOT
1301: IFFALSE 1339
// begin if building = b_oil_mine or building = b_siberite_mine then
1303: LD_VAR 0 3
1307: PUSH
1308: LD_INT 29
1310: EQUAL
1311: PUSH
1312: LD_VAR 0 3
1316: PUSH
1317: LD_INT 30
1319: EQUAL
1320: OR
1321: IFFALSE 1337
// RemoveDepositXY ( x_pos , y_pos ) ;
1323: LD_VAR 0 4
1327: PPUSH
1328: LD_VAR 0 5
1332: PPUSH
1333: CALL_OW 63
// exit ;
1337: GO 2390
// end ; building_positions := ReplaceIn ( building_positions , [ ident ] , building_positions [ ident ] union [ [ x_pos , y_pos , direction ] ] ) ;
1339: LD_ADDR_LOC 1
1343: PUSH
1344: LD_LOC 1
1348: PPUSH
1349: LD_VAR 0 7
1353: PUSH
1354: EMPTY
1355: LIST
1356: PPUSH
1357: LD_LOC 1
1361: PUSH
1362: LD_VAR 0 7
1366: ARRAY
1367: PUSH
1368: LD_VAR 0 4
1372: PUSH
1373: LD_VAR 0 5
1377: PUSH
1378: LD_VAR 0 6
1382: PUSH
1383: EMPTY
1384: LIST
1385: LIST
1386: LIST
1387: PUSH
1388: EMPTY
1389: LIST
1390: UNION
1391: PPUSH
1392: CALL 18 0 3
1396: ST_TO_ADDR
// McSSetPosList ( _McSkirmish , building_positions ) ;
1397: LD_EXP 1
1401: PPUSH
1402: LD_LOC 1
1406: PPUSH
1407: CALL_OW 405
// strategy := Insert ( strategy , getLength ( strategy ) + 1 , [ mcs_Build , building , getLength ( building_positions [ ident ] ) - 1 ] ) ;
1411: LD_ADDR_LOC 2
1415: PUSH
1416: LD_LOC 2
1420: PPUSH
1421: LD_LOC 2
1425: PPUSH
1426: CALL 2682 0 1
1430: PUSH
1431: LD_INT 1
1433: PLUS
1434: PPUSH
1435: LD_INT 1
1437: PUSH
1438: LD_VAR 0 3
1442: PUSH
1443: LD_LOC 1
1447: PUSH
1448: LD_VAR 0 7
1452: ARRAY
1453: PPUSH
1454: CALL 2682 0 1
1458: PUSH
1459: LD_INT 1
1461: MINUS
1462: PUSH
1463: EMPTY
1464: LIST
1465: LIST
1466: LIST
1467: PPUSH
1468: CALL_OW 2
1472: ST_TO_ADDR
// McSSetStrategy ( _McSkirmish , strategy ) ;
1473: LD_EXP 1
1477: PPUSH
1478: LD_LOC 2
1482: PPUSH
1483: CALL_OW 410
// end ; 1 :
1487: GO 2390
1489: LD_INT 1
1491: DOUBLE
1492: EQUAL
1493: IFTRUE 1497
1495: GO 1555
1497: POP
// begin strategy := Insert ( strategy , getLength ( strategy ) + 1 , [ mcs_Tech , building ] ) ;
1498: LD_ADDR_LOC 2
1502: PUSH
1503: LD_LOC 2
1507: PPUSH
1508: LD_LOC 2
1512: PPUSH
1513: CALL 2682 0 1
1517: PUSH
1518: LD_INT 1
1520: PLUS
1521: PPUSH
1522: LD_INT 3
1524: PUSH
1525: LD_VAR 0 3
1529: PUSH
1530: EMPTY
1531: LIST
1532: LIST
1533: PPUSH
1534: CALL_OW 2
1538: ST_TO_ADDR
// McSSetStrategy ( _McSkirmish , strategy ) ;
1539: LD_EXP 1
1543: PPUSH
1544: LD_LOC 2
1548: PPUSH
1549: CALL_OW 410
// end ; 2 :
1553: GO 2390
1555: LD_INT 2
1557: DOUBLE
1558: EQUAL
1559: IFTRUE 1563
1561: GO 1758
1563: POP
// begin strategy = strategy diff [ [ mcs_Tech , building ] ] ;
1564: LD_ADDR_LOC 2
1568: PUSH
1569: LD_LOC 2
1573: PUSH
1574: LD_INT 3
1576: PUSH
1577: LD_VAR 0 3
1581: PUSH
1582: EMPTY
1583: LIST
1584: LIST
1585: PUSH
1586: EMPTY
1587: LIST
1588: DIFF
1589: ST_TO_ADDR
// McSSetStrategy ( _McSkirmish , strategy ) ;
1590: LD_EXP 1
1594: PPUSH
1595: LD_LOC 2
1599: PPUSH
1600: CALL_OW 410
// list := FilterAllUnits ( [ [ f_side , 2 ] , [ f_or , [ f_btype , b_lab ] , [ f_btype , b_lab_half ] , [ f_btype , b_lab_full ] ] ] ) ;
1604: LD_ADDR_VAR 0 8
1608: PUSH
1609: LD_INT 22
1611: PUSH
1612: LD_INT 2
1614: PUSH
1615: EMPTY
1616: LIST
1617: LIST
1618: PUSH
1619: LD_INT 2
1621: PUSH
1622: LD_INT 30
1624: PUSH
1625: LD_INT 6
1627: PUSH
1628: EMPTY
1629: LIST
1630: LIST
1631: PUSH
1632: LD_INT 30
1634: PUSH
1635: LD_INT 7
1637: PUSH
1638: EMPTY
1639: LIST
1640: LIST
1641: PUSH
1642: LD_INT 30
1644: PUSH
1645: LD_INT 8
1647: PUSH
1648: EMPTY
1649: LIST
1650: LIST
1651: PUSH
1652: EMPTY
1653: LIST
1654: LIST
1655: LIST
1656: LIST
1657: PUSH
1658: EMPTY
1659: LIST
1660: LIST
1661: PPUSH
1662: CALL_OW 69
1666: ST_TO_ADDR
// for ident in list do
1667: LD_ADDR_VAR 0 7
1671: PUSH
1672: LD_VAR 0 8
1676: PUSH
1677: FOR_IN
1678: IFFALSE 1754
// for task in GetTaskList ( ident ) do
1680: LD_ADDR_VAR 0 9
1684: PUSH
1685: LD_VAR 0 7
1689: PPUSH
1690: CALL_OW 437
1694: PUSH
1695: FOR_IN
1696: IFFALSE 1750
// if task = [ i , 0 , 0 , 0 , building , 0 , 0 ] then
1698: LD_VAR 0 9
1702: PUSH
1703: LD_STRING i
1705: PUSH
1706: LD_INT 0
1708: PUSH
1709: LD_INT 0
1711: PUSH
1712: LD_INT 0
1714: PUSH
1715: LD_VAR 0 3
1719: PUSH
1720: LD_INT 0
1722: PUSH
1723: LD_INT 0
1725: PUSH
1726: EMPTY
1727: LIST
1728: LIST
1729: LIST
1730: LIST
1731: LIST
1732: LIST
1733: LIST
1734: EQUAL
1735: IFFALSE 1748
// SetTaskList ( ident , [ ] ) ;
1737: LD_VAR 0 7
1741: PPUSH
1742: EMPTY
1743: PPUSH
1744: CALL_OW 446
1748: GO 1695
1750: POP
1751: POP
1752: GO 1677
1754: POP
1755: POP
// end ; 3 :
1756: GO 2390
1758: LD_INT 3
1760: DOUBLE
1761: EQUAL
1762: IFTRUE 1766
1764: GO 1783
1766: POP
// RemoveMcUnits ( _McSkirmish , building ) ; 4 :
1767: LD_EXP 1
1771: PPUSH
1772: LD_VAR 0 3
1776: PPUSH
1777: CALL_OW 391
1781: GO 2390
1783: LD_INT 4
1785: DOUBLE
1786: EQUAL
1787: IFTRUE 1791
1789: GO 1808
1791: POP
// AddMcUnits ( _McSkirmish , building ) ; 5 :
1792: LD_EXP 1
1796: PPUSH
1797: LD_VAR 0 3
1801: PPUSH
1802: CALL_OW 390
1806: GO 2390
1808: LD_INT 5
1810: DOUBLE
1811: EQUAL
1812: IFTRUE 1816
1814: GO 1849
1816: POP
// begin DeselectUnits ( all_units ) ;
1817: LD_OWVAR 3
1821: PPUSH
1822: CALL_OW 491
// SelectUnits ( building ) ;
1826: LD_VAR 0 3
1830: PPUSH
1831: CALL_OW 490
// ForceExclamation ( building , 1 ) ;
1835: LD_VAR 0 3
1839: PPUSH
1840: LD_INT 1
1842: PPUSH
1843: CALL_OW 582
// end ; 6 :
1847: GO 2390
1849: LD_INT 6
1851: DOUBLE
1852: EQUAL
1853: IFTRUE 1857
1855: GO 1884
1857: POP
// CenterOnXY ( GetX ( building ) , GetY ( building ) ) ; 7 :
1858: LD_VAR 0 3
1862: PPUSH
1863: CALL_OW 250
1867: PPUSH
1868: LD_VAR 0 3
1872: PPUSH
1873: CALL_OW 251
1877: PPUSH
1878: CALL_OW 84
1882: GO 2390
1884: LD_INT 7
1886: DOUBLE
1887: EQUAL
1888: IFTRUE 1892
1890: GO 2145
1892: POP
// begin found = false ;
1893: LD_ADDR_VAR 0 11
1897: PUSH
1898: LD_INT 0
1900: ST_TO_ADDR
// if vehicles [ x_pos ] then
1901: LD_LOC 8
1905: PUSH
1906: LD_VAR 0 4
1910: ARRAY
1911: IFFALSE 1956
// for component in vehicles [ x_pos ] do
1913: LD_ADDR_VAR 0 12
1917: PUSH
1918: LD_LOC 8
1922: PUSH
1923: LD_VAR 0 4
1927: ARRAY
1928: PUSH
1929: FOR_IN
1930: IFFALSE 1954
// if component = y_pos then
1932: LD_VAR 0 12
1936: PUSH
1937: LD_VAR 0 5
1941: EQUAL
1942: IFFALSE 1952
// found = true ;
1944: LD_ADDR_VAR 0 11
1948: PUSH
1949: LD_INT 1
1951: ST_TO_ADDR
1952: GO 1929
1954: POP
1955: POP
// if not found then
1956: LD_VAR 0 11
1960: NOT
1961: IFFALSE 2006
// vehicles := ReplaceIn ( vehicles , [ x_pos ] , vehicles [ x_pos ] union [ y_pos ] ) ;
1963: LD_ADDR_LOC 8
1967: PUSH
1968: LD_LOC 8
1972: PPUSH
1973: LD_VAR 0 4
1977: PUSH
1978: EMPTY
1979: LIST
1980: PPUSH
1981: LD_LOC 8
1985: PUSH
1986: LD_VAR 0 4
1990: ARRAY
1991: PUSH
1992: LD_VAR 0 5
1996: PUSH
1997: EMPTY
1998: LIST
1999: UNION
2000: PPUSH
2001: CALL 18 0 3
2005: ST_TO_ADDR
// McSChangeVehicles ( _McSkirmish , Vehicle_Groups [ building ] , vehicles [ 4 ] , vehicles [ 3 ] , vehicles [ 1 ] , vehicles [ 2 ] , - 1 ) ;
2006: LD_EXP 1
2010: PPUSH
2011: LD_LOC 9
2015: PUSH
2016: LD_VAR 0 3
2020: ARRAY
2021: PPUSH
2022: LD_LOC 8
2026: PUSH
2027: LD_INT 4
2029: ARRAY
2030: PPUSH
2031: LD_LOC 8
2035: PUSH
2036: LD_INT 3
2038: ARRAY
2039: PPUSH
2040: LD_LOC 8
2044: PUSH
2045: LD_INT 1
2047: ARRAY
2048: PPUSH
2049: LD_LOC 8
2053: PUSH
2054: LD_INT 2
2056: ARRAY
2057: PPUSH
2058: LD_INT 1
2060: NEG
2061: PPUSH
2062: CALL_OW 407
// Debug :=  Group - & Vehicle_Groups [ building ] & - ( & building & ):  & [ vehicles [ 4 ] , vehicles [ 3 ] , vehicles [ 1 ] , vehicles [ 2 ] ] ;
2066: LD_ADDR_LOC 3
2070: PUSH
2071: LD_STRING  Group -
2073: PUSH
2074: LD_LOC 9
2078: PUSH
2079: LD_VAR 0 3
2083: ARRAY
2084: STR
2085: PUSH
2086: LD_STRING - (
2088: STR
2089: PUSH
2090: LD_VAR 0 3
2094: STR
2095: PUSH
2096: LD_STRING ): 
2098: STR
2099: PUSH
2100: LD_LOC 8
2104: PUSH
2105: LD_INT 4
2107: ARRAY
2108: PUSH
2109: LD_LOC 8
2113: PUSH
2114: LD_INT 3
2116: ARRAY
2117: PUSH
2118: LD_LOC 8
2122: PUSH
2123: LD_INT 1
2125: ARRAY
2126: PUSH
2127: LD_LOC 8
2131: PUSH
2132: LD_INT 2
2134: ARRAY
2135: PUSH
2136: EMPTY
2137: LIST
2138: LIST
2139: LIST
2140: LIST
2141: STR
2142: ST_TO_ADDR
// end ; 10 :
2143: GO 2390
2145: LD_INT 10
2147: DOUBLE
2148: EQUAL
2149: IFTRUE 2153
2151: GO 2175
2153: POP
// vehicles := [ [ ] , [ ] , [ ] , [ ] ] ; 12 :
2154: LD_ADDR_LOC 8
2158: PUSH
2159: EMPTY
2160: PUSH
2161: EMPTY
2162: PUSH
2163: EMPTY
2164: PUSH
2165: EMPTY
2166: PUSH
2167: EMPTY
2168: LIST
2169: LIST
2170: LIST
2171: LIST
2172: ST_TO_ADDR
2173: GO 2390
2175: LD_INT 12
2177: DOUBLE
2178: EQUAL
2179: IFTRUE 2183
2181: GO 2224
2183: POP
// begin Parkings := Parkings ^ [ [ x_pos , y_pos ] ] ;
2184: LD_ADDR_LOC 10
2188: PUSH
2189: LD_LOC 10
2193: PUSH
2194: LD_VAR 0 4
2198: PUSH
2199: LD_VAR 0 5
2203: PUSH
2204: EMPTY
2205: LIST
2206: LIST
2207: PUSH
2208: EMPTY
2209: LIST
2210: ADD
2211: ST_TO_ADDR
// Debug := Parkings ;
2212: LD_ADDR_LOC 3
2216: PUSH
2217: LD_LOC 10
2221: ST_TO_ADDR
// end ; 11 :
2222: GO 2390
2224: LD_INT 11
2226: DOUBLE
2227: EQUAL
2228: IFTRUE 2232
2230: GO 2312
2232: POP
// begin strategy := Insert ( strategy , getLength ( strategy ) + 1 , [ mcs_Veh , Vehicle_Groups [ building ] , x_pos ] ) ;
2233: LD_ADDR_LOC 2
2237: PUSH
2238: LD_LOC 2
2242: PPUSH
2243: LD_LOC 2
2247: PPUSH
2248: CALL 2682 0 1
2252: PUSH
2253: LD_INT 1
2255: PLUS
2256: PPUSH
2257: LD_INT 4
2259: PUSH
2260: LD_LOC 9
2264: PUSH
2265: LD_VAR 0 3
2269: ARRAY
2270: PUSH
2271: LD_VAR 0 4
2275: PUSH
2276: EMPTY
2277: LIST
2278: LIST
2279: LIST
2280: PPUSH
2281: CALL_OW 2
2285: ST_TO_ADDR
// McSSetStrategy ( _McSkirmish , strategy ) ;
2286: LD_EXP 1
2290: PPUSH
2291: LD_LOC 2
2295: PPUSH
2296: CALL_OW 410
// Debug := x_pos ;
2300: LD_ADDR_LOC 3
2304: PUSH
2305: LD_VAR 0 4
2309: ST_TO_ADDR
// end ; 8 :
2310: GO 2390
2312: LD_INT 8
2314: DOUBLE
2315: EQUAL
2316: IFTRUE 2320
2318: GO 2389
2320: POP
// begin Vehicle_Groups := Vehicle_Groups ^ McSAddVehicles ( _McSkirmish , [ - 1 ] , [ - 1 ] , [ - 1 ] , [ - 1 ] , - 1 ) ;
2321: LD_ADDR_LOC 9
2325: PUSH
2326: LD_LOC 9
2330: PUSH
2331: LD_EXP 1
2335: PPUSH
2336: LD_INT 1
2338: NEG
2339: PUSH
2340: EMPTY
2341: LIST
2342: PPUSH
2343: LD_INT 1
2345: NEG
2346: PUSH
2347: EMPTY
2348: LIST
2349: PPUSH
2350: LD_INT 1
2352: NEG
2353: PUSH
2354: EMPTY
2355: LIST
2356: PPUSH
2357: LD_INT 1
2359: NEG
2360: PUSH
2361: EMPTY
2362: LIST
2363: PPUSH
2364: LD_INT 1
2366: NEG
2367: PPUSH
2368: CALL_OW 406
2372: ADD
2373: ST_TO_ADDR
// Debug := [ Vehicle_Groups ] ;
2374: LD_ADDR_LOC 3
2378: PUSH
2379: LD_LOC 9
2383: PUSH
2384: EMPTY
2385: LIST
2386: ST_TO_ADDR
// end ; end ;
2387: GO 2390
2389: POP
// end ;
2390: PPOPN 12
2392: END
// on McSVehicleAdded ( veh , mcid , vehgroup , num ) do begin Debug := [ veh:  & veh , mcid:  & _McSkirmish , vehgroup:  & vehgroup , num:  & num ] ;
2393: LD_ADDR_LOC 3
2397: PUSH
2398: LD_STRING veh: 
2400: PUSH
2401: LD_VAR 0 1
2405: STR
2406: PUSH
2407: LD_STRING mcid: 
2409: PUSH
2410: LD_EXP 1
2414: STR
2415: PUSH
2416: LD_STRING vehgroup: 
2418: PUSH
2419: LD_VAR 0 3
2423: STR
2424: PUSH
2425: LD_STRING num: 
2427: PUSH
2428: LD_VAR 0 4
2432: STR
2433: PUSH
2434: EMPTY
2435: LIST
2436: LIST
2437: LIST
2438: LIST
2439: ST_TO_ADDR
// ToLua ( _McSkirmish.addVehicle( & vehgroup & ,  & GetChassis ( veh ) & ,  & GetEngine ( veh ) & ,  & GetControl ( veh ) & ,  & GetWeapon ( veh ) & ,  & num & ,  & veh & ) ) ;
2440: LD_STRING _McSkirmish.addVehicle(
2442: PUSH
2443: LD_VAR 0 3
2447: STR
2448: PUSH
2449: LD_STRING , 
2451: STR
2452: PUSH
2453: LD_VAR 0 1
2457: PPUSH
2458: CALL_OW 265
2462: STR
2463: PUSH
2464: LD_STRING , 
2466: STR
2467: PUSH
2468: LD_VAR 0 1
2472: PPUSH
2473: CALL_OW 262
2477: STR
2478: PUSH
2479: LD_STRING , 
2481: STR
2482: PUSH
2483: LD_VAR 0 1
2487: PPUSH
2488: CALL_OW 263
2492: STR
2493: PUSH
2494: LD_STRING , 
2496: STR
2497: PUSH
2498: LD_VAR 0 1
2502: PPUSH
2503: CALL_OW 264
2507: STR
2508: PUSH
2509: LD_STRING , 
2511: STR
2512: PUSH
2513: LD_VAR 0 4
2517: STR
2518: PUSH
2519: LD_STRING , 
2521: STR
2522: PUSH
2523: LD_VAR 0 1
2527: STR
2528: PUSH
2529: LD_STRING )
2531: STR
2532: PPUSH
2533: CALL_OW 559
// ComMoveXY ( veh , Parkings [ vehgroup ] [ 1 ] , Parkings [ vehgroup ] [ 2 ] ) ;
2537: LD_VAR 0 1
2541: PPUSH
2542: LD_LOC 10
2546: PUSH
2547: LD_VAR 0 3
2551: ARRAY
2552: PUSH
2553: LD_INT 1
2555: ARRAY
2556: PPUSH
2557: LD_LOC 10
2561: PUSH
2562: LD_VAR 0 3
2566: ARRAY
2567: PUSH
2568: LD_INT 2
2570: ARRAY
2571: PPUSH
2572: CALL_OW 111
// if UnitsInside ( veh ) > 0 then
2576: LD_VAR 0 1
2580: PPUSH
2581: CALL_OW 313
2585: PUSH
2586: LD_INT 0
2588: GREATER
2589: IFFALSE 2605
// AddComExitVehicle ( UnitsInside ( veh ) ) ;
2591: LD_VAR 0 1
2595: PPUSH
2596: CALL_OW 313
2600: PPUSH
2601: CALL_OW 181
// end ;
2605: PPOPN 4
2607: END
// on VehicleConstructed ( vehicle , factory ) do var id ;
2608: LD_INT 0
2610: PPUSH
// begin for id in strategy do
2611: LD_ADDR_VAR 0 3
2615: PUSH
2616: LD_LOC 2
2620: PUSH
2621: FOR_IN
2622: IFFALSE 2677
// if id [ 1 ] = mcs_Veh then
2624: LD_VAR 0 3
2628: PUSH
2629: LD_INT 1
2631: ARRAY
2632: PUSH
2633: LD_INT 4
2635: EQUAL
2636: IFFALSE 2675
// begin strategy = strategy diff [ id ] ;
2638: LD_ADDR_LOC 2
2642: PUSH
2643: LD_LOC 2
2647: PUSH
2648: LD_VAR 0 3
2652: PUSH
2653: EMPTY
2654: LIST
2655: DIFF
2656: ST_TO_ADDR
// McSSetStrategy ( _McSkirmish , strategy ) ;
2657: LD_EXP 1
2661: PPUSH
2662: LD_LOC 2
2666: PPUSH
2667: CALL_OW 410
// exit ;
2671: POP
2672: POP
2673: GO 2679
// end ;
2675: GO 2621
2677: POP
2678: POP
// end ;
2679: PPOPN 3
2681: END
// function getLength ( table ) ; var variable , counter ; begin
2682: LD_INT 0
2684: PPUSH
2685: PPUSH
2686: PPUSH
// for variable in table do
2687: LD_ADDR_VAR 0 3
2691: PUSH
2692: LD_VAR 0 1
2696: PUSH
2697: FOR_IN
2698: IFFALSE 2716
// counter = counter + 1 ;
2700: LD_ADDR_VAR 0 4
2704: PUSH
2705: LD_VAR 0 4
2709: PUSH
2710: LD_INT 1
2712: PLUS
2713: ST_TO_ADDR
2714: GO 2697
2716: POP
2717: POP
// result := counter ;
2718: LD_ADDR_VAR 0 2
2722: PUSH
2723: LD_VAR 0 4
2727: ST_TO_ADDR
// end ;
2728: LD_VAR 0 2
2732: RET
// on UpgradeComplete ( building ) do var id , shape ;
2733: LD_INT 0
2735: PPUSH
2736: PPUSH
// if GetBType ( building ) = b_workshop or GetBType ( building ) = b_factory then
2737: LD_VAR 0 1
2741: PPUSH
2742: CALL_OW 266
2746: PUSH
2747: LD_INT 2
2749: EQUAL
2750: PUSH
2751: LD_VAR 0 1
2755: PPUSH
2756: CALL_OW 266
2760: PUSH
2761: LD_INT 3
2763: EQUAL
2764: OR
2765: IFFALSE 2844
// begin shape := GetExtPositions ( building ) ;
2767: LD_ADDR_VAR 0 3
2771: PUSH
2772: LD_VAR 0 1
2776: PPUSH
2777: CALL_OW 270
2781: ST_TO_ADDR
// Debug := shape ;
2782: LD_ADDR_LOC 3
2786: PUSH
2787: LD_VAR 0 3
2791: ST_TO_ADDR
// for id in shape do
2792: LD_ADDR_VAR 0 2
2796: PUSH
2797: LD_VAR 0 3
2801: PUSH
2802: FOR_IN
2803: IFFALSE 2842
// ToLua ( _McSkirmish.shapeExt( & id [ 1 ] & ,  & id [ 2 ] & ) ) ;
2805: LD_STRING _McSkirmish.shapeExt(
2807: PUSH
2808: LD_VAR 0 2
2812: PUSH
2813: LD_INT 1
2815: ARRAY
2816: STR
2817: PUSH
2818: LD_STRING , 
2820: STR
2821: PUSH
2822: LD_VAR 0 2
2826: PUSH
2827: LD_INT 2
2829: ARRAY
2830: STR
2831: PUSH
2832: LD_STRING )
2834: STR
2835: PPUSH
2836: CALL_OW 559
2840: GO 2802
2842: POP
2843: POP
// end ;
2844: PPOPN 3
2846: END
// on BuildingComplete ( building ) do var id , shape ;
2847: LD_INT 0
2849: PPUSH
2850: PPUSH
// begin if GetBType ( building ) = b_workshop or GetBType ( building ) = b_factory then
2851: LD_VAR 0 1
2855: PPUSH
2856: CALL_OW 266
2860: PUSH
2861: LD_INT 2
2863: EQUAL
2864: PUSH
2865: LD_VAR 0 1
2869: PPUSH
2870: CALL_OW 266
2874: PUSH
2875: LD_INT 3
2877: EQUAL
2878: OR
2879: IFFALSE 2993
// begin shape := GetExtPositions ( building ) ;
2881: LD_ADDR_VAR 0 3
2885: PUSH
2886: LD_VAR 0 1
2890: PPUSH
2891: CALL_OW 270
2895: ST_TO_ADDR
// Debug := GetExtPositions ( building ) ;
2896: LD_ADDR_LOC 3
2900: PUSH
2901: LD_VAR 0 1
2905: PPUSH
2906: CALL_OW 270
2910: ST_TO_ADDR
// for id in shape do
2911: LD_ADDR_VAR 0 2
2915: PUSH
2916: LD_VAR 0 3
2920: PUSH
2921: FOR_IN
2922: IFFALSE 2991
// ToLua ( _McSkirmish.shape( & id [ 1 ] & ,  & id [ 2 ] & ,  & GetX ( building ) & ,  & GetY ( building ) & ) ) ;
2924: LD_STRING _McSkirmish.shape(
2926: PUSH
2927: LD_VAR 0 2
2931: PUSH
2932: LD_INT 1
2934: ARRAY
2935: STR
2936: PUSH
2937: LD_STRING , 
2939: STR
2940: PUSH
2941: LD_VAR 0 2
2945: PUSH
2946: LD_INT 2
2948: ARRAY
2949: STR
2950: PUSH
2951: LD_STRING , 
2953: STR
2954: PUSH
2955: LD_VAR 0 1
2959: PPUSH
2960: CALL_OW 250
2964: STR
2965: PUSH
2966: LD_STRING , 
2968: STR
2969: PUSH
2970: LD_VAR 0 1
2974: PPUSH
2975: CALL_OW 251
2979: STR
2980: PUSH
2981: LD_STRING )
2983: STR
2984: PPUSH
2985: CALL_OW 559
2989: GO 2921
2991: POP
2992: POP
// end ; for id in strategy do
2993: LD_ADDR_VAR 0 2
2997: PUSH
2998: LD_LOC 2
3002: PUSH
3003: FOR_IN
3004: IFFALSE 3160
// begin if not GetBType ( building ) = b_depot and not GetBType ( building ) = b_warehouse then
3006: LD_VAR 0 1
3010: PPUSH
3011: CALL_OW 266
3015: PUSH
3016: LD_INT 0
3018: EQUAL
3019: NOT
3020: PUSH
3021: LD_VAR 0 1
3025: PPUSH
3026: CALL_OW 266
3030: PUSH
3031: LD_INT 1
3033: EQUAL
3034: NOT
3035: AND
3036: IFFALSE 3158
// begin if id [ 1 ] = mcs_Build and id [ 2 ] = GetBType ( building ) then
3038: LD_VAR 0 2
3042: PUSH
3043: LD_INT 1
3045: ARRAY
3046: PUSH
3047: LD_INT 1
3049: EQUAL
3050: PUSH
3051: LD_VAR 0 2
3055: PUSH
3056: LD_INT 2
3058: ARRAY
3059: PUSH
3060: LD_VAR 0 1
3064: PPUSH
3065: CALL_OW 266
3069: EQUAL
3070: AND
3071: IFFALSE 3094
// begin strategy = strategy diff [ id ] ;
3073: LD_ADDR_LOC 2
3077: PUSH
3078: LD_LOC 2
3082: PUSH
3083: LD_VAR 0 2
3087: PUSH
3088: EMPTY
3089: LIST
3090: DIFF
3091: ST_TO_ADDR
// break ;
3092: GO 3160
// end ; if id [ 1 ] = mcs_Build and id [ 2 ] = 9 and GetBType ( building ) = b_lab then
3094: LD_VAR 0 2
3098: PUSH
3099: LD_INT 1
3101: ARRAY
3102: PUSH
3103: LD_INT 1
3105: EQUAL
3106: PUSH
3107: LD_VAR 0 2
3111: PUSH
3112: LD_INT 2
3114: ARRAY
3115: PUSH
3116: LD_INT 9
3118: EQUAL
3119: AND
3120: PUSH
3121: LD_VAR 0 1
3125: PPUSH
3126: CALL_OW 266
3130: PUSH
3131: LD_INT 6
3133: EQUAL
3134: AND
3135: IFFALSE 3158
// begin strategy = strategy diff [ id ] ;
3137: LD_ADDR_LOC 2
3141: PUSH
3142: LD_LOC 2
3146: PUSH
3147: LD_VAR 0 2
3151: PUSH
3152: EMPTY
3153: LIST
3154: DIFF
3155: ST_TO_ADDR
// break ;
3156: GO 3160
// end ; end ; end ;
3158: GO 3003
3160: POP
3161: POP
// McSSetStrategy ( _McSkirmish , strategy ) ;
3162: LD_EXP 1
3166: PPUSH
3167: LD_LOC 2
3171: PPUSH
3172: CALL_OW 410
// shape := GetBuildingShape ( GetBType ( building ) , getDir ( building ) ) ;
3176: LD_ADDR_VAR 0 3
3180: PUSH
3181: LD_VAR 0 1
3185: PPUSH
3186: CALL_OW 266
3190: PPUSH
3191: LD_VAR 0 1
3195: PPUSH
3196: CALL_OW 254
3200: PPUSH
3201: CALL_OW 533
3205: ST_TO_ADDR
// for id in shape do
3206: LD_ADDR_VAR 0 2
3210: PUSH
3211: LD_VAR 0 3
3215: PUSH
3216: FOR_IN
3217: IFFALSE 3286
// ToLua ( _McSkirmish.removeShape( & id [ 1 ] & ,  & id [ 2 ] & ,  & GetX ( building ) & ,  & GetY ( building ) & ) ) ;
3219: LD_STRING _McSkirmish.removeShape(
3221: PUSH
3222: LD_VAR 0 2
3226: PUSH
3227: LD_INT 1
3229: ARRAY
3230: STR
3231: PUSH
3232: LD_STRING , 
3234: STR
3235: PUSH
3236: LD_VAR 0 2
3240: PUSH
3241: LD_INT 2
3243: ARRAY
3244: STR
3245: PUSH
3246: LD_STRING , 
3248: STR
3249: PUSH
3250: LD_VAR 0 1
3254: PPUSH
3255: CALL_OW 250
3259: STR
3260: PUSH
3261: LD_STRING , 
3263: STR
3264: PUSH
3265: LD_VAR 0 1
3269: PPUSH
3270: CALL_OW 251
3274: STR
3275: PUSH
3276: LD_STRING )
3278: STR
3279: PPUSH
3280: CALL_OW 559
3284: GO 3216
3286: POP
3287: POP
// ToLua ( _McSkirmish.removeShape(0, 0,  & GetX ( building ) & ,  & GetY ( building ) & ) ) ;
3288: LD_STRING _McSkirmish.removeShape(0, 0, 
3290: PUSH
3291: LD_VAR 0 1
3295: PPUSH
3296: CALL_OW 250
3300: STR
3301: PUSH
3302: LD_STRING , 
3304: STR
3305: PUSH
3306: LD_VAR 0 1
3310: PPUSH
3311: CALL_OW 251
3315: STR
3316: PUSH
3317: LD_STRING )
3319: STR
3320: PPUSH
3321: CALL_OW 559
// end ;
3325: PPOPN 3
3327: END
// on ResearchComplete ( technology , laboratory ) do begin ToLua ( _McSkirmish.completeResearch( & technology & ) ) ;
3328: LD_STRING _McSkirmish.completeResearch(
3330: PUSH
3331: LD_VAR 0 1
3335: STR
3336: PUSH
3337: LD_STRING )
3339: STR
3340: PPUSH
3341: CALL_OW 559
// strategy = strategy diff [ [ mcs_Tech , technology ] ] ;
3345: LD_ADDR_LOC 2
3349: PUSH
3350: LD_LOC 2
3354: PUSH
3355: LD_INT 3
3357: PUSH
3358: LD_VAR 0 1
3362: PUSH
3363: EMPTY
3364: LIST
3365: LIST
3366: PUSH
3367: EMPTY
3368: LIST
3369: DIFF
3370: ST_TO_ADDR
// McSSetStrategy ( _McSkirmish , strategy ) ;
3371: LD_EXP 1
3375: PPUSH
3376: LD_LOC 2
3380: PPUSH
3381: CALL_OW 410
// end ;
3385: PPOPN 2
3387: END
// on ClassChanged ( un , OldProf , NewProf ) do ToLua ( _McSkirmish.updateUnit( & un & ) ) ;
3388: LD_STRING _McSkirmish.updateUnit(
3390: PUSH
3391: LD_VAR 0 1
3395: STR
3396: PUSH
3397: LD_STRING )
3399: STR
3400: PPUSH
3401: CALL_OW 559
3405: PPOPN 3
3407: END
// every 0 0$1.5 marked 1 do var ident , list , lab , found , process ;
3408: GO 3410
3410: DISABLE
3411: LD_INT 0
3413: PPUSH
3414: PPUSH
3415: PPUSH
3416: PPUSH
3417: PPUSH
// begin disable ( 1 ) ;
3418: LD_INT 1
3420: DISABLE_MARKED
// found = false ;
3421: LD_ADDR_VAR 0 4
3425: PUSH
3426: LD_INT 0
3428: ST_TO_ADDR
// process =  ;
3429: LD_ADDR_VAR 0 5
3433: PUSH
3434: LD_STRING 
3436: ST_TO_ADDR
// list := FilterAllUnits ( [ [ f_side , 2 ] , [ f_or , [ f_btype , b_lab ] , [ f_btype , b_lab_half ] , [ f_btype , b_lab_full ] ] ] ) ;
3437: LD_ADDR_VAR 0 2
3441: PUSH
3442: LD_INT 22
3444: PUSH
3445: LD_INT 2
3447: PUSH
3448: EMPTY
3449: LIST
3450: LIST
3451: PUSH
3452: LD_INT 2
3454: PUSH
3455: LD_INT 30
3457: PUSH
3458: LD_INT 6
3460: PUSH
3461: EMPTY
3462: LIST
3463: LIST
3464: PUSH
3465: LD_INT 30
3467: PUSH
3468: LD_INT 7
3470: PUSH
3471: EMPTY
3472: LIST
3473: LIST
3474: PUSH
3475: LD_INT 30
3477: PUSH
3478: LD_INT 8
3480: PUSH
3481: EMPTY
3482: LIST
3483: LIST
3484: PUSH
3485: EMPTY
3486: LIST
3487: LIST
3488: LIST
3489: LIST
3490: PUSH
3491: EMPTY
3492: LIST
3493: LIST
3494: PPUSH
3495: CALL_OW 69
3499: ST_TO_ADDR
// if list > 0 then
3500: LD_VAR 0 2
3504: PUSH
3505: LD_INT 0
3507: GREATER
3508: IFFALSE 3670
// for ident in strategy do
3510: LD_ADDR_VAR 0 1
3514: PUSH
3515: LD_LOC 2
3519: PUSH
3520: FOR_IN
3521: IFFALSE 3668
// if ident [ 1 ] = mcs_Tech then
3523: LD_VAR 0 1
3527: PUSH
3528: LD_INT 1
3530: ARRAY
3531: PUSH
3532: LD_INT 3
3534: EQUAL
3535: IFFALSE 3666
// begin process = true ;
3537: LD_ADDR_VAR 0 5
3541: PUSH
3542: LD_INT 1
3544: ST_TO_ADDR
// if not GetTechLab ( ident [ 2 ] ) = 9 then
3545: LD_VAR 0 1
3549: PUSH
3550: LD_INT 2
3552: ARRAY
3553: PPUSH
3554: CALL_OW 481
3558: PUSH
3559: LD_INT 9
3561: EQUAL
3562: NOT
3563: IFFALSE 3666
// for lab in list do
3565: LD_ADDR_VAR 0 3
3569: PUSH
3570: LD_VAR 0 2
3574: PUSH
3575: FOR_IN
3576: IFFALSE 3664
// if ( GetLabKind ( lab , 1 ) = GetTechLab ( ident [ 2 ] ) or GetLabKind ( lab , 2 ) = GetTechLab ( ident [ 2 ] ) ) then
3578: LD_VAR 0 3
3582: PPUSH
3583: LD_INT 1
3585: PPUSH
3586: CALL_OW 268
3590: PUSH
3591: LD_VAR 0 1
3595: PUSH
3596: LD_INT 2
3598: ARRAY
3599: PPUSH
3600: CALL_OW 481
3604: EQUAL
3605: PUSH
3606: LD_VAR 0 3
3610: PPUSH
3611: LD_INT 2
3613: PPUSH
3614: CALL_OW 268
3618: PUSH
3619: LD_VAR 0 1
3623: PUSH
3624: LD_INT 2
3626: ARRAY
3627: PPUSH
3628: CALL_OW 481
3632: EQUAL
3633: OR
3634: IFFALSE 3662
// begin found = true ;
3636: LD_ADDR_VAR 0 4
3640: PUSH
3641: LD_INT 1
3643: ST_TO_ADDR
// process = false ;
3644: LD_ADDR_VAR 0 5
3648: PUSH
3649: LD_INT 0
3651: ST_TO_ADDR
// wait ( 0 0$1 ) ;
3652: LD_INT 35
3654: PPUSH
3655: CALL_OW 67
// enable ( 1 ) ;
3659: LD_INT 1
3661: ENABLE_MARKED
// end ;
3662: GO 3575
3664: POP
3665: POP
// end ;
3666: GO 3520
3668: POP
3669: POP
// if list > 0 and process = true and found = false > 0 then
3670: LD_VAR 0 2
3674: PUSH
3675: LD_INT 0
3677: GREATER
3678: PUSH
3679: LD_VAR 0 5
3683: PUSH
3684: LD_INT 1
3686: EQUAL
3687: AND
3688: PUSH
3689: LD_VAR 0 4
3693: PUSH
3694: LD_INT 0
3696: EQUAL
3697: PUSH
3698: LD_INT 0
3700: GREATER
3701: AND
3702: IFFALSE 3827
// begin lab = list [ Rand ( 1 , list ) ] ;
3704: LD_ADDR_VAR 0 3
3708: PUSH
3709: LD_VAR 0 2
3713: PUSH
3714: LD_INT 1
3716: PPUSH
3717: LD_VAR 0 2
3721: PPUSH
3722: CALL_OW 12
3726: ARRAY
3727: ST_TO_ADDR
// if not BuildingStatus ( lab ) = bs_build and ( GetLabKind ( lab , 1 ) = 9 or GetLabKind ( lab , 2 ) = 9 ) then
3728: LD_VAR 0 3
3732: PPUSH
3733: CALL_OW 461
3737: PUSH
3738: LD_INT 1
3740: EQUAL
3741: NOT
3742: PUSH
3743: LD_VAR 0 3
3747: PPUSH
3748: LD_INT 1
3750: PPUSH
3751: CALL_OW 268
3755: PUSH
3756: LD_INT 9
3758: EQUAL
3759: PUSH
3760: LD_VAR 0 3
3764: PPUSH
3765: LD_INT 2
3767: PPUSH
3768: CALL_OW 268
3772: PUSH
3773: LD_INT 9
3775: EQUAL
3776: OR
3777: AND
3778: IFFALSE 3827
// begin ComUpgradeLab ( list [ Rand ( 1 , list ) ] , GetTechLab ( ident [ 2 ] ) ) ;
3780: LD_VAR 0 2
3784: PUSH
3785: LD_INT 1
3787: PPUSH
3788: LD_VAR 0 2
3792: PPUSH
3793: CALL_OW 12
3797: ARRAY
3798: PPUSH
3799: LD_VAR 0 1
3803: PUSH
3804: LD_INT 2
3806: ARRAY
3807: PPUSH
3808: CALL_OW 481
3812: PPUSH
3813: CALL_OW 147
// wait ( 0 0$1 ) ;
3817: LD_INT 35
3819: PPUSH
3820: CALL_OW 67
// enable ( 1 ) ;
3824: LD_INT 1
3826: ENABLE_MARKED
// end ; end ; enable ;
3827: ENABLE
// end ;
3828: PPOPN 5
3830: END
// do var i ;
3831: GO 3833
3833: DISABLE
3834: LD_INT 0
3836: PPUSH
// for i = 1 to 71 do
3837: LD_ADDR_VAR 0 1
3841: PUSH
3842: DOUBLE
3843: LD_INT 1
3845: DEC
3846: ST_TO_ADDR
3847: LD_INT 71
3849: PUSH
3850: FOR_TO
3851: IFFALSE 3887
// if not TechNationAvailable ( i , nation_arabian ) then
3853: LD_VAR 0 1
3857: PPUSH
3858: LD_INT 2
3860: PPUSH
3861: CALL_OW 482
3865: NOT
3866: IFFALSE 3885
// ToLua ( _McSkirmish.disableTechnology( & i & ) ) ;
3868: LD_STRING _McSkirmish.disableTechnology(
3870: PUSH
3871: LD_VAR 0 1
3875: STR
3876: PUSH
3877: LD_STRING )
3879: STR
3880: PPUSH
3881: CALL_OW 559
3885: GO 3850
3887: POP
3888: POP
3889: PPOPN 1
3891: END
