0:15
0:15
0:15
0:15
0:15
0:15
0:15
0:15
0:15
0:15
0:15
0:16
0:16
0:16
0:16
0:16
0:16
0:16
0:16
0:17
0:17
0:17
0:17
0:17
0:17
0:17
0:17
0:19
0:19
0:19
0:19
0:19
0:19
0:19
0:19
0:19
0:19
0:19
0:19
0:19
0:19
0:19
0:19
0:19
0:19
0:19
0:19
0:19
0:19
0:19
0:19
0:19
0:20
0:20
0:20
0:20
0:20
0:20
0:20
0:20
0:20
0:20
0:20
0:20
0:20
0:20
0:20
0:20
0:20
0:20
0:20
0:20
0:20
0:20
0:20
0:20
0:20
0:21
0:21
0:21
0:21
0:21
0:21
0:21
0:21
0:21
0:21
0:21
0:21
0:21
0:21
0:21
0:21
0:21
0:21
0:21
0:21
0:21
0:21
0:21
0:21
0:21
0:22
0:22
0:22
0:22
0:22
0:22
0:22
0:22
0:22
0:22
0:22
0:22
0:22
0:22
0:22
0:22
0:22
0:22
0:22
0:22
0:22
0:22
0:22
0:22
0:22
0:23
0:23
0:23
0:23
0:23
0:23
0:23
0:23
0:23
0:23
0:23
0:23
0:23
0:23
0:23
0:23
0:23
0:23
0:23
0:23
0:23
0:23
0:23
0:23
0:23
0:24
0:24
0:24
0:24
0:24
0:24
0:24
0:24
0:24
0:24
0:24
0:24
0:24
0:24
0:24
0:24
0:24
0:24
0:24
0:24
0:24
0:24
0:24
0:24
0:24
0:25
0:25
0:25
0:25
0:25
0:25
0:25
0:25
0:25
0:25
0:25
0:25
0:25
0:25
0:25
0:25
0:25
0:25
0:25
0:25
0:25
0:25
0:25
0:25
0:25
0:26
0:26
0:26
0:26
0:26
0:26
0:26
0:26
0:26
0:26
0:26
0:26
0:26
0:26
0:26
0:26
0:26
0:26
0:26
0:26
0:26
0:26
0:26
0:26
0:26
0:27
0:27
0:27
0:27
0:27
0:27
0:27
0:27
0:27
0:27
0:27
0:27
0:27
0:27
0:27
0:27
0:27
0:27
0:27
0:27
0:27
0:27
0:27
0:27
0:27
0:28
0:28
0:28
0:28
0:28
0:28
0:28
0:28
0:28
0:28
0:28
0:28
0:28
0:28
0:28
0:28
0:28
0:28
0:28
0:28
0:28
0:28
0:28
0:28
0:28
0:29
0:29
0:29
0:29
0:29
0:29
0:29
0:29
0:29
0:29
0:29
0:29
0:29
0:29
0:29
0:29
0:29
0:29
0:29
0:29
0:29
0:29
0:29
0:29
0:29
0:30
0:30
0:30
0:30
0:30
0:30
0:30
0:30
0:30
0:30
0:30
0:30
0:30
0:30
0:30
0:30
0:30
0:30
0:30
0:30
0:30
0:30
0:30
0:30
0:30
0:31
0:31
0:31
0:31
0:31
0:31
0:31
0:31
0:31
0:31
0:31
0:31
0:31
0:31
0:31
0:31
0:31
0:31
0:31
0:31
0:31
0:31
0:31
0:31
0:31
0:32
0:32
0:32
0:32
0:32
0:32
0:32
0:32
0:32
0:32
0:32
0:32
0:32
0:32
0:32
0:32
0:32
0:32
0:32
0:32
0:32
0:32
0:32
0:32
0:32
0:34
0:34
0:34
0:34
0:34
0:34
0:34
0:34
0:34
0:34
0:34
0:34
0:34
0:34
0:34
0:34
0:34
0:34
0:34
0:34
0:34
0:34
0:34
0:34
0:34
0:35
0:35
0:35
0:35
0:35
0:35
0:35
0:35
0:35
0:35
0:35
0:35
0:35
0:35
0:35
0:35
0:35
0:35
0:35
0:35
0:35
0:35
0:35
0:35
0:35
0:36
0:36
0:36
0:36
0:36
0:36
0:36
0:36
0:36
0:36
0:36
0:36
0:36
0:36
0:36
0:36
0:36
0:36
0:36
0:36
0:36
0:36
0:36
0:36
0:36
0:37
0:37
0:37
0:37
0:37
0:37
0:37
0:37
0:37
0:37
0:37
0:37
0:37
0:37
0:37
0:37
0:37
0:37
0:37
0:37
0:37
0:37
0:37
0:37
0:37
0:38
0:38
0:38
0:38
0:38
0:38
0:38
0:38
0:38
0:38
0:38
0:38
0:38
0:38
0:38
0:38
0:38
0:38
0:38
0:38
0:38
0:38
0:38
0:38
0:38
0:39
0:39
0:39
0:39
0:39
0:39
0:39
0:39
0:39
0:39
0:39
0:39
0:39
0:39
0:39
0:39
0:39
0:39
0:39
0:39
0:39
0:39
0:39
0:39
0:39
0:40
0:40
0:40
0:40
0:40
0:40
0:40
0:40
0:40
0:40
0:40
0:40
0:40
0:40
0:40
0:40
0:40
0:40
0:40
0:40
0:40
0:40
0:40
0:40
0:40
0:41
0:41
0:41
0:41
0:41
0:41
0:41
0:41
0:41
0:41
0:41
0:41
0:41
0:41
0:41
0:41
0:41
0:41
0:41
0:41
0:41
0:41
0:41
0:41
0:41
0:43
0:43
0:43
0:43
0:43
0:43
0:43
0:43
0:43
0:43
0:43
0:43
0:43
0:43
0:43
0:43
0:43
0:43
0:43
0:43
0:43
0:43
0:43
0:43
0:43
0:44
0:44
0:44
0:44
0:44
0:44
0:44
0:44
0:44
0:44
0:44
0:44
0:44
0:44
0:44
0:44
0:44
0:44
0:44
0:44
0:44
0:44
0:44
0:44
0:44
0:45
0:45
0:45
0:45
0:45
0:45
0:45
0:45
0:45
0:45
0:45
0:45
0:45
0:45
0:45
0:45
0:45
0:45
0:45
0:45
0:45
0:45
0:45
0:45
0:45
0:46
0:46
0:46
0:46
0:46
0:46
0:46
0:46
0:46
0:46
0:46
0:46
0:46
0:46
0:46
0:46
0:46
0:46
0:46
0:46
0:46
0:46
0:46
0:46
0:46
0:47
0:47
0:47
0:47
0:47
0:47
0:47
0:47
0:47
0:47
0:47
0:47
0:47
0:47
0:47
0:47
0:47
0:47
0:47
0:47
0:47
0:47
0:47
0:47
0:47
0:48
0:48
0:48
0:48
0:48
0:48
0:48
0:48
0:48
0:48
0:48
0:48
0:48
0:48
0:48
0:48
0:48
0:48
0:48
0:48
0:48
0:48
0:48
0:48
0:48
0:49
0:49
0:49
0:49
0:49
0:49
0:49
0:49
0:49
0:49
0:49
0:49
0:49
0:49
0:49
0:49
0:49
0:49
0:49
0:49
0:49
0:49
0:49
0:49
0:49
0:50
0:50
0:50
0:50
0:50
0:50
0:50
0:50
0:50
0:50
0:50
0:50
0:50
0:50
0:50
0:50
0:50
0:50
0:50
0:50
0:50
0:50
0:50
0:50
0:50
0:51
0:51
0:51
0:51
0:51
0:51
0:51
0:51
0:51
0:51
0:51
0:51
0:51
0:51
0:51
0:51
0:51
0:51
0:51
0:51
0:51
0:51
0:51
0:51
0:51
0:52
0:52
0:52
0:52
0:52
0:52
0:52
0:52
0:52
0:52
0:52
0:52
0:52
0:52
0:52
0:52
0:52
0:52
0:52
0:52
0:52
0:52
0:52
0:52
0:52
0:53
0:53
0:53
0:53
0:53
0:53
0:53
0:53
0:53
0:53
0:53
0:53
0:53
0:53
0:53
0:53
0:53
0:53
0:53
0:53
0:53
0:53
0:53
0:53
0:53
0:54
0:54
0:54
0:54
0:54
0:54
0:54
0:54
0:54
0:54
0:54
0:54
0:54
0:54
0:54
0:54
0:54
0:54
0:54
0:54
0:54
0:54
0:54
0:54
0:54
0:55
0:55
0:55
0:55
0:55
0:55
0:55
0:55
0:55
0:55
0:55
0:55
0:55
0:55
0:55
0:55
0:55
0:55
0:55
0:55
0:55
0:55
0:55
0:55
0:55
0:56
0:56
0:56
0:56
0:56
0:56
0:56
0:56
0:56
0:56
0:56
0:56
0:56
0:56
0:56
0:56
0:56
0:56
0:56
0:56
0:56
0:56
0:56
0:56
0:56
0:57
0:57
0:57
0:57
0:57
0:57
0:57
0:57
0:57
0:57
0:57
0:57
0:57
0:57
0:57
0:57
0:57
0:57
0:57
0:57
0:57
0:57
0:57
0:57
0:57
0:59
0:59
0:59
0:59
0:59
0:59
0:59
0:59
0:59
0:59
0:59
0:59
0:59
0:59
0:59
0:59
0:59
0:59
0:59
0:59
0:59
0:59
0:59
0:59
0:59
0:60
0:60
0:60
0:60
0:60
0:60
0:60
0:60
0:60
0:60
0:60
0:60
0:60
0:60
0:60
0:60
0:60
0:60
0:60
0:60
0:60
0:60
0:60
0:60
0:60
0:61
0:61
0:61
0:61
0:61
0:61
0:61
0:61
0:61
0:61
0:61
0:61
0:61
0:61
0:61
0:61
0:61
0:61
0:61
0:61
0:61
0:61
0:61
0:61
0:61
0:62
0:62
0:62
0:62
0:62
0:62
0:62
0:62
0:62
0:62
0:62
0:62
0:62
0:62
0:62
0:62
0:62
0:62
0:62
0:62
0:62
0:62
0:62
0:62
0:62
0:64
0:64
0:64
0:64
0:64
0:70
0:70
0:70
0:70
0:70
0:70
0:70
0:70
0:70
0:70
0:70
0:70
0:70
0:72
0:72
0:72
0:72
0:72
0:72
0:72
0:72
0:73
0:73
0:73
0:74
0:74
0:74
0:75
0:75
0:75
0:76
0:76
0:76
0:77
0:77
0:77
0:78
0:78
0:78
0:79
0:79
0:79
0:81
0:81
0:81
0:81
0:81
0:81
0:81
0:81
0:82
0:82
0:82
0:83
0:83
0:83
0:84
0:84
0:84
0:86
0:86
0:86
0:86
0:86
0:86
0:86
0:86
0:87
0:87
0:87
0:87
0:87
0:87
0:87
0:87
0:87
0:87
0:87
0:87
0:87
0:87
0:87
0:87
0:87
0:87
0:87
0:87
0:87
0:87
0:87
0:87
0:87
0:87
0:87
0:87
0:87
0:87
0:87
0:87
0:87
0:87
0:87
0:87
0:88
0:88
0:88
0:88
0:89
0:89
0:89
0:89
0:89
0:89
0:89
0:89
0:89
0:89
0:90
0:90
0:90
0:90
0:90
0:90
0:90
0:90
0:91
0:91
0:91
0:91
0:91
0:91
0:91
0:91
0:92
0:92
0:92
0:92
0:92
0:92
0:92
0:92
0:93
0:93
0:93
0:93
0:94
0:94
0:94
0:94
0:95
0:95
0:95
0:95
0:95
0:95
0:95
0:95
0:96
0:96
0:96
0:96
0:96
0:96
0:96
0:96
0:96
0:96
0:99
0:99
0:99
0:99
0:99
0:99
0:99
0:99
0:99
0:99
0:99
0:99
0:99
0:100
0:100
0:100
0:100
0:100
0:100
0:100
0:100
0:100
0:100
0:100
0:100
0:100
0:100
0:100
0:100
0:100
0:100
0:100
0:100
0:101
0:101
0:101
0:101
0:101
0:101
0:101
0:101
0:101
0:101
0:101
0:101
0:101
0:101
0:101
0:101
0:101
0:102
0:102
0:102
0:102
0:102
0:102
0:102
0:102
0:103
0:103
0:103
0:103
0:103
0:103
0:103
0:103
0:104
0:104
0:104
0:104
0:104
0:104
0:104
0:104
0:104
0:104
0:105
0:105
0:105
0:105
0:105
0:105
0:105
0:105
0:105
0:105
0:106
0:106
0:106
0:106
0:106
0:106
0:106
0:106
0:106
0:106
0:107
0:107
0:107
0:107
0:107
0:107
0:107
0:107
0:108
0:108
0:108
0:108
0:108
0:108
0:108
0:108
0:109
0:112
0:112
0:112
0:114
0:114
0:114
0:114
0:114
0:114
0:114
0:114
0:114
0:114
0:114
0:114
0:114
0:114
0:114
0:114
0:114
0:114
0:114
0:114
0:114
0:115
0:116
0:118
0:118
0:118
0:120
0:120
0:120
0:120
0:120
0:120
0:120
0:120
0:120
0:120
0:120
0:120
0:120
0:120
0:121
0:121
0:121
0:121
0:121
0:121
0:121
0:121
0:121
0:121
0:122
0:122
0:122
0:122
0:122
0:122
0:122
0:122
0:122
0:122
0:122
0:122
0:122
0:122
0:122
0:123
0:123
0:123
0:123
0:123
0:123
0:123
0:123
0:123
0:123
0:124
0:124
0:124
0:124
0:124
0:124
0:124
0:124
0:124
0:124
0:124
0:124
0:124
0:124
0:125
0:127
0:127
0:127
0:127
0:127
0:127
0:127
0:127
0:127
0:127
0:129
0:129
0:129
0:131
0:131
0:131
0:132
0:134
0:134
0:134
0:136
0:136
0:136
0:136
0:137
1:138
1:7
1:7
1:7
1:7
1:7
1:7
1:8
1:8
1:8
1:8
1:8
1:8
1:8
1:8
1:9
1:9
1:9
1:9
1:9
1:9
1:9
1:9
1:10
1:10
1:10
1:10
1:10
1:10
1:10
1:10
1:11
1:11
1:11
1:11
1:11
1:11
1:11
1:11
1:12
1:12
1:12
1:12
1:12
1:12
1:12
1:12
1:12
1:12
1:13
1:13
1:13
1:13
1:13
1:13
1:13
1:13
1:13
1:13
1:13
1:13
1:14
1:14
1:14
1:14
1:14
1:14
1:14
1:14
1:14
1:14
1:14
1:14
1:14
1:14
1:14
1:14
1:14
1:14
1:15
1:15
1:15
1:15
1:15
1:15
1:15
1:15
1:15
1:15
1:15
1:15
1:15
1:15
1:16
1:16
1:16
1:16
1:16
1:16
1:16
1:16
1:16
1:16
1:17
1:17
1:17
1:17
1:17
1:17
1:17
1:17
1:17
1:17
1:17
1:17
1:18
1:18
1:18
1:18
1:18
1:18
1:18
1:18
1:18
1:18
1:18
1:18
1:18
1:18
1:18
1:18
1:18
1:18
1:19
1:19
1:19
1:19
1:19
1:19
1:19
1:19
1:19
1:19
1:19
1:19
1:19
1:19
1:20
1:20
1:20
1:20
1:20
1:20
1:20
1:20
1:21
1:21
1:21
1:21
1:21
1:21
1:21
1:21
1:22
1:22
1:22
1:22
1:22
1:22
1:22
1:22
1:22
1:22
1:22
1:22
1:22
1:23
1:23
1:23
1:23
1:23
1:23
1:23
1:23
1:23
1:23
1:24
1:24
1:24
1:24
1:24
1:24
1:24
1:24
1:24
1:24
1:24
1:24
1:24
1:24
1:24
1:24
1:24
1:24
1:24
1:25
1:25
1:25
1:25
1:25
1:25
1:25
1:25
1:26
1:26
1:26
1:26
1:26
1:26
1:26
1:26
1:26
1:26
1:27
1:27
1:27
1:27
1:27
1:27
1:27
1:27
1:27
1:27
1:28
1:28
1:28
1:28
1:28
1:28
1:28
1:28
1:28
1:28
1:28
1:28
1:28
1:28
1:28
1:29
1:29
1:29
1:29
1:29
1:29
1:29
1:29
1:29
1:29
1:29
1:29
1:29
1:29
1:31
1:31
1:31
1:31
1:31
1:31
1:31
1:31
1:31
1:31
1:31
1:31
1:32
1:32
1:32
1:32
1:32
1:32
1:32
1:32
1:32
1:32
1:32
1:32
1:32
1:32
1:32
1:32
1:32
1:32
1:32
1:32
1:32
1:33
1:33
1:33
1:33
1:33
1:33
1:33
1:33
1:33
1:33
1:33
1:33
1:33
1:33
1:34
1:34
1:34
1:34
1:36
1:36
1:36
1:36
1:36
1:36
1:36
1:36
1:36
1:36
1:38
1:38
1:38
1:38
1:38
1:38
1:38
1:38
1:38
1:38
1:38
1:38
1:41
1:41
1:41
1:41
1:41
1:41
1:41
1:41
1:41
1:41
1:41
1:41
1:42
1:42
1:42
1:42
1:42
1:42
1:42
1:42
1:42
1:42
1:42
1:42
1:44
1:44
1:44
1:44
1:44
1:44
1:44
1:46
1:46
1:46
1:46
1:46
1:46
1:46
2:47
2:47
2:47
2:47
2:47
2:4
2:4
2:4
2:4
2:4
2:4
2:8
2:8
2:8
2:8
2:8
2:8
2:8
2:8
2:8
2:8
2:8
2:8
2:9
2:9
2:9
2:9
2:9
2:9
2:9
2:9
2:9
2:9
2:9
2:9
2:10
2:10
2:10
2:10
2:10
2:10
2:10
2:10
2:10
2:10
2:10
2:10
2:11
2:11
2:11
2:11
2:11
2:11
2:11
2:11
2:11
2:11
2:11
2:11
2:12
2:12
2:12
2:12
2:12
2:12
2:12
2:12
2:12
2:12
2:12
2:12
2:13
2:13
2:13
2:13
2:13
2:13
2:13
2:13
2:13
2:13
2:13
2:13
2:14
2:14
2:14
2:14
2:14
2:14
2:14
2:14
2:14
2:14
2:14
2:14
2:15
2:15
2:15
2:15
2:15
2:15
2:15
2:15
2:15
2:15
2:15
2:15
2:16
2:16
2:16
2:16
2:16
2:16
2:16
2:16
2:16
2:16
2:16
2:16
2:16
2:16
2:16
2:16
2:16
2:16
2:16
2:16
2:16
2:16
2:16
2:16
2:16
2:16
2:16
2:16
2:16
2:16
2:16
2:16
2:16
2:16
2:16
2:16
2:16
2:16
2:16
2:16
2:16
2:16
2:16
2:16
2:16
2:16
2:16
2:16
2:16
2:16
2:16
2:16
2:16
2:16
2:16
2:16
2:16
2:16
2:16
2:16
2:16
2:16
2:16
2:16
2:16
2:16
2:16
2:16
2:16
2:16
2:16
2:16
2:16
2:16
2:16
2:16
2:16
2:16
2:16
2:16
2:16
2:16
2:16
2:16
2:16
2:16
2:16
2:16
2:17
2:17
2:17
2:17
2:17
2:17
2:17
2:17
2:17
2:17
2:17
2:17
2:17
2:17
2:17
2:17
2:17
2:17
2:19
2:19
2:19
2:19
2:19
2:19
2:19
2:20
2:20
2:20
2:22
2:22
2:22
2:24
2:24
2:24
2:24
2:24
2:24
2:24
2:24
2:24
2:24
2:24
2:24
2:25
2:25
2:25
2:25
2:25
2:25
2:25
2:25
2:25
2:25
2:25
2:25
2:25
2:25
2:25
2:26
2:26
2:26
2:26
2:26
2:26
2:26
2:26
2:26
2:26
2:26
2:26
2:26
2:26
2:28
2:28
2:28
2:28
2:28
2:28
2:28
2:28
2:28
2:28
2:28
2:28
2:28
2:28
2:28
2:29
2:29
2:29
2:30
2:32
2:32
2:32
2:32
2:32
2:32
2:32
2:32
2:32
2:32
2:32
2:32
2:32
2:32
2:32
2:32
2:32
2:32
2:32
2:32
2:34
2:34
2:34
2:34
2:34
2:34
2:34
2:34
2:34
2:34
2:34
2:34
2:34
2:34
2:34
2:34
2:38
2:38
2:38
2:38
2:38
2:38
2:38
2:38
2:38
2:38
2:38
2:38
2:38
2:38
2:38
2:38
2:38
2:38
2:38
2:38
2:38
2:38
2:38
2:38
2:38
2:38
2:38
2:38
2:38
2:38
2:38
2:38
2:38
2:38
2:38
2:38
2:38
2:40
2:40
2:40
2:40
2:40
2:40
2:43
2:43
2:43
2:43
2:43
2:43
2:43
2:43
2:43
2:43
2:43
2:43
2:43
2:43
2:43
2:43
2:43
2:43
2:43
2:43
2:43
2:43
2:43
2:43
2:43
2:43
2:43
2:43
2:44
2:44
2:44
2:44
2:44
2:44
2:45
2:45
2:45
2:45
2:45
2:45
2:45
2:45
2:45
2:45
2:45
2:45
2:45
2:46
2:46
2:46
2:46
2:46
2:46
2:46
2:46
2:48
2:48
2:48
2:49
2:49
2:49
2:52
2:52
2:52
2:52
2:52
2:52
2:52
2:52
2:52
2:52
2:52
2:52
2:52
2:52
2:52
2:52
2:52
2:52
2:52
2:52
2:52
2:52
2:55
2:55
2:55
2:55
2:55
2:55
2:55
2:55
2:55
2:55
2:55
2:55
2:55
2:55
2:55
2:55
2:55
2:55
2:55
2:55
2:55
2:55
2:55
2:55
2:55
2:55
2:55
2:55
2:55
2:55
2:55
2:55
2:55
2:55
2:55
2:55
2:55
2:55
2:55
2:55
2:55
2:55
2:55
2:55
2:55
2:55
2:55
2:55
2:55
2:55
2:55
2:55
2:55
2:55
2:55
2:55
2:55
2:55
2:55
2:55
2:55
2:55
2:55
2:55
2:55
2:55
2:55
2:55
2:55
2:55
2:55
2:55
2:55
2:55
2:55
2:55
2:55
2:55
2:55
2:55
2:55
2:55
2:55
2:55
2:55
2:55
2:55
2:55
2:55
2:55
2:55
2:55
2:55
2:55
2:55
2:55
2:55
2:55
2:55
2:56
2:56
2:56
2:56
2:56
2:56
2:56
2:56
2:56
2:56
2:56
2:56
2:56
2:56
2:56
2:57
2:57
2:57
2:57
2:57
2:57
2:57
2:57
2:57
2:57
2:57
2:57
2:57
2:57
2:57
2:57
2:57
2:57
2:57
2:59
2:59
2:59
2:59
2:59
2:59
2:59
2:59
2:59
2:59
2:59
2:59
2:59
2:59
2:59
2:59
2:59
2:59
2:59
2:59
2:59
2:59
2:59
2:59
2:59
2:59
2:61
2:61
2:61
2:61
2:61
2:61
2:61
2:61
2:61
2:61
2:61
2:61
2:61
2:61
2:61
2:61
2:61
2:61
2:64
2:64
2:64
2:64
2:64
2:64
2:64
2:64
2:64
2:64
2:64
2:64
2:64
2:64
2:64
2:64
2:64
2:64
2:64
2:64
2:64
2:64
2:64
2:64
2:64
2:64
2:64
2:64
2:64
2:65
2:65
2:65
2:65
2:65
2:65
2:65
2:65
2:65
2:65
2:65
2:65
2:66
2:66
2:66
2:66
2:66
2:66
2:66
2:66
2:66
2:66
2:66
2:66
2:68
2:68
2:68
2:68
2:68
2:68
2:68
2:68
2:69
2:69
2:69
2:71
2:71
2:71
2:71
2:71
2:71
2:71
2:71
2:71
2:71
2:71
2:71
2:71
2:71
2:71
2:71
2:71
2:71
2:71
2:71
2:71
2:71
2:71
2:71
2:74
2:74
2:74
2:74
2:74
2:74
2:74
2:74
2:74
2:74
2:74
2:74
2:74
2:74
2:74
2:74
2:74
2:74
2:74
2:74
2:74
2:74
2:74
2:74
2:74
2:74
2:74
2:74
2:74
2:74
2:74
2:74
2:74
2:74
2:74
2:74
2:74
2:74
2:74
2:74
2:74
2:74
2:74
2:74
2:74
2:74
2:74
2:74
2:74
2:74
2:74
2:74
2:74
2:74
2:74
2:74
2:74
2:74
2:74
2:74
2:74
2:74
2:74
2:74
2:74
2:74
2:74
2:75
2:75
2:75
2:75
2:75
2:75
2:77
2:77
2:77
2:77
2:77
2:77
2:77
2:77
2:77
2:77
2:77
2:77
2:78
2:78
2:78
2:78
2:78
2:78
2:78
2:78
2:78
2:78
2:78
2:78
2:78
2:78
2:78
2:78
2:78
2:78
2:78
2:78
2:78
2:78
2:80
2:80
2:80
2:80
2:80
2:80
2:80
2:82
2:82
2:84
2:84
2:84
2:84
2:84
2:84
2:84
2:84
2:84
2:84
2:84
2:84
2:85
2:85
2:85
2:85
2:85
2:85
2:85
2:85
2:85
2:85
2:85
2:85
2:85
2:85
2:85
2:85
2:85
2:85
2:85
2:85
2:85
2:85
2:87
2:87
2:87
2:87
2:88
2:88
2:88
2:88
2:88
2:88
2:88
2:90
2:90
2:90
2:93
2:93
2:93
2:95
2:95
2:95
2:95
2:95
2:95
2:95
2:95
2:95
2:95
2:95
2:95
2:96
2:96
2:96
2:96
2:96
2:96
2:96
2:96
2:96
2:96
2:96
2:96
2:96
2:96
2:96
2:96
2:96
2:96
2:96
2:96
2:96
2:96
2:96
2:96
2:96
2:96
2:96
2:96
2:96
2:96
2:96
2:96
2:96
2:96
2:96
2:96
2:96
2:96
2:96
2:96
2:96
2:96
2:96
2:96
2:96
2:96
2:96
2:96
2:96
2:96
2:96
2:96
2:96
2:96
2:96
2:96
2:96
2:96
2:96
2:96
2:96
2:96
2:96
2:96
2:96
2:96
2:96
2:98
2:98
2:98
2:98
2:98
2:98
2:98
2:98
2:98
2:98
2:98
2:98
2:99
2:99
2:99
2:99
2:99
2:99
2:100
2:100
2:100
2:100
2:100
2:100
2:100
2:100
2:100
2:100
2:100
2:100
2:100
2:100
2:100
2:100
2:100
2:100
2:100
2:100
2:100
2:100
2:100
2:100
2:100
2:100
2:100
2:100
2:100
2:100
2:100
2:100
2:100
2:100
2:100
2:100
2:100
2:101
2:101
2:101
2:101
2:101
2:101
2:101
2:101
2:101
2:101
2:101
2:101
2:101
2:101
2:101
2:101
2:102
2:102
2:102
2:102
2:102
2:102
2:102
2:102
2:102
2:102
2:102
2:102
2:104
2:104
2:104
2:104
2:104
2:104
2:104
2:106
2:106
2:106
2:106
2:106
2:106
2:106
2:106
2:106
2:106
2:106
2:106
2:106
2:106
2:106
2:106
2:106
2:106
2:106
2:106
2:106
2:106
2:106
2:107
2:107
2:107
2:107
2:107
2:107
2:107
2:107
2:107
2:107
2:107
2:107
2:107
2:107
2:107
2:107
2:107
2:107
2:107
2:107
2:107
2:107
2:107
2:110
2:110
2:110
2:110
2:110
2:110
2:110
2:110
2:110
2:110
2:110
2:110
2:110
2:110
2:110
2:110
2:110
2:110
2:110
2:110
2:110
2:110
2:110
2:110
2:110
2:110
2:111
2:111
2:111
2:111
2:111
2:111
2:111
2:111
2:111
2:111
2:111
2:111
2:111
2:111
2:111
2:111
2:111
2:111
2:111
2:111
2:111
2:111
2:111
2:111
2:111
2:111
2:111
2:111
2:111
2:111
2:111
2:111
2:111
2:111
2:111
2:115
2:115
2:115
2:115
2:115
2:117
2:117
2:117
2:117
2:117
2:117
2:117
2:117
2:117
2:117
2:119
2:119
2:119
2:119
2:119
2:119
2:119
2:119
2:119
2:119
2:119
2:119
2:119
2:119
2:119
2:119
2:119
2:119
2:119
2:119
2:119
2:119
2:119
2:119
2:119
2:121
2:121
2:121
2:121
2:121
2:121
2:121
2:121
2:121
2:121
2:121
2:121
2:121
2:121
2:121
2:121
2:121
2:121
2:121
2:121
2:121
2:121
2:121
2:121
2:121
2:121
2:121
2:121
2:121
2:121
2:121
2:121
2:121
2:121
2:121
2:121
2:121
2:121
2:121
2:121
2:121
2:121
2:121
2:121
2:121
2:121
2:121
2:121
2:121
2:122
2:122
2:122
2:122
2:122
2:122
2:122
2:123
2:123
2:123
2:123
2:123
2:123
2:123
2:123
2:123
2:123
2:123
2:123
2:123
2:123
2:123
2:123
2:123
2:123
2:123
2:123
2:123
2:123
2:123
2:123
2:123
2:123
2:123
2:123
2:123
2:123
2:123
2:123
2:123
2:123
2:123
2:123
2:123
2:123
2:123
2:123
2:123
2:123
2:123
2:123
2:123
2:123
2:123
2:123
2:123
2:123
2:123
2:123
2:123
2:123
2:123
2:123
2:124
2:124
2:124
2:124
2:124
2:124
2:124
2:125
2:125
2:125
2:125
2:125
2:125
2:125
2:125
2:125
2:125
2:125
2:125
2:125
2:125
2:125
2:125
2:125
2:125
2:125
2:125
2:125
2:125
2:125
2:125
2:125
2:125
2:125
2:125
2:125
2:125
2:125
2:125
2:125
2:125
2:125
2:125
2:125
2:125
2:125
2:125
2:125
2:125
2:125
2:125
2:126
2:126
2:126
2:126
2:126
2:126
2:126
2:126
2:126
2:126
2:126
2:126
2:126
2:126
2:126
2:126
2:126
2:126
2:126
2:126
2:128
2:128
2:128
2:128
2:128
2:128
2:128
2:128
2:128
2:128
2:128
2:128
2:128
2:128
2:128
2:128
2:129
2:129
2:129
2:129
2:129
2:129
2:130
2:130
2:130
2:130
2:130
2:130
2:130
2:130
2:130
2:130
2:130
2:130
2:130
2:130
2:130
2:130
2:130
2:130
2:130
2:130
2:130
2:130
2:130
2:130
2:130
2:130
2:130
2:130
2:130
2:131
2:131
2:131
2:131
2:131
2:131
2:131
2:131
2:131
2:131
2:131
2:131
2:134
2:134
2:134
2:140
2:140
2:140
2:140
2:140
2:140
2:140
2:140
2:140
2:140
2:142
2:142
2:142
2:142
2:142
2:142
2:142
2:142
2:142
2:142
2:142
2:142
2:143
2:143
2:143
2:143
2:143
2:143
2:143
2:143
2:143
2:143
2:143
2:143
2:145
2:145
2:145
2:145
2:145
2:145
2:145
2:145
2:146
2:147
2:147
2:147
2:150
2:150
2:150
2:150
2:150
2:150
2:150
2:150
2:150
2:150
2:150
2:150
2:153
2:153
2:153
2:153
2:153
2:153
2:153
2:154
2:154
2:154
2:154
2:154
2:154
2:154
2:154
2:154
2:154
2:155
2:155
2:155
2:155
2:155
2:155
2:155
2:155
2:156
2:156
2:156
2:156
2:156
2:156
2:156
2:156
2:156
2:156
2:157
2:157
2:157
2:157
2:157
2:157
2:157
2:157
2:158
2:158
2:158
2:158
2:158
2:158
2:158
2:158
2:159
2:159
2:159
2:159
2:159
2:159
2:159
2:159
2:159
2:159
2:160
2:160
2:160
2:160
2:160
2:160
2:160
2:160
2:160
2:160
2:161
2:161
2:161
2:161
2:161
2:161
2:161
2:161
2:161
2:161
2:161
2:161
2:162
2:162
2:162
2:162
2:162
2:162
2:162
2:162
2:162
2:162
2:162
2:162
2:162
2:162
2:162
2:162
2:162
2:162
2:162
2:162
2:162
2:163
2:163
2:163
2:163
2:163
2:163
2:163
2:163
2:163
2:163
2:163
2:163
2:164
2:164
2:164
2:164
2:164
2:164
2:164
2:164
2:164
2:164
2:164
2:164
2:164
2:165
2:165
2:165
2:165
2:165
2:165
2:165
2:165
2:165
2:165
2:165
2:165
2:165
2:165
2:165
2:165
2:165
2:165
2:166
2:166
2:166
2:166
2:166
2:166
2:166
2:166
2:166
2:166
2:167
2:167
2:167
2:167
2:167
2:167
2:167
2:167
2:167
2:167
2:168
2:168
2:168
2:168
2:168
2:168
2:168
2:168
2:168
2:168
2:169
2:169
2:169
2:169
2:169
2:169
2:169
2:169
2:169
2:169
2:169
2:169
2:170
2:170
2:170
2:170
2:170
2:170
2:170
2:170
2:170
2:170
2:170
2:170
2:170
2:170
2:170
2:170
2:170
2:170
2:170
2:170
2:170
2:171
2:171
2:171
2:171
2:171
2:171
2:171
2:171
2:171
2:171
2:171
2:171
2:172
2:172
2:172
2:172
2:172
2:172
2:172
2:172
2:172
2:172
2:172
2:172
2:172
2:172
2:172
2:172
2:172
2:172
2:172
2:173
2:173
2:173
2:173
2:173
2:173
2:173
2:173
2:173
2:173
2:173
2:173
2:173
2:173
2:173
2:173
2:173
2:173
2:174
2:174
2:174
2:174
2:174
2:174
2:174
2:174
2:174
2:174
2:174
2:174
2:175
2:175
2:175
2:175
2:175
2:175
2:175
2:175
2:175
2:175
2:175
2:175
2:175
2:175
2:175
2:175
2:175
2:175
2:175
2:176
2:176
2:176
2:176
2:176
2:176
2:176
2:176
2:176
2:176
2:176
2:176
2:176
2:176
2:176
2:176
2:176
2:176
2:176
2:176
2:176
2:176
2:176
2:176
2:176
2:177
2:177
2:177
2:177
2:177
2:177
2:177
2:177
2:177
2:177
2:177
2:177
2:178
2:178
2:178
2:178
2:178
2:178
2:178
2:178
2:178
2:178
2:178
2:178
2:178
2:178
2:178
2:178
2:178
2:178
2:178
2:179
2:179
2:179
2:179
2:179
2:179
2:179
2:179
2:179
2:179
2:179
2:179
2:179
2:179
2:179
2:179
2:179
2:179
2:179
2:179
2:179
2:179
2:179
2:179
2:179
2:180
2:180
2:180
2:185
2:185
2:185
2:185
2:185
2:185
2:185
2:185
2:185
2:185
2:185
2:185
2:185
2:185
2:185
2:187
2:187
2:187
2:187
2:187
2:187
2:187
2:187
2:187
2:187
2:187
2:187
2:188
2:188
2:188
2:188
2:188
2:188
2:188
2:188
2:188
2:188
2:188
2:188
2:190
2:190
2:190
2:190
2:190
2:190
2:190
2:191
2:191
2:191
2:191
2:191
2:191
2:191
2:191
2:191
2:191
2:192
2:192
2:192
2:193
2:193
2:193
2:194
2:194
2:194
2:197
2:197
2:197
2:197
2:197
2:197
2:197
2:197
2:197
2:197
2:197
2:197
2:197
2:197
2:197
2:199
2:199
2:199
2:199
2:199
2:199
2:199
2:199
2:199
2:199
2:199
2:199
2:200
2:200
2:200
2:200
2:200
2:200
2:200
2:200
2:200
2:200
2:200
2:200
2:202
2:202
2:202
2:202
2:202
2:202
2:202
2:203
2:203
2:203
2:203
2:203
2:203
2:203
2:203
2:203
2:203
2:204
2:204
2:204
2:205
2:205
2:205
2:206
2:206
2:206
2:208
2:208
2:208
2:208
2:208
2:208
2:208
2:208
2:208
2:208
2:208
2:211
2:211
2:211
2:211
2:211
2:211
2:211
2:211
2:212
2:212
2:212
2:212
2:212
2:212
2:212
2:212
2:213
2:213
2:213
2:213
2:213
2:213
2:213
2:213
2:214
2:214
2:214
2:214
2:214
2:214
2:214
2:214
2:215
2:215
2:215
2:215
2:215
2:215
2:215
2:215
2:215
2:215
2:215
2:215
2:215
2:215
2:215
2:215
2:215
2:215
2:215
2:215
2:215
2:215
2:215
2:215
2:215
2:215
2:215
2:215
2:215
2:215
2:215
2:215
2:215
2:215
2:215
2:215
2:215
2:215
2:215
2:215
2:215
2:215
2:215
2:215
2:215
2:215
2:215
2:215
2:215
2:215
2:216
2:216
2:216
2:216
2:216
2:216
2:216
2:216
2:216
2:216
2:216
2:216
2:216
2:217
2:217
2:217
2:217
2:217
2:217
2:217
2:217
2:217
2:217
2:217
2:217
2:217
2:217
2:217
2:217
2:217
2:217
2:217
2:218
2:218
2:218
2:218
2:218
2:218
2:218
2:218
2:218
2:218
2:218
2:218
2:218
2:218
2:218
2:218
2:218
2:218
2:218
2:219
2:219
2:219
2:219
2:219
2:219
2:219
2:219
2:219
2:219
2:219
2:219
2:219
2:219
2:219
2:219
2:219
2:219
2:219
2:220
2:220
2:220
2:220
2:220
2:220
2:220
2:220
2:220
2:220
2:220
2:220
2:220
2:220
2:220
2:222
2:222
2:222
2:222
2:222
2:222
2:222
2:222
2:222
2:222
2:222
2:222
2:222
2:222
2:222
2:222
2:222
2:222
2:222
2:222
2:222
2:222
2:222
2:222
2:222
2:222
2:222
2:222
2:222
2:222
2:222
2:222
2:222
2:222
2:222
2:222
2:222
2:222
2:222
2:222
2:222
2:222
2:222
2:222
2:222
2:222
2:222
2:222
2:222
2:222
2:222
2:222
2:222
2:222
2:222
2:222
2:222
2:223
2:223
2:223
2:223
2:223
2:223
2:223
2:223
2:223
2:223
2:223
2:223
2:223
2:224
2:224
2:224
2:224
2:224
2:224
2:224
2:224
2:224
2:224
2:224
2:224
2:224
2:224
2:224
2:224
2:224
2:224
2:224
2:226
2:226
2:226
2:226
2:226
2:226
2:226
2:226
2:226
2:226
2:226
2:226
2:226
2:226
2:226
2:226
2:226
2:226
2:226
2:227
2:227
2:227
2:227
2:227
2:227
2:227
2:227
2:227
2:227
2:227
2:227
2:227
2:227
2:227
2:229
2:229
2:229
2:229
2:229
2:229
2:229
2:229
2:229
2:229
2:229
2:229
2:231
2:231
2:231
2:231
2:231
2:231
2:231
2:231
2:231
2:231
2:231
2:231
2:233
2:233
2:233
2:233
2:233
2:233
2:233
2:234
2:234
2:234
2:234
2:234
2:234
2:234
2:234
2:234
2:234
2:236
2:236
2:236
2:236
2:236
2:236
2:236
2:236
2:238
2:238
2:238
2:239
2:239
2:239
2:245
2:245
2:245
2:245
2:245
2:245
2:245
2:245
2:245
2:245
2:245
2:245
2:245
2:245
2:245
2:245
2:245
2:245
2:245
2:247
2:247
2:247
2:247
2:247
2:247
2:247
2:247
2:247
2:247
2:247
2:247
2:247
2:247
2:247
2:247
2:247
2:247
2:247
2:247
2:247
2:247
2:247
2:247
2:247
2:249
2:249
2:249
2:250
2:250
2:250
2:250
2:250
2:250
2:250
2:250
2:252
2:252
2:252
2:257
2:257
2:257
2:257
2:257
2:257
2:257
2:257
2:260
2:260
2:260
2:260
2:260
2:260
2:260
2:260
2:260
2:260
2:260
2:260
2:260
2:261
2:261
2:261
2:261
2:261
2:261
2:261
2:261
2:261
2:261
2:262
2:262
2:262
2:262
2:262
2:262
2:262
2:262
2:262
2:262
2:264
2:264
2:264
2:264
2:264
2:264
2:264
2:264
2:264
2:264
2:264
2:264
2:264
2:264
2:264
2:264
2:264
2:264
2:264
2:264
2:264
2:264
2:265
2:265
2:265
2:265
2:265
2:265
2:265
2:265
2:266
2:266
2:266
2:266
2:266
2:266
2:266
2:268
2:268
2:269
2:269
2:269
2:269
2:269
2:269
2:269
2:269
2:270
2:270
2:270
2:270
2:270
2:270
2:270
2:272
2:272
2:272
2:272
2:272
2:272
2:272
2:274
2:274
2:274
2:274
2:274
2:274
2:274
2:274
2:274
2:274
2:274
2:275
2:275
2:275
2:275
2:275
2:275
2:275
2:275
2:275
2:275
2:275
2:275
2:276
2:276
2:276
2:276
2:276
2:276
2:276
2:276
2:276
2:276
2:276
2:276
2:277
2:277
2:277
2:277
2:277
2:277
2:277
2:277
2:277
2:277
2:277
2:277
2:278
2:278
2:278
2:278
2:278
2:278
2:278
2:278
2:278
2:278
2:278
2:278
2:279
2:279
2:279
2:279
2:279
2:279
2:279
2:279
2:279
2:279
2:279
2:279
2:280
2:280
2:280
2:280
2:280
2:280
2:280
2:280
2:280
2:280
2:280
2:280
2:281
2:281
2:281
2:281
2:281
2:281
2:281
2:281
2:281
2:281
2:281
2:281
2:283
2:283
2:284
2:284
2:284
2:284
2:284
2:284
2:284
2:284
2:284
2:284
2:284
2:284
2:284
2:284
2:284
2:284
2:284
2:284
2:284
2:284
2:284
2:284
2:284
2:284
2:284
2:284
2:284
2:284
2:284
2:284
2:284
2:284
2:284
2:284
2:284
2:284
2:284
2:284
2:284
2:284
2:284
2:284
2:285
2:285
2:285
2:285
2:285
2:285
2:285
2:286
2:286
2:286
2:286
2:286
2:286
2:286
2:286
2:286
2:286
2:286
2:286
2:286
2:286
2:286
2:286
2:286
2:286
2:286
2:286
2:286
2:286
2:286
2:286
2:286
2:286
2:286
2:286
2:286
2:286
2:286
2:286
2:286
2:286
2:286
2:286
2:286
2:286
2:286
2:286
2:286
2:286
2:286
2:286
2:286
2:286
2:286
2:286
2:286
2:286
2:286
2:286
2:286
2:286
2:286
2:286
2:287
2:287
2:287
2:287
2:287
2:287
2:287
2:288
2:288
2:288
2:288
2:288
2:288
2:288
2:288
2:288
2:288
2:288
2:288
2:288
2:288
2:288
2:288
2:288
2:288
2:288
2:288
2:288
2:288
2:288
2:288
2:288
2:288
2:288
2:288
2:288
2:288
2:288
2:288
2:288
2:288
2:288
2:288
2:288
2:288
2:288
2:288
2:288
2:288
2:288
2:288
2:289
2:289
2:289
2:289
2:289
2:289
2:289
2:289
2:289
2:289
2:289
2:289
2:289
2:289
2:289
2:289
2:289
2:289
2:289
2:289
2:291
2:291
2:291
2:291
2:291
2:291
2:291
2:291
2:291
2:291
2:291
2:291
2:291
2:291
2:291
2:291
2:292
2:292
2:292
2:292
2:292
2:292
2:292
2:292
2:292
2:292
2:292
2:292
2:292
2:292
2:292
2:292
2:292
2:292
2:292
2:292
2:292
2:293
2:293
2:293
2:293
2:293
2:293
2:293
2:293
2:293
2:293
2:293
2:293
2:294
2:294
2:294
2:294
2:294
2:294
2:294
2:294
2:294
2:294
2:294
2:294
2:295
2:295
2:295
2:295
2:295
2:295
2:295
2:295
2:295
2:295
2:295
2:295
2:296
2:296
2:296
2:296
2:296
2:296
2:296
2:296
2:296
2:296
2:296
2:296
2:297
2:297
2:297
2:297
2:297
2:297
2:297
2:297
2:297
2:297
2:297
2:297
2:299
2:299
2:300
2:300
2:300
2:300
2:300
2:300
2:300
2:300
2:300
2:300
2:300
2:300
2:301
2:301
2:301
2:301
2:301
2:301
2:301
2:301
2:301
2:301
2:301
2:301
2:302
2:302
2:302
2:302
2:302
2:302
2:302
2:302
2:302
2:302
2:302
2:302
2:303
2:303
2:303
2:303
2:303
2:303
2:303
2:303
2:303
2:303
2:303
2:303
2:304
2:304
2:304
2:304
2:304
2:304
2:304
2:304
2:304
2:304
2:304
2:304
2:308
2:308
2:308
2:308
2:308
2:308
2:308
2:308
2:308
2:308
2:309
2:309
2:309
2:309
2:309
2:309
2:309
2:309
2:309
2:309
2:310
2:310
2:310
2:310
2:310
2:310
2:310
2:311
2:311
2:311
2:311
2:311
2:311
2:311
2:312
2:312
2:312
2:312
2:312
2:312
2:312
2:313
2:313
2:313
2:313
2:313
2:313
2:313
2:313
2:313
2:313
2:313
2:313
2:313
2:313
2:313
2:313
2:313
2:313
2:313
2:313
2:313
2:313
2:313
2:313
2:313
2:313
2:313
2:313
2:313
2:313
2:313
2:313
2:313
2:313
2:313
2:313
2:313
2:313
2:313
2:313
2:313
2:313
2:313
2:313
2:313
2:313
2:313
2:313
2:313
2:313
2:313
2:313
2:313
2:313
2:314
2:314
2:314
2:314
2:314
2:314
2:314
2:314
2:314
2:314
2:314
2:314
2:314
2:315
2:315
2:315
2:315
2:315
2:315
2:315
2:315
2:315
2:315
2:315
2:315
2:315
2:315
2:315
2:315
2:315
2:315
2:315
2:315
2:315
2:315
2:315
2:315
2:315
2:315
2:315
2:315
2:315
2:315
2:315
2:315
2:315
2:315
2:315
2:315
2:315
2:315
2:315
2:315
2:315
2:315
2:315
2:315
2:315
2:315
2:315
2:315
2:315
2:315
2:315
2:315
2:315
2:315
2:315
2:315
2:315
2:315
2:315
2:316
2:316
2:316
2:317
2:317
2:317
2:318
2:318
2:318
2:321
2:321
2:321
2:324
2:324
2:324
2:324
2:324
2:324
2:324
2:324
2:324
2:324
2:324
2:324
2:326
2:333
2:333
2:333
2:333
2:333
2:333
2:333
2:333
2:333
2:333
2:333
2:333
2:333
2:333
2:333
2:333
2:333
2:333
2:333
2:333
2:333
2:333
2:333
2:333
2:333
2:333
2:333
2:333
2:333
2:333
2:333
2:333
2:333
2:333
2:333
2:333
2:333
2:333
2:333
2:333
2:333
2:333
2:333
2:333
2:333
2:333
2:333
2:333
2:333
2:333
2:333
2:333
2:333
2:333
2:333
2:333
2:333
2:333
2:333
2:333
2:333
2:333
2:333
2:333
2:333
2:333
2:333
2:333
2:333
2:333
2:333
2:333
2:333
2:334
2:334
2:334
2:334
2:334
2:334
2:334
2:334
2:334
2:334
2:334
2:334
2:334
2:334
2:334
2:334
2:334
2:334
2:334
2:335
2:335
2:335
2:335
2:335
2:335
2:335
2:335
2:335
2:335
2:336
2:336
2:336
2:336
2:336
2:336
2:336
2:336
2:336
2:336
2:337
2:337
2:337
2:337
2:337
2:349
2:349
2:349
2:349
2:349
2:349
2:349
2:349
2:349
2:349
2:349
2:349
2:349
2:349
2:349
2:349
2:349
2:349
2:349
2:349
2:349
2:349
2:349
2:349
2:349
2:349
2:349
2:349
2:349
2:349
2:349
2:349
2:349
2:349
2:349
2:349
2:349
2:349
2:349
2:349
2:349
2:349
2:349
2:349
2:349
2:349
2:349
2:349
2:349
2:349
2:349
2:349
2:349
2:349
2:349
2:349
2:349
2:349
2:349
2:349
2:349
2:349
2:349
2:349
2:349
2:349
2:349
2:349
2:349
2:349
2:349
2:349
2:349
2:349
2:349
2:350
2:350
2:350
2:350
2:350
2:350
2:350
2:350
2:350
2:350
2:350
2:350
2:350
2:350
2:350
2:350
2:350
2:350
2:350
2:350
2:350
2:350
2:355
2:355
2:355
2:355
2:355
2:355
2:355
2:355
2:355
2:355
2:355
2:355
2:355
2:356
2:356
2:356
2:356
2:356
2:356
2:356
2:356
2:356
2:356
2:356
2:356
2:356
2:357
2:357
2:357
2:357
2:357
2:357
2:357
2:357
2:357
2:357
2:357
2:357
2:357
2:357
2:357
2:358
2:358
2:358
2:358
2:358
2:358
2:358
2:358
2:358
2:358
2:358
2:358
2:358
2:358
2:358
2:358
2:358
2:358
2:358
2:358
2:358
2:358
2:358
2:358
2:358
2:359
2:359
2:359
2:359
2:360
2:360
2:360
2:360
2:360
2:360
2:360
2:360
2:360
2:360
2:361
2:361
2:361
2:361
2:361
2:363
2:363
2:363
2:363
2:363
2:363
2:363
2:363
2:363
2:363
2:363
2:363
2:363
2:363
2:363
2:363
2:363
2:367
2:367
2:367
2:367
2:367
2:367
2:367
2:368
2:368
2:368
2:368
2:368
2:368
2:368
2:368
2:368
2:368
2:369
2:369
2:369
2:369
2:369
2:369
2:369
2:369
2:369
2:369
2:369
2:369
2:369
2:369
2:369
2:369
2:369
2:369
2:369
2:369
2:369
2:369
2:369
2:369
2:369
2:369
2:369
2:385
2:385
2:385
2:385
2:385
2:385
2:385
2:385
2:386
2:386
2:386
2:386
2:386
2:386
2:386
2:386
2:387
2:387
2:387
2:387
2:387
2:387
2:387
2:387
2:390
2:390
2:390
2:390
2:390
2:390
2:390
2:390
2:390
2:390
2:390
2:390
2:391
2:391
2:391
2:391
2:391
2:391
2:391
2:391
2:391
2:391
2:391
2:391
2:392
2:392
2:392
2:392
2:392
2:392
2:392
2:392
2:392
2:392
2:392
2:392
2:393
2:393
2:393
2:393
2:393
2:393
2:393
2:393
2:393
2:393
2:393
2:393
2:394
2:394
2:394
2:394
2:394
2:394
2:394
2:394
2:394
2:394
2:394
2:394
2:395
2:395
2:395
2:395
2:395
2:395
2:395
2:395
2:395
2:395
2:395
2:395
2:398
2:398
2:398
2:398
2:398
2:398
2:398
2:398
2:398
2:398
2:398
2:398
2:398
2:398
2:398
2:398
2:398
2:398
2:398
2:401
2:401
2:401
2:401
2:401
2:401
2:401
2:401
2:402
2:402
2:402
2:402
2:402
2:402
2:402
2:402
2:402
2:402
2:405
2:405
2:405
2:405
2:405
2:405
2:405
2:405
2:405
2:405
2:405
2:405
2:405
2:405
2:405
2:405
2:405
2:405
2:405
2:405
2:405
2:405
2:405
2:405
2:408
2:408
2:408
2:408
2:408
2:408
2:408
2:408
2:409
2:409
2:409
2:409
2:409
2:409
2:409
2:409
2:409
2:409
2:412
2:412
2:412
2:412
2:412
2:412
2:414
2:414
2:414
2:414
2:414
2:414
2:414
2:414
2:415
2:415
2:415
2:415
2:415
2:415
2:415
2:415
2:415
2:415
2:417
2:417
2:417
2:417
2:417
2:417
2:417
2:417
2:417
2:417
2:417
2:417
2:417
2:419
2:419
2:419
2:419
2:419
2:419
2:419
2:419
2:419
2:419
2:419
2:419
2:419
2:419
2:419
2:419
2:419
2:419
2:419
2:419
2:419
2:419
2:419
2:419
2:419
2:421
2:421
2:421
2:421
2:421
2:421
2:421
2:422
2:422
2:422
2:422
2:422
2:422
2:422
2:422
2:422
2:422
2:422
2:422
2:422
2:422
2:422
2:422
2:422
2:422
2:422
2:422
2:422
2:422
2:422
2:422
2:422
2:422
2:422
2:422
2:422
2:422
2:422
2:422
2:422
2:422
2:422
2:422
2:422
2:422
2:422
2:422
2:422
2:422
2:422
2:422
2:422
2:422
2:422
2:422
2:422
2:422
2:422
2:422
2:422
2:422
2:422
2:422
2:422
2:422
2:422
2:422
2:422
2:422
2:422
2:422
2:422
2:422
2:423
2:423
2:423
2:423
2:424
2:424
2:424
2:424
3:425
3:425
3:425
3:8
3:8
3:8
3:8
3:8
3:8
3:8
3:8
3:8
3:8
3:8
3:8
3:8
3:8
3:8
3:9
3:9
3:9
3:9
3:9
3:9
3:9
3:9
3:9
3:9
3:11
3:11
3:11
3:11
3:11
3:11
3:11
3:12
3:12
3:12
3:12
3:12
3:12
3:12
3:14
3:14
3:14
3:14
3:14
3:14
3:14
3:14
3:14
3:14
3:14
3:14
3:14
3:15
3:15
3:15
3:15
3:15
3:15
3:15
3:15
3:15
3:15
3:15
3:15
3:15
3:16
3:16
3:16
3:16
3:16
3:16
3:16
3:16
3:16
3:16
3:16
3:16
3:16
3:22
3:22
3:22
3:22
3:22
3:22
3:22
3:22
3:22
3:22
3:22
3:22
3:22
3:22
3:22
3:22
3:22
3:22
3:22
3:22
3:22
3:22
3:22
3:22
3:22
3:22
3:22
3:22
3:22
3:22
3:22
3:22
3:22
3:22
3:22
3:22
3:22
3:22
3:22
3:22
3:22
3:22
3:22
3:22
3:22
3:22
3:22
3:22
3:22
3:22
3:22
3:23
3:23
3:23
3:23
3:23
3:23
3:23
3:23
3:23
3:23
3:23
3:23
3:23
3:23
3:23
3:23
3:23
3:23
3:23
3:23
3:23
3:23
3:23
3:23
3:23
3:23
3:23
3:23
3:23
3:23
3:23
3:23
3:23
3:23
3:23
3:23
3:23
3:23
3:23
3:23
3:23
3:23
3:23
3:23
3:23
3:23
3:23
3:23
3:23
3:23
3:23
3:23
3:23
3:23
3:23
3:23
3:23
3:23
3:23
3:23
3:23
3:23
3:23
3:23
3:23
3:23
3:23
3:23
3:23
3:23
3:23
3:23
3:23
3:25
3:25
3:25
3:25
3:25
3:25
3:25
3:25
3:25
3:25
3:25
3:25
3:25
3:25
3:25
3:25
3:27
3:27
3:27
3:27
3:27
3:27
3:27
3:27
3:27
3:27
3:27
3:27
3:27
3:27
3:27
3:27
3:27
3:27
3:27
3:27
3:27
3:27
3:27
3:27
3:27
3:27
3:27
3:27
3:27
3:27
3:27
3:27
3:27
3:27
3:27
3:27
3:28
3:28
3:28
3:28
3:28
3:28
3:28
3:28
3:28
3:28
3:28
3:28
3:28
3:28
3:28
3:28
3:28
3:28
3:28
3:28
3:28
3:28
3:28
3:28
3:28
3:29
3:29
3:29
3:29
3:31
3:31
3:31
3:31
3:31
3:31
3:31
3:31
3:31
3:31
3:31
3:31
3:31
3:31
3:31
3:31
3:32
3:32
3:32
3:32
3:32
3:32
3:32
3:32
3:32
3:32
3:32
3:32
3:32
3:32
3:32
3:32
3:34
3:34
3:34
3:34
3:34
3:38
3:38
3:38
3:38
3:38
3:38
3:38
3:38
3:38
3:38
3:38
3:38
3:38
3:38
3:38
3:39
3:39
3:39
3:39
3:39
3:39
3:39
3:39
3:39
3:39
3:39
3:39
3:40
3:40
3:40
3:40
3:40
3:40
3:40
3:40
3:40
3:40
3:40
3:40
3:42
3:42
3:42
3:42
3:42
3:42
3:43
3:43
3:43
3:43
3:43
3:43
3:43
3:43
3:43
3:43
3:43
3:43
3:44
3:44
3:44
3:44
3:44
3:44
3:44
3:44
3:44
3:44
3:44
3:44
3:44
3:44
3:44
3:44
3:44
3:44
3:44
3:44
3:44
3:44
3:44
3:45
3:45
3:45
3:45
3:45
3:45
3:45
3:45
3:45
3:45
3:47
3:47
3:47
3:47
3:47
3:47
3:48
3:48
3:48
3:48
3:48
3:48
3:48
3:48
3:48
3:48
3:48
3:48
3:49
3:49
3:49
3:49
3:49
3:49
3:49
3:49
3:49
3:49
3:49
3:49
3:49
3:49
3:49
3:49
3:49
3:49
3:49
3:49
3:49
3:49
3:49
3:50
3:50
3:50
3:50
3:50
3:50
3:50
3:50
3:50
3:50
3:52
3:52
3:52
3:52
3:52
3:52
3:53
3:53
3:53
3:53
3:53
3:53
3:53
3:53
3:53
3:53
3:53
3:53
3:54
3:54
3:54
3:54
3:54
3:54
3:54
3:54
3:54
3:54
3:54
3:54
3:54
3:54
3:54
3:54
3:54
3:54
3:54
3:54
3:54
3:54
3:54
3:55
3:55
3:55
3:55
3:55
3:55
3:55
3:55
3:55
3:55
3:57
3:57
3:57
3:57
3:57
3:57
3:58
3:58
3:58
3:58
3:58
3:58
3:58
3:58
3:58
3:58
3:58
3:58
3:59
3:59
3:59
3:59
3:59
3:59
3:59
3:59
3:59
3:59
3:59
3:59
3:59
3:59
3:59
3:59
3:59
3:59
3:59
3:59
3:59
3:59
3:59
3:60
3:60
3:60
3:60
3:60
3:60
3:60
3:60
3:60
3:60
3:62
3:62
3:62
3:62
3:62
3:62
3:63
3:63
3:63
3:63
3:63
3:63
3:63
3:63
3:63
3:63
3:63
3:63
3:64
3:64
3:64
3:64
3:64
3:64
3:64
3:64
3:64
3:64
3:64
3:64
3:64
3:64
3:64
3:64
3:64
3:64
3:64
3:64
3:64
3:64
3:64
3:65
3:65
3:65
3:65
3:65
3:65
3:65
3:65
3:65
3:65
3:67
3:67
3:67
3:67
3:67
3:67
3:68
3:68
3:68
3:68
3:68
3:68
3:68
3:68
3:68
3:68
3:68
3:68
3:69
3:69
3:69
3:69
3:69
3:69
3:69
3:69
3:69
3:69
3:69
3:69
3:69
3:69
3:69
3:69
3:69
3:69
3:69
3:69
3:69
3:69
3:69
3:70
3:70
3:70
3:70
3:70
3:70
3:70
3:70
3:70
3:70
3:72
3:72
3:72
3:72
3:72
3:72
3:73
3:73
3:73
3:73
3:73
3:73
3:73
3:73
3:73
3:73
3:73
3:73
3:74
3:74
3:74
3:74
3:74
3:74
3:74
3:74
3:74
3:74
3:74
3:74
3:74
3:74
3:74
3:74
3:74
3:74
3:74
3:74
3:74
3:74
3:74
3:75
3:75
3:75
3:75
3:75
3:75
3:75
3:75
3:75
3:75
3:77
3:77
3:77
3:77
3:77
3:77
3:78
3:78
3:78
3:78
3:78
3:78
3:78
3:78
3:78
3:78
3:78
3:78
3:79
3:79
3:79
3:79
3:79
3:79
3:79
3:79
3:79
3:79
3:79
3:79
3:79
3:79
3:79
3:79
3:79
3:79
3:79
3:79
3:79
3:79
3:79
3:80
3:80
3:80
3:80
3:80
3:80
3:80
3:80
3:80
3:80
3:82
3:82
3:82
3:82
3:82
3:82
3:83
3:83
3:83
3:83
3:83
3:83
3:83
3:83
3:83
3:83
3:83
3:83
3:84
3:84
3:84
3:84
3:84
3:84
3:84
3:84
3:84
3:84
3:84
3:84
3:84
3:84
3:84
3:84
3:84
3:84
3:84
3:84
3:84
3:84
3:84
3:85
3:85
3:85
3:85
3:85
3:85
3:85
3:85
3:85
3:85
3:87
3:87
3:87
3:87
3:87
3:87
3:88
3:88
3:88
3:88
3:88
3:88
3:88
3:88
3:88
3:88
3:88
3:88
3:89
3:89
3:89
3:89
3:89
3:89
3:89
3:89
3:89
3:89
3:89
3:89
3:89
3:89
3:89
3:89
3:89
3:89
3:89
3:89
3:89
3:89
3:89
3:90
3:90
3:90
3:90
3:90
3:90
3:90
3:90
3:90
3:90
3:92
3:92
3:92
3:92
3:92
3:92
3:93
3:93
3:93
3:93
3:93
3:93
3:93
3:93
3:93
3:93
3:93
3:93
3:94
3:94
3:94
3:94
3:94
3:94
3:94
3:94
3:94
3:94
3:94
3:94
3:94
3:94
3:94
3:94
3:94
3:94
3:94
3:94
3:94
3:94
3:94
3:95
3:95
3:95
3:95
3:95
3:95
3:95
3:95
3:95
3:95
3:98
3:98
3:98
3:98
3:98
3:98
3:98
3:98
3:98
3:98
3:98
3:98
3:98
3:98
3:98
3:98
3:98
3:98
3:98
3:98
3:98
3:98
3:98
3:98
3:98
3:98
3:98
3:98
3:98
3:98
3:98
3:98
3:98
3:98
3:98
3:98
3:98
3:98
3:98
3:98
3:98
3:98
3:98
3:98
3:98
3:98
3:98
3:98
3:98
3:98
3:98
3:98
3:98
3:98
3:98
3:98
3:98
3:98
3:98
3:98
3:98
3:98
3:98
3:98
3:98
3:98
3:98
3:98
3:98
3:98
3:98
3:98
3:98
3:98
3:98
3:98
3:98
3:98
3:98
3:98
3:98
3:98
3:98
3:98
3:98
3:98
3:98
3:98
3:98
3:98
3:98
3:98
3:98
3:98
3:98
3:98
3:98
3:98
3:98
3:98
3:98
3:98
3:98
3:98
3:98
3:98
3:98
3:98
3:98
3:98
3:98
3:98
3:98
3:98
3:98
3:98
3:98
3:98
3:98
3:98
3:98
3:98
3:98
3:98
3:98
3:98
3:98
3:98
3:98
3:98
3:98
3:98
4:100
4:100
4:100
4:100
4:100
4:5
4:5
4:5
4:5
4:5
4:5
4:5
4:9
4:9
4:9
4:9
4:9
4:9
4:9
4:9
4:9
4:10
4:10
4:10
4:10
4:10
4:10
4:10
4:10
4:11
4:11
4:11
4:11
4:11
4:11
4:11
4:11
4:11
4:11
4:12
4:12
4:12
4:12
4:12
4:12
4:12
4:12
4:13
4:13
4:13
4:13
4:13
4:13
4:13
4:13
4:14
4:14
4:14
4:14
4:14
4:14
4:14
4:14
4:14
4:14
4:15
4:15
4:15
4:15
4:15
4:15
4:15
4:15
4:15
4:15
4:16
4:16
4:16
4:16
4:16
4:16
4:16
4:16
4:16
4:16
4:17
4:17
4:17
4:17
4:17
4:17
4:17
4:17
4:17
4:17
4:17
4:17
4:18
4:18
4:18
4:18
4:18
4:18
4:18
4:18
4:18
4:18
4:18
4:18
4:18
4:18
4:18
4:19
4:19
4:19
4:19
4:19
4:19
4:19
4:19
4:19
4:19
4:19
4:19
4:20
4:20
4:20
4:20
4:20
4:20
4:20
4:20
4:20
4:20
4:20
4:20
4:20
4:20
4:21
4:21
4:21
4:21
4:21
4:21
4:21
4:21
4:21
4:21
4:21
4:21
4:21
4:22
4:22
4:22
4:22
4:22
4:22
4:22
4:22
4:22
4:22
4:23
4:23
4:23
4:23
4:23
4:23
4:23
4:23
4:23
4:23
4:24
4:24
4:24
4:24
4:24
4:24
4:24
4:24
4:24
4:24
4:25
4:25
4:25
4:25
4:25
4:25
4:25
4:25
4:25
4:25
4:25
4:25
4:26
4:26
4:26
4:26
4:26
4:26
4:26
4:26
4:26
4:26
4:26
4:26
4:26
4:26
4:26
4:27
4:27
4:27
4:27
4:27
4:27
4:27
4:27
4:27
4:27
4:27
4:27
4:28
4:28
4:28
4:28
4:28
4:28
4:28
4:28
4:28
4:28
4:28
4:28
4:28
4:28
4:29
4:29
4:29
4:29
4:29
4:29
4:29
4:29
4:29
4:29
4:29
4:29
4:29
4:29
4:29
4:29
4:29
4:29
4:29
4:30
4:30
4:30
4:30
4:30
4:30
4:30
4:30
4:30
4:30
4:31
4:31
4:31
4:31
4:31
4:31
4:31
4:31
4:31
4:31
4:32
4:32
4:32
4:32
4:32
4:32
4:32
4:32
4:32
4:32
4:33
4:33
4:33
4:33
4:33
4:33
4:33
4:33
4:33
4:33
4:33
4:33
4:34
4:34
4:34
4:34
4:34
4:34
4:34
4:34
4:34
4:34
4:34
4:34
4:34
4:34
4:34
4:35
4:35
4:35
4:35
4:35
4:35
4:35
4:35
4:35
4:35
4:35
4:35
4:36
4:36
4:36
4:36
4:36
4:36
4:36
4:36
4:36
4:36
4:36
4:36
4:36
4:36
4:37
4:37
4:37
4:37
4:37
4:37
4:37
4:37
4:37
4:37
4:37
4:37
4:37
4:37
4:37
4:37
4:37
4:37
4:37
4:39
4:39
4:39
4:39
4:39
4:39
4:39
4:39
4:39
4:39
4:39
4:39
4:39
4:40
4:40
4:40
4:40
4:40
4:40
4:40
4:40
4:40
4:40
4:40
4:40
4:40
4:40
4:40
4:40
4:40
4:40
4:40
4:40
4:40
4:40
4:40
4:40
4:40
4:40
4:40
4:40
4:40
4:40
4:40
4:40
4:40
4:40
4:40
4:40
4:40
4:40
4:40
4:40
4:40
4:40
4:40
4:41
4:41
4:41
4:41
4:41
4:41
4:41
4:41
4:41
4:41
4:41
4:41
4:41
4:41
4:41
4:41
4:41
4:41
4:41
4:41
4:41
4:41
4:41
4:41
4:41
4:41
4:41
4:41
4:41
4:43
4:43
4:43
4:43
4:43
4:43
4:43
4:44
4:44
4:44
4:44
4:44
4:44
4:44
4:44
4:44
4:44
4:44
4:44
4:45
4:45
4:45
4:45
4:45
4:45
4:45
4:45
4:45
4:45
4:46
4:46
4:46
4:46
4:46
4:46
4:46
4:46
4:47
4:47
4:47
4:47
4:47
4:47
4:47
4:47
4:47
4:47
4:47
4:47
4:47
4:47
4:47
4:47
4:47
4:47
4:47
4:47
4:47
4:48
4:48
4:48
4:48
4:48
4:48
4:48
4:48
4:48
4:48
4:48
4:48
4:48
4:48
4:48
4:49
4:49
4:49
4:49
4:49
4:49
4:49
4:50
4:50
4:50
4:50
4:50
4:50
4:50
4:50
4:50
4:50
4:51
4:51
4:51
4:51
4:51
4:51
4:51
4:51
4:52
4:52
4:52
4:52
4:52
4:52
4:52
4:52
4:53
4:53
4:53
4:53
4:53
4:53
4:53
4:53
4:54
4:54
4:54
4:55
4:55
4:55
4:55
4:55
4:55
4:55
4:55
4:55
4:55
4:55
4:55
4:55
4:55
4:55
4:55
4:55
4:55
4:55
4:55
4:55
4:55
4:55
4:56
4:56
4:56
4:56
4:56
4:56
4:56
4:56
4:56
4:57
4:57
4:57
4:57
4:57
4:57
4:57
4:57
4:57
4:57
4:57
4:57
4:57
4:57
4:57
4:57
4:57
4:57
4:57
4:57
4:57
4:57
4:57
4:57
4:58
4:58
4:58
4:58
4:58
4:58
4:58
4:58
4:60
4:60
4:60
4:64
4:64
4:64
4:64
4:64
4:66
4:66
4:66
4:66
4:66
4:66
4:66
4:66
4:66
4:66
4:66
4:66
4:66
4:66
4:66
4:66
4:66
4:66
4:66
4:66
4:67
4:67
4:67
4:67
4:67
4:67
4:67
4:67
4:71
4:71
4:71
4:71
4:71
4:71
4:71
4:71
4:75
4:75
4:77
4:77
4:77
4:80
4:80
4:80
4:80
4:80
4:80
4:80
4:80
4:81
4:81
4:81
4:83
4:83
4:83
4:83
4:83
4:85
4:85
4:85
4:85
4:85
4:85
4:85
4:85
4:85
4:85
4:85
4:85
4:85
4:85
4:85
4:85
4:85
4:85
4:85
4:85
4:85
4:85
4:85
4:85
4:85
4:85
4:85
4:85
4:85
4:85
4:86
4:86
4:86
4:86
4:86
4:86
4:86
4:86
4:86
4:86
4:86
4:86
4:86
4:86
4:86
4:86
4:86
4:86
4:86
4:86
4:86
4:86
4:86
4:86
4:86
4:86
4:86
4:86
4:86
4:86
4:86
4:86
4:86
4:86
4:86
4:86
4:86
4:86
4:86
4:86
4:86
4:86
4:86
4:86
4:86
4:86
4:86
4:86
4:86
4:86
4:86
4:86
4:86
4:86
4:87
4:87
4:87
4:87
4:87
4:87
4:87
4:87
4:88
4:88
4:88
4:88
4:88
4:88
4:88
4:88
4:88
4:88
4:88
4:88
4:88
4:88
4:88
4:88
4:88
4:88
4:88
4:88
4:88
4:88
4:88
4:88
4:88
4:88
4:88
4:88
4:88
4:88
4:88
4:88
4:88
4:88
4:88
4:88
4:88
4:88
4:88
4:88
4:88
4:88
4:88
4:88
4:88
4:88
4:89
4:89
4:89
4:89
4:89
4:89
4:89
4:89
4:89
4:89
4:89
4:89
4:89
4:89
4:89
4:89
4:89
4:89
4:89
4:89
4:89
4:89
4:89
4:89
4:89
4:89
4:89
4:89
4:89
4:89
4:89
4:89
4:89
4:89
4:89
4:89
4:89
4:89
4:89
4:89
4:89
4:89
4:89
4:89
4:89
4:89
4:89
4:89
4:89
4:89
4:89
4:89
4:89
4:89
4:90
4:90
4:90
4:90
4:90
4:90
4:90
4:90
4:90
4:90
4:90
4:90
4:90
4:90
4:90
4:90
4:90
4:90
4:90
4:90
4:90
4:90
4:90
4:90
4:91
4:91
4:91
4:91
4:91
4:91
4:91
4:91
4:91
4:91
4:91
4:91
4:91
4:91
4:91
4:91
4:91
4:91
4:91
4:91
4:91
4:91
4:92
4:92
4:92
4:92
4:92
4:92
4:92
4:92
4:93
4:93
4:93
4:93
4:93
4:93
4:93
4:93
4:93
4:93
4:93
4:93
4:93
4:93
4:93
4:93
4:93
4:93
4:93
4:93
4:93
4:93
4:93
4:93
4:93
4:93
4:93
4:93
4:93
4:93
4:93
4:93
4:93
4:93
4:93
4:93
4:93
4:93
4:93
4:93
4:93
4:93
4:93
4:93
4:93
4:93
4:94
4:94
4:94
4:94
4:94
4:94
4:94
4:94
4:94
4:94
4:94
4:94
4:94
4:94
4:94
4:94
4:94
4:94
4:94
4:94
4:94
4:94
4:94
4:94
4:94
4:94
4:94
4:94
4:95
4:95
4:95
4:95
4:95
4:95
4:95
4:95
4:95
4:95
4:95
4:95
4:95
4:95
4:95
4:95
4:95
4:95
4:95
4:96
4:96
4:96
4:99
4:99
4:99
4:99
4:99
4:99
4:99
4:102
4:102
4:102
4:102
4:102
4:102
4:102
4:102
4:102
4:102
4:102
4:102
4:102
4:102
4:102
4:102
4:102
4:102
4:102
4:102
4:102
4:102
4:102
4:102
4:102
4:102
4:102
4:102
4:103
4:103
4:103
4:103
4:103
4:103
4:104
4:104
4:104
4:104
4:104
4:104
4:104
4:104
4:104
4:104
4:104
4:104
4:104
4:104
4:104
4:104
4:104
4:104
4:104
4:104
4:104
4:104
4:104
4:104
4:104
4:104
4:105
4:105
4:105
4:105
4:105
4:105
4:105
4:105
4:105
4:105
4:105
4:105
4:105
4:105
4:105
4:105
4:105
4:105
4:105
4:105
4:105
4:105
4:105
4:105
4:105
4:105
4:105
4:105
4:105
4:105
4:105
4:105
4:105
4:105
4:105
4:105
4:105
4:105
4:105
4:105
4:105
4:105
4:105
4:105
4:105
4:105
4:105
4:105
4:105
4:105
4:105
4:105
4:105
4:105
4:105
4:105
4:105
4:106
4:106
4:106
4:106
4:106
4:106
4:106
4:106
4:106
4:106
4:106
4:106
4:106
4:106
4:106
4:106
4:107
4:108
4:108
4:108
4:108
4:108
4:108
4:108
4:108
4:108
4:108
4:108
4:108
4:108
4:108
4:108
4:108
4:108
4:108
4:108
4:108
4:109
4:109
4:109
4:109
4:109
4:109
4:109
4:109
4:109
4:109
4:109
4:109
4:109
4:109
4:109
4:109
4:109
4:109
4:109
4:109
4:109
4:109
4:109
4:109
4:109
4:109
4:111
4:111
4:113
4:113
4:113
4:113
4:113
4:113
4:114
4:114
4:114
4:114
4:114
4:114
4:114
4:114
4:114
4:114
4:114
4:114
4:114
4:114
4:114
4:114
4:114
4:114
4:114
4:114
4:114
4:114
4:114
4:114
4:114
4:114
4:115
4:115
4:115
4:117
4:117
4:117
4:120
4:120
4:120
4:120
4:120
4:120
4:120
4:123
4:123
4:123
4:123
4:123
4:123
4:123
4:123
4:123
4:123
4:123
4:123
4:123
4:123
4:123
4:123
4:123
4:123
4:123
4:123
4:123
4:123
4:123
4:123
4:123
4:123
4:123
4:123
4:124
4:124
4:124
4:124
4:124
4:124
4:125
4:125
4:125
4:125
4:125
4:125
4:125
4:125
4:125
4:125
4:125
4:125
4:125
4:125
4:125
4:125
4:125
4:125
4:125
4:125
4:125
4:125
4:125
4:125
4:125
4:125
4:126
4:126
4:126
4:126
4:126
4:126
4:126
4:126
4:126
4:126
4:126
4:126
4:126
4:126
4:126
4:126
4:126
4:126
4:126
4:126
4:126
4:126
4:126
4:126
4:126
4:126
4:126
4:126
4:126
4:126
4:126
4:126
4:126
4:126
4:126
4:126
4:126
4:126
4:126
4:126
4:126
4:126
4:126
4:126
4:126
4:126
4:126
4:126
4:126
4:126
4:126
4:126
4:126
4:126
4:126
4:126
4:126
4:127
4:127
4:127
4:127
4:127
4:127
4:127
4:127
4:127
4:127
4:127
4:127
4:127
4:127
4:127
4:127
4:128
4:129
4:129
4:129
4:129
4:129
4:129
4:129
4:129
4:129
4:129
4:129
4:129
4:129
4:129
4:130
4:130
4:130
4:130
4:130
4:130
4:130
4:130
4:130
4:130
4:130
4:130
4:130
4:130
4:130
4:130
4:130
4:130
4:130
4:130
4:130
4:130
4:130
4:132
4:132
4:133
4:133
4:133
4:133
4:133
4:133
4:134
4:134
4:134
4:134
4:134
4:134
4:134
4:134
4:134
4:134
4:134
4:134
4:134
4:134
4:134
4:134
4:134
4:134
4:134
4:134
4:134
4:134
4:134
4:134
4:134
4:134
4:135
4:135
4:135
4:138
4:138
4:138
4:138
4:138
4:138
4:138
4:138
4:141
4:141
4:141
4:141
4:141
4:141
4:141
4:141
4:141
4:141
4:141
4:141
4:141
4:141
4:141
4:141
4:141
4:141
4:141
4:141
4:141
4:141
4:141
4:141
4:141
4:141
4:141
4:141
4:141
4:141
4:141
4:141
4:141
4:141
4:141
4:141
4:141
4:141
4:141
4:141
4:141
4:141
4:142
4:142
4:142
4:142
4:142
4:142
4:142
4:143
4:143
4:143
4:143
4:143
4:143
4:143
4:143
4:143
4:143
4:143
4:143
4:143
4:143
4:143
4:143
4:143
4:143
4:143
4:143
4:143
4:143
4:143
4:143
4:143
4:143
4:143
4:143
4:143
4:143
4:143
4:143
4:143
4:143
4:143
4:143
4:143
4:143
4:143
4:143
4:143
4:143
4:143
4:143
4:143
4:143
4:143
4:143
4:143
4:143
4:143
4:143
4:143
4:143
4:143
4:143
4:144
4:144
4:144
4:144
4:144
4:144
4:144
4:145
4:145
4:145
4:145
4:145
4:145
4:145
4:145
4:145
4:145
4:145
4:145
4:145
4:145
4:145
4:145
4:145
4:145
4:145
4:145
4:145
4:145
4:145
4:145
4:145
4:145
4:145
4:145
4:145
4:145
4:145
4:145
4:145
4:145
4:145
4:145
4:145
4:145
4:145
4:145
4:145
4:145
4:145
4:145
4:146
4:146
4:146
4:146
4:146
4:146
4:146
4:146
4:146
4:146
4:146
4:146
4:146
4:146
4:146
4:146
4:146
4:146
4:146
4:146
4:148
4:148
4:148
4:148
4:148
4:148
4:148
4:148
4:148
4:148
4:148
4:148
4:148
4:148
4:148
4:148
4:149
4:149
4:149
4:149
4:149
4:149
4:149
4:149
4:149
4:149
4:149
4:149
4:151
4:151
4:151
4:151
4:151
4:151
4:151
4:151
4:151
4:151
4:151
4:151
4:152
4:152
4:152
4:152
4:152
4:152
4:152
4:152
4:152
4:152
4:152
4:152
4:153
4:153
4:153
4:153
4:153
4:153
4:153
4:153
4:153
4:153
4:153
4:153
4:154
4:154
4:154
4:154
4:154
4:154
4:154
4:154
4:154
4:154
4:154
4:154
4:155
4:155
4:155
4:155
4:155
4:155
4:155
4:155
4:155
4:155
4:155
4:155
4:156
4:156
4:156
4:156
4:156
4:156
4:156
4:156
4:156
4:156
4:156
4:156
4:157
4:157
4:157
4:157
4:157
4:157
4:157
4:157
4:157
4:157
4:157
4:157
4:157
4:157
4:157
4:157
4:157
4:157
4:157
4:157
4:157
4:157
4:157
4:157
4:157
4:157
4:157
4:157
4:157
4:157
4:157
4:158
4:158
4:158
4:158
4:158
4:158
4:158
4:158
4:158
4:158
4:158
4:158
4:162
4:162
4:162
4:162
4:162
4:162
4:162
4:162
4:162
4:163
4:163
4:163
4:163
4:163
4:163
4:163
4:163
4:164
4:164
4:164
4:164
4:164
4:164
4:164
4:164
4:164
4:164
4:165
4:165
4:165
4:165
4:165
4:165
4:165
4:165
4:166
4:166
4:166
4:166
4:166
4:166
4:166
4:166
4:167
4:167
4:167
4:167
4:167
4:167
4:167
4:167
4:167
4:167
4:168
4:168
4:168
4:168
4:168
4:168
4:168
4:168
4:168
4:168
4:169
4:169
4:169
4:169
4:169
4:169
4:169
4:169
4:169
4:169
4:170
4:170
4:170
4:170
4:170
4:170
4:170
4:170
4:170
4:170
4:170
4:170
4:171
4:171
4:171
4:171
4:171
4:171
4:171
4:171
4:171
4:171
4:171
4:171
4:171
4:171
4:171
4:172
4:172
4:172
4:172
4:172
4:172
4:172
4:172
4:172
4:172
4:172
4:172
4:173
4:173
4:173
4:173
4:173
4:173
4:173
4:173
4:173
4:173
4:173
4:173
4:173
4:173
4:174
4:174
4:174
4:174
4:174
4:174
4:174
4:174
4:174
4:174
4:174
4:174
4:174
4:175
4:175
4:175
4:175
4:175
4:175
4:175
4:175
4:175
4:175
4:176
4:176
4:176
4:176
4:176
4:176
4:176
4:176
4:176
4:176
4:177
4:177
4:177
4:177
4:177
4:177
4:177
4:177
4:177
4:177
4:178
4:178
4:178
4:178
4:178
4:178
4:178
4:178
4:178
4:178
4:178
4:178
4:179
4:179
4:179
4:179
4:179
4:179
4:179
4:179
4:179
4:179
4:179
4:179
4:179
4:179
4:179
4:180
4:180
4:180
4:180
4:180
4:180
4:180
4:180
4:180
4:180
4:180
4:180
4:181
4:181
4:181
4:181
4:181
4:181
4:181
4:181
4:181
4:181
4:181
4:181
4:181
4:181
4:182
4:182
4:182
4:182
4:182
4:182
4:182
4:182
4:182
4:182
4:182
4:182
4:182
4:182
4:182
4:182
4:182
4:182
4:182
4:183
4:183
4:183
4:183
4:183
4:183
4:183
4:183
4:183
4:183
4:184
4:184
4:184
4:184
4:184
4:184
4:184
4:184
4:184
4:184
4:185
4:185
4:185
4:185
4:185
4:185
4:185
4:185
4:185
4:185
4:186
4:186
4:186
4:186
4:186
4:186
4:186
4:186
4:186
4:186
4:186
4:186
4:187
4:187
4:187
4:187
4:187
4:187
4:187
4:187
4:187
4:187
4:187
4:187
4:187
4:187
4:187
4:188
4:188
4:188
4:188
4:188
4:188
4:188
4:188
4:188
4:188
4:188
4:188
4:189
4:189
4:189
4:189
4:189
4:189
4:189
4:189
4:189
4:189
4:189
4:189
4:189
4:189
4:190
4:190
4:190
4:190
4:190
4:190
4:190
4:190
4:190
4:190
4:190
4:190
4:190
4:190
4:190
4:190
4:190
4:190
4:190
4:193
4:193
4:193
4:193
4:193
4:193
4:193
4:193
4:193
4:193
4:193
4:193
4:193
4:194
4:194
4:194
4:194
4:194
4:194
4:194
4:194
4:194
4:194
4:194
4:194
4:194
4:194
4:194
4:194
4:194
4:194
4:194
4:194
4:194
4:194
4:194
4:194
4:194
4:194
4:194
4:194
4:194
4:196
4:196
4:196
4:196
4:196
4:196
4:196
4:196
4:196
4:196
4:197
4:197
4:197
4:197
4:197
4:197
4:197
4:198
4:198
4:198
4:198
4:198
4:198
4:198
4:198
4:198
4:198
4:198
4:198
4:199
4:199
4:199
4:199
4:199
4:199
4:199
4:199
4:199
4:199
4:200
4:200
4:200
4:200
4:200
4:200
4:200
4:200
4:201
4:201
4:201
4:201
4:201
4:201
4:201
4:201
4:201
4:201
4:201
4:201
4:201
4:201
4:201
4:201
4:201
4:201
4:201
4:201
4:201
4:202
4:202
4:202
4:202
4:202
4:202
4:202
4:202
4:202
4:202
4:202
4:202
4:202
4:202
4:202
4:203
4:203
4:203
4:203
4:203
4:203
4:203
4:203
4:203
4:203
4:203
4:203
4:203
4:203
4:203
4:203
4:203
4:203
4:203
4:203
4:203
4:203
4:203
4:205
4:205
4:205
4:205
4:205
4:205
4:205
4:205
4:205
4:205
4:205
4:205
4:205
4:205
4:205
4:205
4:205
4:205
4:205
4:205
4:205
4:205
4:205
4:205
4:205
4:205
4:205
4:205
4:205
4:205
4:205
4:205
4:205
4:205
4:205
4:205
4:205
4:205
4:205
4:205
4:205
4:205
4:206
4:206
4:206
4:206
4:206
4:206
4:206
4:207
4:207
4:207
4:207
4:207
4:207
4:207
4:207
4:207
4:207
4:207
4:207
4:207
4:207
4:207
4:207
4:207
4:207
4:207
4:207
4:207
4:207
4:207
4:207
4:207
4:207
4:207
4:207
4:207
4:207
4:207
4:207
4:207
4:207
4:207
4:207
4:207
4:207
4:207
4:207
4:207
4:207
4:207
4:207
4:207
4:207
4:207
4:207
4:207
4:207
4:207
4:207
4:207
4:207
4:207
4:207
4:208
4:208
4:208
4:208
4:208
4:208
4:208
4:209
4:209
4:209
4:209
4:209
4:209
4:209
4:209
4:209
4:209
4:209
4:209
4:209
4:209
4:209
4:209
4:209
4:209
4:209
4:209
4:209
4:209
4:209
4:209
4:209
4:209
4:209
4:209
4:209
4:209
4:209
4:209
4:209
4:209
4:209
4:209
4:209
4:209
4:209
4:209
4:209
4:209
4:209
4:209
4:210
4:210
4:210
4:210
4:210
4:210
4:210
4:210
4:210
4:210
4:210
4:210
4:210
4:210
4:210
4:210
4:210
4:210
4:210
4:210
4:212
4:212
4:212
4:212
4:212
4:212
4:212
4:212
4:212
4:212
4:212
4:212
4:212
4:212
4:212
4:212
4:213
4:213
4:213
4:213
4:213
4:213
4:213
4:213
4:213
4:213
4:213
4:213
4:213
4:213
4:213
4:213
4:213
4:213
4:213
4:215
4:215
4:215
4:215
4:215
4:215
4:215
4:215
4:215
4:215
4:215
4:215
4:216
4:216
4:216
4:216
4:216
4:216
4:216
4:216
4:216
4:216
4:216
4:216
4:217
4:217
4:217
4:217
4:217
4:217
4:217
4:217
4:217
4:217
4:217
4:217
4:218
4:218
4:218
4:218
4:218
4:218
4:218
4:218
4:218
4:218
4:218
4:218
4:219
4:219
4:219
4:219
4:219
4:219
4:219
4:219
4:219
4:219
4:219
4:219
4:220
4:220
4:220
4:220
4:220
4:220
4:220
4:220
4:220
4:220
4:220
4:220
4:221
4:221
4:221
4:221
4:221
4:221
4:221
4:221
4:221
4:221
4:221
4:221
4:221
4:221
4:221
4:221
4:221
4:221
4:221
4:221
4:221
4:221
4:221
4:221
4:221
4:221
4:221
4:221
4:221
4:221
4:221
4:222
4:222
4:222
4:222
4:222
4:222
4:222
4:222
4:222
4:222
4:222
4:222
4:226
4:226
4:226
4:226
4:226
4:226
4:226
4:226
4:226
4:227
4:227
4:227
4:227
4:227
4:227
4:227
4:227
4:227
4:227
4:227
4:227
4:227
4:227
4:227
4:227
4:227
4:227
4:227
4:227
4:227
4:227
4:227
4:227
4:228
4:228
4:228
4:229
4:229
4:229
4:229
4:229
4:229
4:229
4:229
4:231
4:231
4:231
4:232
4:232
4:232
4:236
4:236
4:236
4:236
4:236
4:236
4:236
4:236
4:236
4:236
4:236
4:236
4:236
4:239
4:239
4:239
4:239
4:239
4:239
4:239
4:239
4:239
4:239
4:239
4:239
4:239
4:239
4:239
4:239
4:239
4:239
4:239
4:239
4:239
4:239
4:240
4:240
4:240
4:240
4:240
4:240
4:240
4:241
4:241
4:241
4:241
4:241
4:241
4:241
4:241
4:241
4:241
4:241
4:241
4:241
4:242
4:242
4:242
4:242
4:242
4:242
4:242
4:242
4:242
4:242
4:243
4:243
4:243
4:243
4:243
4:243
4:243
4:243
4:244
4:244
4:244
4:244
4:244
4:244
4:244
4:244
4:244
4:244
4:245
4:245
4:245
4:245
4:245
4:245
4:245
4:245
4:246
4:246
4:246
4:246
4:246
4:246
4:246
4:246
4:247
4:247
4:247
4:247
4:247
4:247
4:247
4:247
4:247
4:247
4:248
4:248
4:248
4:248
4:248
4:248
4:248
4:248
4:248
4:248
4:249
4:249
4:249
4:249
4:249
4:249
4:249
4:249
4:249
4:249
4:249
4:249
4:250
4:250
4:250
4:250
4:250
4:250
4:250
4:250
4:250
4:250
4:250
4:250
4:250
4:250
4:250
4:250
4:250
4:250
4:250
4:250
4:250
4:251
4:251
4:251
4:251
4:251
4:251
4:251
4:251
4:251
4:251
4:251
4:251
4:252
4:252
4:252
4:252
4:252
4:252
4:252
4:252
4:252
4:252
4:252
4:252
4:252
4:252
4:253
4:253
4:253
4:253
4:253
4:253
4:253
4:253
4:253
4:253
4:253
4:253
4:253
4:254
4:254
4:254
4:254
4:254
4:254
4:254
4:254
4:254
4:254
4:255
4:255
4:255
4:255
4:255
4:255
4:255
4:255
4:255
4:255
4:256
4:256
4:256
4:256
4:256
4:256
4:256
4:256
4:256
4:256
4:257
4:257
4:257
4:257
4:257
4:257
4:257
4:257
4:257
4:257
4:257
4:257
4:258
4:258
4:258
4:258
4:258
4:258
4:258
4:258
4:258
4:258
4:258
4:258
4:258
4:258
4:258
4:258
4:258
4:258
4:258
4:258
4:258
4:259
4:259
4:259
4:259
4:259
4:259
4:259
4:259
4:259
4:259
4:259
4:259
4:260
4:260
4:260
4:260
4:260
4:260
4:260
4:260
4:260
4:260
4:260
4:260
4:260
4:260
4:261
4:261
4:261
4:261
4:261
4:261
4:261
4:261
4:261
4:261
4:261
4:261
4:261
4:261
4:261
4:261
4:261
4:261
4:261
4:262
4:262
4:262
4:262
4:262
4:262
4:262
4:262
4:262
4:262
4:263
4:263
4:263
4:263
4:263
4:263
4:263
4:263
4:263
4:263
4:264
4:264
4:264
4:264
4:264
4:264
4:264
4:264
4:264
4:264
4:265
4:265
4:265
4:265
4:265
4:265
4:265
4:265
4:265
4:265
4:265
4:265
4:266
4:266
4:266
4:266
4:266
4:266
4:266
4:266
4:266
4:266
4:266
4:266
4:266
4:266
4:266
4:266
4:266
4:266
4:266
4:266
4:266
4:267
4:267
4:267
4:267
4:267
4:267
4:267
4:267
4:267
4:267
4:267
4:267
4:268
4:268
4:268
4:268
4:268
4:268
4:268
4:268
4:268
4:268
4:268
4:268
4:268
4:268
4:269
4:269
4:269
4:269
4:269
4:269
4:269
4:269
4:269
4:269
4:269
4:269
4:269
4:269
4:269
4:269
4:269
4:269
4:269
4:270
4:270
4:270
4:270
4:270
4:270
4:270
4:270
4:270
4:270
4:271
4:271
4:271
4:271
4:271
4:271
4:271
4:271
4:271
4:271
4:272
4:272
4:272
4:272
4:272
4:272
4:272
4:272
4:272
4:272
4:273
4:273
4:273
4:273
4:273
4:273
4:273
4:273
4:273
4:273
4:273
4:273
4:274
4:274
4:274
4:274
4:274
4:274
4:274
4:274
4:274
4:274
4:274
4:274
4:274
4:274
4:274
4:274
4:274
4:274
4:274
4:274
4:274
4:275
4:275
4:275
4:275
4:275
4:275
4:275
4:275
4:275
4:275
4:275
4:275
4:276
4:276
4:276
4:276
4:276
4:276
4:276
4:276
4:276
4:276
4:276
4:276
4:276
4:276
4:277
4:277
4:277
4:277
4:277
4:277
4:277
4:277
4:277
4:277
4:277
4:277
4:277
4:277
4:277
4:277
4:277
4:277
4:277
4:278
4:278
4:278
4:278
4:278
4:278
4:278
4:278
4:278
4:278
4:279
4:279
4:279
4:279
4:279
4:279
4:279
4:279
4:279
4:279
4:280
4:280
4:280
4:280
4:280
4:280
4:280
4:280
4:280
4:280
4:281
4:281
4:281
4:281
4:281
4:281
4:281
4:281
4:281
4:281
4:281
4:281
4:282
4:282
4:282
4:282
4:282
4:282
4:282
4:282
4:282
4:282
4:282
4:282
4:282
4:282
4:282
4:282
4:282
4:282
4:282
4:282
4:282
4:283
4:283
4:283
4:283
4:283
4:283
4:283
4:283
4:283
4:283
4:283
4:283
4:284
4:284
4:284
4:284
4:284
4:284
4:284
4:284
4:284
4:284
4:284
4:284
4:284
4:284
4:285
4:285
4:285
4:285
4:285
4:285
4:285
4:285
4:285
4:285
4:285
4:285
4:285
4:285
4:285
4:285
4:285
4:285
4:285
4:286
4:286
4:286
4:286
4:286
4:286
4:286
4:286
4:286
4:286
4:287
4:287
4:287
4:287
4:287
4:287
4:287
4:287
4:287
4:287
4:288
4:288
4:288
4:288
4:288
4:288
4:288
4:288
4:288
4:288
4:289
4:289
4:289
4:289
4:289
4:289
4:289
4:289
4:289
4:289
4:290
4:290
4:290
4:290
4:290
4:290
4:290
4:290
4:290
4:290
4:290
4:290
4:291
4:291
4:291
4:291
4:291
4:291
4:291
4:291
4:291
4:291
4:291
4:291
4:291
4:291
4:291
4:291
4:291
4:291
4:291
4:291
4:291
4:292
4:292
4:292
4:292
4:292
4:292
4:292
4:292
4:292
4:292
4:292
4:292
4:293
4:293
4:293
4:293
4:293
4:293
4:293
4:293
4:293
4:293
4:293
4:293
4:293
4:293
4:294
4:294
4:294
4:294
4:294
4:294
4:294
4:294
4:294
4:294
4:294
4:294
4:294
4:294
4:294
4:294
4:294
4:294
4:294
4:297
4:297
4:297
4:297
4:297
4:297
4:297
4:297
4:297
4:297
4:297
4:297
4:297
4:297
4:297
4:301
4:301
4:301
4:301
4:301
4:301
4:301
4:301
4:301
4:301
4:301
4:301
4:301
4:301
4:301
4:301
4:301
4:301
4:301
4:301
4:301
4:301
4:301
4:301
4:301
4:301
4:301
4:301
4:301
4:301
4:301
4:301
4:301
4:301
4:301
4:301
4:301
4:301
4:301
4:301
4:301
4:301
4:301
4:301
4:301
4:301
4:301
4:301
4:301
4:301
4:301
4:301
4:301
4:301
4:301
4:301
4:301
4:301
4:301
4:301
4:305
4:305
4:305
4:305
4:305
4:305
4:305
4:305
4:305
4:305
4:305
4:305
4:305
4:305
4:305
4:305
4:305
4:305
4:305
4:305
4:305
4:305
4:305
4:305
4:305
4:305
4:305
4:305
4:305
4:308
4:308
4:308
4:314
4:314
4:314
4:314
4:314
4:314
4:314
4:314
4:314
4:314
4:314
4:314
4:317
4:317
4:317
4:317
4:317
4:317
4:317
4:317
4:317
4:317
4:317
4:317
4:317
4:317
4:318
4:318
4:318
4:318
4:318
4:318
4:318
4:319
4:319
4:319
4:319
4:319
4:319
4:319
4:319
4:319
4:319
4:319
4:319
4:319
4:320
4:320
4:320
4:320
4:320
4:320
4:320
4:320
4:320
4:320
4:320
4:320
4:320
4:320
4:321
4:321
4:321
4:321
4:321
4:321
4:321
4:321
4:321
4:321
4:322
4:322
4:322
4:322
4:322
4:322
4:322
4:322
4:323
4:323
4:323
4:323
4:323
4:323
4:323
4:323
4:323
4:323
4:323
4:323
4:323
4:323
4:325
4:325
4:325
4:325
4:325
4:325
4:325
4:325
4:325
4:325
4:325
4:326
4:326
4:326
4:326
4:326
4:326
4:326
4:326
4:326
4:326
4:326
4:326
4:326
4:326
4:326
4:326
4:326
4:326
4:326
4:326
4:326
4:326
4:326
4:326
4:326
4:326
4:326
4:326
4:326
4:326
4:326
4:326
4:326
4:326
4:326
4:326
4:326
4:326
4:326
4:326
4:326
4:326
4:326
4:326
4:326
4:326
4:326
4:328
4:328
4:328
4:328
4:328
4:328
4:328
4:328
4:328
4:328
4:328
4:330
4:330
4:330
4:330
4:330
4:330
4:330
4:330
4:330
4:330
4:330
4:330
4:330
4:330
4:330
4:331
4:331
4:331
4:331
4:331
4:331
4:331
4:331
4:331
4:331
4:331
4:331
4:331
4:331
4:331
4:331
4:331
4:331
4:331
4:331
4:331
4:331
4:331
4:331
4:331
4:331
4:331
4:331
4:331
4:331
4:331
4:331
4:331
4:331
4:331
4:331
4:331
4:331
4:331
4:331
4:331
4:331
4:331
4:331
4:331
4:331
4:331
4:333
4:333
4:333
4:333
4:333
4:333
4:333
4:333
4:333
4:333
4:333
4:335
4:335
4:335
4:335
4:335
4:335
4:335
4:335
4:335
4:335
4:335
4:335
4:335
4:335
4:335
4:335
4:335
4:335
4:335
4:335
4:335
4:335
4:335
4:336
4:336
4:336
4:336
4:336
4:336
4:336
4:336
4:336
4:336
4:336
4:336
4:336
4:336
4:336
4:336
4:336
4:336
4:336
4:336
4:336
4:336
4:336
4:336
4:336
4:336
4:336
4:336
4:336
4:336
4:336
4:336
4:336
4:336
4:336
4:336
4:336
4:336
4:336
4:336
4:336
4:336
4:336
4:336
4:336
4:336
4:336
4:338
4:338
4:338
4:341
4:341
4:341
4:341
4:341
4:341
4:341
4:341
4:342
4:342
4:342
4:342
4:342
4:342
4:342
4:342
4:343
4:343
4:343
4:343
4:343
4:343
4:343
4:344
4:344
4:344
4:344
4:344
4:344
4:344
4:344
4:344
4:344
4:344
4:344
4:344
4:344
4:345
4:345
4:345
4:345
4:345
4:345
4:345
4:345
4:345
4:345
4:345
4:345
4:345
4:345
4:345
4:345
4:345
4:345
4:345
4:346
4:346
4:346
4:346
4:346
4:346
4:346
4:346
4:346
4:346
4:346
4:346
4:346
4:346
4:346
4:346
4:346
4:346
4:346
4:347
4:347
4:347
4:347
4:347
4:347
4:347
4:347
4:347
4:347
4:347
4:349
4:349
4:349
4:349
4:349
4:349
4:349
4:349
4:349
4:349
4:349
4:349
4:349
4:349
4:349
4:349
4:349
4:349
4:349
4:349
4:349
4:349
4:349
4:349
4:349
4:349
4:349
4:349
4:349
4:349
4:349
4:349
4:349
4:349
4:350
4:350
4:350
4:350
4:350
4:350
4:350
4:350
4:350
4:350
4:350
4:350
4:350
4:350
4:350
4:350
4:350
4:350
4:350
4:350
4:350
4:350
4:351
4:351
4:351
4:351
4:351
4:351
4:351
4:351
4:351
4:351
4:351
4:351
4:351
4:351
4:351
4:351
4:351
4:351
4:351
4:351
4:351
4:351
4:351
4:351
4:351
4:351
4:351
4:351
4:352
4:352
4:352
4:352
4:352
4:352
4:352
4:352
4:352
4:352
4:352
4:352
4:352
4:352
4:352
4:352
4:352
4:352
4:352
4:352
4:352
4:352
4:352
4:352
4:352
4:352
4:352
4:352
4:353
4:353
4:353
4:353
4:353
4:353
4:353
4:353
4:354
4:354
4:354
4:354
4:354
4:354
4:354
4:354
4:354
4:354
4:354
4:354
4:354
4:354
4:354
4:354
4:354
4:355
4:355
4:355
4:355
4:355
4:355
4:355
4:355
4:355
4:355
4:355
4:355
4:355
4:355
4:356
4:356
4:356
4:356
4:356
4:356
4:356
4:356
4:356
4:356
4:357
4:357
4:357
4:357
4:357
4:357
4:357
4:357
4:357
4:357
4:357
4:357
4:358
4:358
4:358
4:358
4:358
4:358
4:358
4:358
4:358
4:358
4:358
4:358
4:358
4:358
4:358
4:358
4:358
4:358
4:358
4:358
4:358
4:359
4:359
4:359
4:359
4:359
4:359
4:359
4:360
4:360
4:360
4:360
4:360
4:360
4:360
4:360
4:360
4:360
4:360
4:360
4:360
4:360
4:360
4:360
4:360
4:360
4:360
4:360
4:360
4:360
4:360
4:360
4:360
4:360
4:360
4:360
4:360
4:360
4:361
4:361
4:361
4:361
4:361
4:361
4:361
4:361
4:361
4:361
4:361
4:361
4:361
4:361
4:363
4:363
4:363
4:363
4:363
4:363
4:363
4:363
4:363
4:363
4:364
4:364
4:364
4:364
4:364
4:364
4:364
4:364
4:364
4:364
4:364
4:364
4:364
4:364
4:364
4:364
4:364
4:364
4:364
4:365
4:365
4:365
4:365
4:366
4:366
4:366
4:366
4:366
4:366
4:366
4:366
4:367
4:367
4:367
4:367
4:367
4:367
4:367
4:367
4:367
4:367
4:368
4:368
4:368
4:368
4:368
4:368
4:368
4:368
4:368
4:368
4:369
4:369
4:369
4:369
4:369
4:369
4:369
4:369
4:370
4:370
4:370
4:370
4:370
4:370
4:370
4:370
4:371
4:371
4:371
4:371
4:371
4:371
4:371
4:371
4:371
4:371
4:372
4:372
4:372
4:372
4:372
4:372
4:372
4:372
4:372
4:372
4:372
4:372
4:373
4:373
4:373
4:373
4:373
4:373
4:373
4:373
4:373
4:373
4:373
4:373
4:373
4:373
4:373
4:373
4:373
4:373
4:373
4:373
4:373
4:374
4:374
4:374
4:374
4:374
4:374
4:374
4:374
4:374
4:374
4:374
4:374
4:374
4:374
4:374
4:374
4:374
4:374
4:374
4:376
4:376
4:376
4:376
4:376
4:376
4:376
4:376
4:376
4:376
4:377
4:377
4:377
4:377
4:377
4:377
4:377
4:377
4:377
4:377
4:378
4:378
4:378
4:378
4:378
4:378
4:378
4:378
4:378
4:378
4:378
4:378
4:379
4:379
4:379
4:379
4:379
4:379
4:379
4:379
4:379
4:379
4:379
4:379
4:379
4:379
4:379
4:379
4:379
4:379
4:379
4:379
4:379
4:380
4:380
4:380
4:380
4:380
4:380
4:380
4:380
4:380
4:380
4:380
4:380
4:380
4:380
4:380
4:380
4:380
4:380
4:380
4:384
4:384
4:384
4:384
4:384
4:384
4:384
4:384
4:384
4:384
4:384
4:384
4:384
4:384
4:384
4:385
4:385
4:385
4:385
4:385
4:385
4:385
4:385
4:385
4:385
4:385
4:385
4:385
4:385
4:385
4:385
4:385
4:385
4:385
4:385
4:385
4:385
4:385
4:385
4:385
4:385
4:385
4:385
4:385
4:385
4:385
4:385
4:385
4:385
4:385
4:385
4:385
4:385
4:385
4:385
4:385
4:385
4:385
4:385
4:385
4:385
4:385
4:385
4:385
4:385
4:385
4:385
4:385
4:385
4:385
4:385
4:385
4:385
4:385
4:385
4:387
4:387
4:387
4:387
4:387
4:387
4:387
4:387
4:387
4:387
4:387
4:387
4:387
4:387
4:387
4:387
4:387
4:387
4:387
4:387
4:387
4:387
4:387
4:387
4:387
4:387
4:387
4:387
4:387
4:389
4:389
4:389
4:389
4:389
4:389
4:389
4:389
4:389
4:389
4:389
4:389
4:389
4:389
4:389
4:389
4:389
4:389
4:389
4:389
4:389
4:389
4:389
4:389
4:389
4:389
4:389
4:389
4:389
4:389
4:389
4:389
4:390
4:390
4:390
4:392
4:392
4:392
4:393
4:393
4:393
4:395
4:395
4:395
4:397
4:397
4:397
4:397
4:397
4:397
4:397
4:397
4:397
4:397
4:397
4:397
4:397
4:397
4:397
4:397
4:397
4:397
4:397
4:397
4:397
4:397
4:397
4:397
4:397
4:397
4:397
4:397
4:397
4:397
4:397
4:397
4:397
4:397
4:397
4:397
4:397
4:397
4:397
4:397
4:397
4:398
4:398
4:398
4:398
4:398
4:398
4:398
4:398
4:398
4:399
4:399
4:399
4:401
4:401
4:401
5:402
5:3
5:3
5:3
5:5
5:5
5:5
5:5
5:5
5:5
5:5
5:5
5:5
5:5
5:5
5:5
5:5
5:5
5:5
5:5
5:5
5:5
5:5
5:5
5:5
5:5
5:5
5:5
5:5
5:5
5:5
5:5
5:5
5:5
5:5
5:5
5:5
5:5
5:5
5:5
5:5
5:5
5:5
5:5
5:5
5:5
5:5
5:5
5:5
5:5
5:5
5:5
5:5
5:5
5:5
5:5
5:5
5:5
5:5
5:5
5:5
5:5
5:5
5:5
5:5
5:5
5:5
5:5
5:5
5:5
5:5
5:5
5:5
5:5
5:5
5:5
5:5
5:5
5:5
5:5
5:5
5:5
5:5
5:5
5:5
5:5
5:5
5:5
5:5
5:5
5:5
5:5
5:5
5:5
5:5
5:5
5:5
5:5
5:5
5:5
5:5
5:5
5:5
5:5
5:5
5:5
5:5
5:5
5:5
5:5
5:5
5:5
5:5
5:5
5:5
5:5
5:5
5:5
5:5
5:5
5:5
5:5
5:5
5:5
5:5
5:5
5:5
5:5
5:5
5:5
5:5
5:5
5:5
5:5
5:5
5:5
5:5
5:5
5:5
5:5
5:5
5:5
5:5
5:5
5:5
5:5
5:5
5:5
5:5
5:5
5:5
5:5
5:5
5:5
5:5
5:5
5:5
5:5
5:5
5:5
5:5
5:5
5:8
5:8
5:8
5:8
5:8
5:8
5:8
5:9
5:9
5:12
5:13
5:17
5:17
5:17
5:17
5:17
5:17
5:17
5:17
5:17
5:17
5:17
5:17
5:17
5:17
5:17
5:17
5:17
5:17
5:18
5:18
5:18
5:18
5:18
5:18
5:18
5:19
5:19
5:19
5:19
5:19
5:23
5:23
5:23
5:23
5:23
5:23
5:23
5:23
5:23
5:23
6:24
6:24
6:24
6:24
6:24
6:15
6:15
6:15
6:15
6:18
6:18
6:18
6:18
6:18
6:18
6:18
6:19
6:19
6:21
6:21
6:21
6:21
6:21
6:21
6:21
6:21
6:23
6:23
6:23
6:23
6:23
6:23
6:23
6:23
6:23
6:23
6:23
6:23
6:23
6:23
6:24
6:24
6:24
6:24
6:24
6:24
6:24
6:24
6:24
6:24
6:24
6:24
6:24
6:24
6:24
6:24
6:24
6:24
6:24
6:25
6:25
6:25
6:25
6:25
6:25
6:25
6:25
6:25
6:25
6:25
6:26
6:26
6:26
6:26
6:26
6:26
6:26
6:26
6:26
6:26
6:26
6:26
6:26
6:26
6:26
6:26
6:26
6:26
6:26
6:27
6:27
6:27
6:27
6:27
6:27
6:27
6:27
6:27
6:27
6:27
6:30
6:30
6:30
6:30
6:30
6:30
6:30
6:30
6:30
6:30
6:30
6:30
6:30
6:30
6:30
6:30
6:30
6:30
6:30
6:30
6:30
6:30
6:30
6:30
6:30
6:30
6:30
6:30
6:30
6:30
6:30
6:30
6:30
6:30
6:31
6:31
6:31
6:31
6:31
6:31
6:31
6:31
6:31
6:31
6:31
6:31
6:31
6:31
6:32
6:32
6:32
6:32
6:32
6:37
6:37
6:37
6:37
6:37
6:37
6:37
6:37
6:37
6:37
-1:-1
