// starting begin end ; end_of_file
   0: END
// var _selected , _playerSides , MyID , HERRO ; do
   1: GO 3
   3: DISABLE
// begin if Multiplayer then
   4: LD_OWVAR 4
   8: IFFALSE 193
// begin hc_name := George Jackson ;
  10: LD_ADDR_OWVAR 26
  14: PUSH
  15: LD_STRING George Jackson
  17: ST_TO_ADDR
// hc_importance := 105 ;
  18: LD_ADDR_OWVAR 32
  22: PUSH
  23: LD_INT 105
  25: ST_TO_ADDR
// hc_gallery := alexander1 ;
  26: LD_ADDR_OWVAR 33
  30: PUSH
  31: LD_STRING alexander1
  33: ST_TO_ADDR
// hc_face_number := 1 ;
  34: LD_ADDR_OWVAR 34
  38: PUSH
  39: LD_INT 1
  41: ST_TO_ADDR
// hc_sex := sex_male ;
  42: LD_ADDR_OWVAR 27
  46: PUSH
  47: LD_INT 1
  49: ST_TO_ADDR
// HERRO := CreateHuman ;
  50: LD_ADDR_LOC 4
  54: PUSH
  55: CALL_OW 44
  59: ST_TO_ADDR
// SetClass ( HERRO , class_mechanic ) ;
  60: LD_LOC 4
  64: PPUSH
  65: LD_INT 3
  67: PPUSH
  68: CALL_OW 336
// setSkill ( HERRO , class_soldier , 2 ) ;
  72: LD_LOC 4
  76: PPUSH
  77: LD_INT 1
  79: PPUSH
  80: LD_INT 2
  82: PPUSH
  83: CALL_OW 237
// setSkill ( HERRO , class_engineer , 4 ) ;
  87: LD_LOC 4
  91: PPUSH
  92: LD_INT 2
  94: PPUSH
  95: LD_INT 4
  97: PPUSH
  98: CALL_OW 237
// setSkill ( HERRO , class_mechanic , 7 ) ;
 102: LD_LOC 4
 106: PPUSH
 107: LD_INT 3
 109: PPUSH
 110: LD_INT 7
 112: PPUSH
 113: CALL_OW 237
// setSkill ( HERRO , class_scientistic , 9 ) ;
 117: LD_LOC 4
 121: PPUSH
 122: LD_INT 4
 124: PPUSH
 125: LD_INT 9
 127: PPUSH
 128: CALL_OW 237
// PlaceUnitXYR ( HERRO , 131 , 119 , 5 , false ) ;
 132: LD_LOC 4
 136: PPUSH
 137: LD_INT 131
 139: PPUSH
 140: LD_INT 119
 142: PPUSH
 143: LD_INT 5
 145: PPUSH
 146: LD_INT 0
 148: PPUSH
 149: CALL_OW 50
// begin hc_importance := 0 ;
 153: LD_ADDR_OWVAR 32
 157: PUSH
 158: LD_INT 0
 160: ST_TO_ADDR
// hc_name :=  ;
 161: LD_ADDR_OWVAR 26
 165: PUSH
 166: LD_STRING 
 168: ST_TO_ADDR
// hc_gallery :=  ;
 169: LD_ADDR_OWVAR 33
 173: PUSH
 174: LD_STRING 
 176: ST_TO_ADDR
// hc_face_number := 0 ;
 177: LD_ADDR_OWVAR 34
 181: PUSH
 182: LD_INT 0
 184: ST_TO_ADDR
// hc_sex := 1 ;
 185: LD_ADDR_OWVAR 27
 189: PUSH
 190: LD_INT 1
 192: ST_TO_ADDR
// end ; end ; end ;
 193: END
// do
 194: GO 196
 196: DISABLE
// begin IgnoreSideSettingsCRC ;
 197: CALL_OW 594
// _playerSides := [ ] ;
 201: LD_ADDR_LOC 2
 205: PUSH
 206: EMPTY
 207: ST_TO_ADDR
// _selected := [ ] ;
 208: LD_ADDR_LOC 1
 212: PUSH
 213: EMPTY
 214: ST_TO_ADDR
// display_strings := [ ] ;
 215: LD_ADDR_OWVAR 47
 219: PUSH
 220: EMPTY
 221: ST_TO_ADDR
// ToLua ( include("_vkeys") ) ;
 222: LD_STRING include("_vkeys")
 224: PPUSH
 225: CALL_OW 559
// wait ( 0 0$3 ) ;
 229: LD_INT 105
 231: PPUSH
 232: CALL_OW 67
// ToLua ( InitID() ) ;
 236: LD_STRING InitID()
 238: PPUSH
 239: CALL_OW 559
// end ;
 243: END
// on ActiveUnitChanged ( un ) do begin SendCustomCommand ( 210 , your_side , un , 0 , 0 ) ;
 244: LD_INT 210
 246: PPUSH
 247: LD_OWVAR 2
 251: PPUSH
 252: LD_VAR 0 1
 256: PPUSH
 257: LD_INT 0
 259: PPUSH
 260: LD_INT 0
 262: PPUSH
 263: CALL_OW 581
// ToLua ( framework.FROM_OW_DATA =  & GetUnitVoice ( un ) ) ;
 267: LD_STRING framework.FROM_OW_DATA = 
 269: PUSH
 270: LD_VAR 0 1
 274: PPUSH
 275: CALL_OW 606
 279: STR
 280: PPUSH
 281: CALL_OW 559
// end ;
 285: PPOPN 1
 287: END
// export Selected_Unit , saved_side , result_units ; do
 288: GO 290
 290: DISABLE
// begin result_units = [ ] ;
 291: LD_ADDR_EXP 3
 295: PUSH
 296: EMPTY
 297: ST_TO_ADDR
// Selected_Unit = 0 ;
 298: LD_ADDR_EXP 1
 302: PUSH
 303: LD_INT 0
 305: ST_TO_ADDR
// end ;
 306: END
// var counter ; var synchronised_selection ; var c ; do
 307: GO 309
 309: DISABLE
// begin counter = 0 ;
 310: LD_ADDR_LOC 5
 314: PUSH
 315: LD_INT 0
 317: ST_TO_ADDR
// c = 0 ;
 318: LD_ADDR_LOC 7
 322: PUSH
 323: LD_INT 0
 325: ST_TO_ADDR
// synchronised_selection = [ ] ;
 326: LD_ADDR_LOC 6
 330: PUSH
 331: EMPTY
 332: ST_TO_ADDR
// end ;
 333: END
// on CustomCommand ( side , value1 , value2 , value3 , value4 , value5 ) do var un ;
 334: LD_INT 0
 336: PPUSH
// case value1 of 1 :
 337: LD_VAR 0 2
 341: PUSH
 342: LD_INT 1
 344: DOUBLE
 345: EQUAL
 346: IFTRUE 350
 348: GO 367
 350: POP
// SetClass ( value2 , value3 ) ; 2 :
 351: LD_VAR 0 3
 355: PPUSH
 356: LD_VAR 0 4
 360: PPUSH
 361: CALL_OW 336
 365: GO 1317
 367: LD_INT 2
 369: DOUBLE
 370: EQUAL
 371: IFTRUE 375
 373: GO 426
 375: POP
// begin DeselectUnits ( Selected_Unit ) ;
 376: LD_EXP 1
 380: PPUSH
 381: CALL_OW 491
// SelectUnits ( value2 ) ;
 385: LD_VAR 0 3
 389: PPUSH
 390: CALL_OW 490
// ForceExclamation ( value2 , Rand ( 1 , 2 ) ) ;
 394: LD_VAR 0 3
 398: PPUSH
 399: LD_INT 1
 401: PPUSH
 402: LD_INT 2
 404: PPUSH
 405: CALL_OW 12
 409: PPUSH
 410: CALL_OW 582
// Selected_Unit = value2 ;
 414: LD_ADDR_EXP 1
 418: PUSH
 419: LD_VAR 0 3
 423: ST_TO_ADDR
// end ; 3 :
 424: GO 1317
 426: LD_INT 3
 428: DOUBLE
 429: EQUAL
 430: IFTRUE 434
 432: GO 447
 434: POP
// your_side = saved_side ; 4 :
 435: LD_ADDR_OWVAR 2
 439: PUSH
 440: LD_EXP 2
 444: ST_TO_ADDR
 445: GO 1317
 447: LD_INT 4
 449: DOUBLE
 450: EQUAL
 451: IFTRUE 455
 453: GO 524
 455: POP
// begin result_units = Insert ( result_units , result_units + 1 , value2 ) ;
 456: LD_ADDR_EXP 3
 460: PUSH
 461: LD_EXP 3
 465: PPUSH
 466: LD_EXP 3
 470: PUSH
 471: LD_INT 1
 473: PLUS
 474: PPUSH
 475: LD_VAR 0 3
 479: PPUSH
 480: CALL_OW 2
 484: ST_TO_ADDR
// ComExitVehicle ( result_units ) ;
 485: LD_EXP 3
 489: PPUSH
 490: CALL_OW 121
// AddComExitBuilding ( result_units ) ;
 494: LD_EXP 3
 498: PPUSH
 499: CALL_OW 182
// SetSide ( result_units , 1 ) ;
 503: LD_EXP 3
 507: PPUSH
 508: LD_INT 1
 510: PPUSH
 511: CALL_OW 235
// synchronised_selection = [ ] ;
 515: LD_ADDR_LOC 6
 519: PUSH
 520: EMPTY
 521: ST_TO_ADDR
// end ; 9 :
 522: GO 1317
 524: LD_INT 9
 526: DOUBLE
 527: EQUAL
 528: IFTRUE 532
 530: GO 555
 532: POP
// if value2 = 0 then
 533: LD_VAR 0 3
 537: PUSH
 538: LD_INT 0
 540: EQUAL
 541: IFFALSE 549
// DisableExclamations ( ) else
 543: CALL_OW 474
 547: GO 553
// EnableExclamations ( ) ; 201 :
 549: CALL_OW 473
 553: GO 1317
 555: LD_INT 201
 557: DOUBLE
 558: EQUAL
 559: IFTRUE 563
 561: GO 601
 563: POP
// if side = your_side then
 564: LD_VAR 0 1
 568: PUSH
 569: LD_OWVAR 2
 573: EQUAL
 574: IFFALSE 599
// SendCustomCommand ( 202 , your_side , value2 , 0 , 0 ) ; 202 :
 576: LD_INT 202
 578: PPUSH
 579: LD_OWVAR 2
 583: PPUSH
 584: LD_VAR 0 3
 588: PPUSH
 589: LD_INT 0
 591: PPUSH
 592: LD_INT 0
 594: PPUSH
 595: CALL_OW 581
 599: GO 1317
 601: LD_INT 202
 603: DOUBLE
 604: EQUAL
 605: IFTRUE 609
 607: GO 632
 609: POP
// SetSide ( _selected [ value2 ] , value3 ) ; 500 :
 610: LD_LOC 1
 614: PUSH
 615: LD_VAR 0 3
 619: ARRAY
 620: PPUSH
 621: LD_VAR 0 4
 625: PPUSH
 626: CALL_OW 235
 630: GO 1317
 632: LD_INT 500
 634: DOUBLE
 635: EQUAL
 636: IFTRUE 640
 638: GO 904
 640: POP
// begin display_strings := [ value3 , value4 ] ;
 641: LD_ADDR_OWVAR 47
 645: PUSH
 646: LD_VAR 0 4
 650: PUSH
 651: LD_VAR 0 5
 655: PUSH
 656: EMPTY
 657: LIST
 658: LIST
 659: ST_TO_ADDR
// uc_side := side ;
 660: LD_ADDR_OWVAR 20
 664: PUSH
 665: LD_VAR 0 1
 669: ST_TO_ADDR
// case uc_side of 1 :
 670: LD_OWVAR 20
 674: PUSH
 675: LD_INT 1
 677: DOUBLE
 678: EQUAL
 679: IFTRUE 683
 681: GO 694
 683: POP
// uc_nation = nation_american ; 2 :
 684: LD_ADDR_OWVAR 21
 688: PUSH
 689: LD_INT 1
 691: ST_TO_ADDR
 692: GO 847
 694: LD_INT 2
 696: DOUBLE
 697: EQUAL
 698: IFTRUE 702
 700: GO 713
 702: POP
// uc_nation = nation_arabian ; 3 :
 703: LD_ADDR_OWVAR 21
 707: PUSH
 708: LD_INT 2
 710: ST_TO_ADDR
 711: GO 847
 713: LD_INT 3
 715: DOUBLE
 716: EQUAL
 717: IFTRUE 721
 719: GO 732
 721: POP
// uc_nation = nation_russian ; 4 :
 722: LD_ADDR_OWVAR 21
 726: PUSH
 727: LD_INT 3
 729: ST_TO_ADDR
 730: GO 847
 732: LD_INT 4
 734: DOUBLE
 735: EQUAL
 736: IFTRUE 740
 738: GO 751
 740: POP
// uc_nation = nation_american ; 5 :
 741: LD_ADDR_OWVAR 21
 745: PUSH
 746: LD_INT 1
 748: ST_TO_ADDR
 749: GO 847
 751: LD_INT 5
 753: DOUBLE
 754: EQUAL
 755: IFTRUE 759
 757: GO 770
 759: POP
// uc_nation = nation_russian ; 6 :
 760: LD_ADDR_OWVAR 21
 764: PUSH
 765: LD_INT 3
 767: ST_TO_ADDR
 768: GO 847
 770: LD_INT 6
 772: DOUBLE
 773: EQUAL
 774: IFTRUE 778
 776: GO 789
 778: POP
// uc_nation = nation_russian ; 7 :
 779: LD_ADDR_OWVAR 21
 783: PUSH
 784: LD_INT 3
 786: ST_TO_ADDR
 787: GO 847
 789: LD_INT 7
 791: DOUBLE
 792: EQUAL
 793: IFTRUE 797
 795: GO 808
 797: POP
// uc_nation = nation_american ; 8 :
 798: LD_ADDR_OWVAR 21
 802: PUSH
 803: LD_INT 1
 805: ST_TO_ADDR
 806: GO 847
 808: LD_INT 8
 810: DOUBLE
 811: EQUAL
 812: IFTRUE 816
 814: GO 827
 816: POP
// uc_nation = nation_arabian ; 9 :
 817: LD_ADDR_OWVAR 21
 821: PUSH
 822: LD_INT 2
 824: ST_TO_ADDR
 825: GO 847
 827: LD_INT 9
 829: DOUBLE
 830: EQUAL
 831: IFTRUE 835
 833: GO 846
 835: POP
// uc_nation = nation_arabian ; end ;
 836: LD_ADDR_OWVAR 21
 840: PUSH
 841: LD_INT 2
 843: ST_TO_ADDR
 844: GO 847
 846: POP
// PrepareHuman ( false , Rand ( 1 , 4 ) , Rand ( - 10 , 10 ) ) ;
 847: LD_INT 0
 849: PPUSH
 850: LD_INT 1
 852: PPUSH
 853: LD_INT 4
 855: PPUSH
 856: CALL_OW 12
 860: PPUSH
 861: LD_INT 10
 863: NEG
 864: PPUSH
 865: LD_INT 10
 867: PPUSH
 868: CALL_OW 12
 872: PPUSH
 873: CALL_OW 380
// PlaceUnitXYR ( CreateHuman , value2 , value3 , 1 , true ) ;
 877: CALL_OW 44
 881: PPUSH
 882: LD_VAR 0 3
 886: PPUSH
 887: LD_VAR 0 4
 891: PPUSH
 892: LD_INT 1
 894: PPUSH
 895: LD_INT 1
 897: PPUSH
 898: CALL_OW 50
// end ; 510 :
 902: GO 1317
 904: LD_INT 510
 906: DOUBLE
 907: EQUAL
 908: IFTRUE 912
 910: GO 946
 912: POP
// CreateCratesXYR ( Rand ( 1 , 5 ) , value2 , value3 , 2 , true ) ; 511 :
 913: LD_INT 1
 915: PPUSH
 916: LD_INT 5
 918: PPUSH
 919: CALL_OW 12
 923: PPUSH
 924: LD_VAR 0 3
 928: PPUSH
 929: LD_VAR 0 4
 933: PPUSH
 934: LD_INT 2
 936: PPUSH
 937: LD_INT 1
 939: PPUSH
 940: CALL_OW 56
 944: GO 1317
 946: LD_INT 511
 948: DOUBLE
 949: EQUAL
 950: IFTRUE 954
 952: GO 1026
 954: POP
// if side = your_side then
 955: LD_VAR 0 1
 959: PUSH
 960: LD_OWVAR 2
 964: EQUAL
 965: IFFALSE 1024
// begin for un in Selection do
 967: LD_ADDR_VAR 0 7
 971: PUSH
 972: LD_EXP 4
 976: PUSH
 977: FOR_IN
 978: IFFALSE 1003
// SendCustomCommand ( 512 , un , 0 , 0 , 0 ) ;
 980: LD_INT 512
 982: PPUSH
 983: LD_VAR 0 7
 987: PPUSH
 988: LD_INT 0
 990: PPUSH
 991: LD_INT 0
 993: PPUSH
 994: LD_INT 0
 996: PPUSH
 997: CALL_OW 581
1001: GO 977
1003: POP
1004: POP
// SendCustomCommand ( 513 , 0 , 0 , 0 , 0 ) ;
1005: LD_INT 513
1007: PPUSH
1008: LD_INT 0
1010: PPUSH
1011: LD_INT 0
1013: PPUSH
1014: LD_INT 0
1016: PPUSH
1017: LD_INT 0
1019: PPUSH
1020: CALL_OW 581
// end ; 512 :
1024: GO 1317
1026: LD_INT 512
1028: DOUBLE
1029: EQUAL
1030: IFTRUE 1034
1032: GO 1053
1034: POP
// synchronised_selection = synchronised_selection union value2 ; 513 :
1035: LD_ADDR_LOC 6
1039: PUSH
1040: LD_LOC 6
1044: PUSH
1045: LD_VAR 0 3
1049: UNION
1050: ST_TO_ADDR
1051: GO 1317
1053: LD_INT 513
1055: DOUBLE
1056: EQUAL
1057: IFTRUE 1061
1059: GO 1113
1061: POP
// StartTeamSelection ( 5 , FilterAllUnits ( [ [ f_side , 1 ] , [ f_type , unit_human ] ] ) , synchronised_selection , [ Eliott ] ) ; 200 :
1062: LD_INT 5
1064: PPUSH
1065: LD_INT 22
1067: PUSH
1068: LD_INT 1
1070: PUSH
1071: EMPTY
1072: LIST
1073: LIST
1074: PUSH
1075: LD_INT 21
1077: PUSH
1078: LD_INT 1
1080: PUSH
1081: EMPTY
1082: LIST
1083: LIST
1084: PUSH
1085: EMPTY
1086: LIST
1087: LIST
1088: PPUSH
1089: CALL_OW 69
1093: PPUSH
1094: LD_LOC 6
1098: PPUSH
1099: LD_EXP 5
1103: PUSH
1104: EMPTY
1105: LIST
1106: PPUSH
1107: CALL 1320 0 4
1111: GO 1317
1113: LD_INT 200
1115: DOUBLE
1116: EQUAL
1117: IFTRUE 1121
1119: GO 1177
1121: POP
// begin _playerSides := replace ( _playerSides , value3 , value2 ) ;
1122: LD_ADDR_LOC 2
1126: PUSH
1127: LD_LOC 2
1131: PPUSH
1132: LD_VAR 0 4
1136: PPUSH
1137: LD_VAR 0 3
1141: PPUSH
1142: CALL_OW 1
1146: ST_TO_ADDR
// if value3 = MyID then
1147: LD_VAR 0 4
1151: PUSH
1152: LD_LOC 3
1156: EQUAL
1157: IFFALSE 1175
// your_side := _playerSides [ value3 ] ;
1159: LD_ADDR_OWVAR 2
1163: PUSH
1164: LD_LOC 2
1168: PUSH
1169: LD_VAR 0 4
1173: ARRAY
1174: ST_TO_ADDR
// end ; 300 :
1175: GO 1317
1177: LD_INT 300
1179: DOUBLE
1180: EQUAL
1181: IFTRUE 1185
1183: GO 1210
1185: POP
// if side = your_side then
1186: LD_VAR 0 1
1190: PUSH
1191: LD_OWVAR 2
1195: EQUAL
1196: IFFALSE 1208
// MyID = value2 ; 203 :
1198: LD_ADDR_LOC 3
1202: PUSH
1203: LD_VAR 0 3
1207: ST_TO_ADDR
1208: GO 1317
1210: LD_INT 203
1212: DOUBLE
1213: EQUAL
1214: IFTRUE 1218
1216: GO 1254
1218: POP
// if side = your_side then
1219: LD_VAR 0 1
1223: PUSH
1224: LD_OWVAR 2
1228: EQUAL
1229: IFFALSE 1252
// SendCustomCommand ( 204 , your_side , 0 , 0 , 0 ) ; 204 :
1231: LD_INT 204
1233: PPUSH
1234: LD_OWVAR 2
1238: PPUSH
1239: LD_INT 0
1241: PPUSH
1242: LD_INT 0
1244: PPUSH
1245: LD_INT 0
1247: PPUSH
1248: CALL_OW 581
1252: GO 1317
1254: LD_INT 204
1256: DOUBLE
1257: EQUAL
1258: IFTRUE 1262
1260: GO 1280
1262: POP
// KillUnit ( _selected [ value2 ] ) ; 210 :
1263: LD_LOC 1
1267: PUSH
1268: LD_VAR 0 3
1272: ARRAY
1273: PPUSH
1274: CALL_OW 66
1278: GO 1317
1280: LD_INT 210
1282: DOUBLE
1283: EQUAL
1284: IFTRUE 1288
1286: GO 1316
1288: POP
// _selected := replace ( _selected , value2 , value3 ) ; end ;
1289: LD_ADDR_LOC 1
1293: PUSH
1294: LD_LOC 1
1298: PPUSH
1299: LD_VAR 0 3
1303: PPUSH
1304: LD_VAR 0 4
1308: PPUSH
1309: CALL_OW 1
1313: ST_TO_ADDR
1314: GO 1317
1316: POP
1317: PPOPN 7
1319: END
// export function StartTeamSelection ( MAX , YOURS , HUMANS , LEADER ) ; var class , i ; begin
1320: LD_INT 0
1322: PPUSH
1323: PPUSH
1324: PPUSH
// counter = counter + 1 ;
1325: LD_ADDR_LOC 5
1329: PUSH
1330: LD_LOC 5
1334: PUSH
1335: LD_INT 1
1337: PLUS
1338: ST_TO_ADDR
// if counter = 2 then
1339: LD_LOC 5
1343: PUSH
1344: LD_INT 2
1346: EQUAL
1347: IFFALSE 2217
// begin saved_side = your_side ;
1349: LD_ADDR_EXP 2
1353: PUSH
1354: LD_OWVAR 2
1358: ST_TO_ADDR
// your_side = 0 ;
1359: LD_ADDR_OWVAR 2
1363: PUSH
1364: LD_INT 0
1366: ST_TO_ADDR
// display_strings := [ TS counter:  & counter ] ;
1367: LD_ADDR_OWVAR 47
1371: PUSH
1372: LD_STRING TS counter: 
1374: PUSH
1375: LD_LOC 5
1379: STR
1380: PUSH
1381: EMPTY
1382: LIST
1383: ST_TO_ADDR
// ToLua ( TeamSelect.setUpClassInfo({MIN=1,MAX= & MAX & ,PROFS={{ID=1,NAME="Soldier",MIN=0,MAX=-1},{ID=2,NAME="Engineer",MIN=0,MAX=-1},{ID=3,NAME="Mechanic",MIN=0,MAX=-1},{ID=4,NAME="Scientist",MIN=0,MAX=-1}},PROF_COUNT=4}) ) ;
1384: LD_STRING TeamSelect.setUpClassInfo({MIN=1,MAX=
1386: PUSH
1387: LD_VAR 0 1
1391: STR
1392: PUSH
1393: LD_STRING ,PROFS={{ID=1,NAME="Soldier",MIN=0,MAX=-1},{ID=2,NAME="Engineer",MIN=0,MAX=-1},{ID=3,NAME="Mechanic",MIN=0,MAX=-1},{ID=4,NAME="Scientist",MIN=0,MAX=-1}},PROF_COUNT=4})
1395: STR
1396: PPUSH
1397: CALL_OW 559
// for i = 1 to YOURS do
1401: LD_ADDR_VAR 0 7
1405: PUSH
1406: DOUBLE
1407: LD_INT 1
1409: DEC
1410: ST_TO_ADDR
1411: LD_VAR 0 2
1415: PUSH
1416: FOR_TO
1417: IFFALSE 1666
// begin if GetClass ( YOURS [ i ] ) = class_soldier then
1419: LD_VAR 0 2
1423: PUSH
1424: LD_VAR 0 7
1428: ARRAY
1429: PPUSH
1430: CALL_OW 257
1434: PUSH
1435: LD_INT 1
1437: EQUAL
1438: IFFALSE 1448
// class = Soldier ;
1440: LD_ADDR_VAR 0 6
1444: PUSH
1445: LD_STRING Soldier
1447: ST_TO_ADDR
// if GetClass ( YOURS [ i ] ) = class_engineer then
1448: LD_VAR 0 2
1452: PUSH
1453: LD_VAR 0 7
1457: ARRAY
1458: PPUSH
1459: CALL_OW 257
1463: PUSH
1464: LD_INT 2
1466: EQUAL
1467: IFFALSE 1477
// class = Engineer ;
1469: LD_ADDR_VAR 0 6
1473: PUSH
1474: LD_STRING Engineer
1476: ST_TO_ADDR
// if GetClass ( YOURS [ i ] ) = class_mechanic then
1477: LD_VAR 0 2
1481: PUSH
1482: LD_VAR 0 7
1486: ARRAY
1487: PPUSH
1488: CALL_OW 257
1492: PUSH
1493: LD_INT 3
1495: EQUAL
1496: IFFALSE 1506
// class = Mechanic ;
1498: LD_ADDR_VAR 0 6
1502: PUSH
1503: LD_STRING Mechanic
1505: ST_TO_ADDR
// if GetClass ( YOURS [ i ] ) = class_scientistic then
1506: LD_VAR 0 2
1510: PUSH
1511: LD_VAR 0 7
1515: ARRAY
1516: PPUSH
1517: CALL_OW 257
1521: PUSH
1522: LD_INT 4
1524: EQUAL
1525: IFFALSE 1535
// class = Scientist ;
1527: LD_ADDR_VAR 0 6
1531: PUSH
1532: LD_STRING Scientist
1534: ST_TO_ADDR
// ToLua ( TeamSelect.setUpUnit({UID= & YOURS [ i ] & ,isCommander=true,isInterlocutor=false,isHired=false,isChangeable=false,canChangeClass=true,canIgnoreClassRestrictions=false,class=" & class & ",skills={ & GetSkill ( YOURS [ i ] , 1 ) & , & GetSkill ( YOURS [ i ] , 2 ) & , & GetSkill ( YOURS [ i ] , 3 ) & , & GetSkill ( YOURS [ i ] , 4 ) & },name=""}) ) ;
1535: LD_STRING TeamSelect.setUpUnit({UID=
1537: PUSH
1538: LD_VAR 0 2
1542: PUSH
1543: LD_VAR 0 7
1547: ARRAY
1548: STR
1549: PUSH
1550: LD_STRING ,isCommander=true,isInterlocutor=false,isHired=false,isChangeable=false,canChangeClass=true,canIgnoreClassRestrictions=false,class="
1552: STR
1553: PUSH
1554: LD_VAR 0 6
1558: STR
1559: PUSH
1560: LD_STRING ",skills={
1562: STR
1563: PUSH
1564: LD_VAR 0 2
1568: PUSH
1569: LD_VAR 0 7
1573: ARRAY
1574: PPUSH
1575: LD_INT 1
1577: PPUSH
1578: CALL_OW 259
1582: STR
1583: PUSH
1584: LD_STRING ,
1586: STR
1587: PUSH
1588: LD_VAR 0 2
1592: PUSH
1593: LD_VAR 0 7
1597: ARRAY
1598: PPUSH
1599: LD_INT 2
1601: PPUSH
1602: CALL_OW 259
1606: STR
1607: PUSH
1608: LD_STRING ,
1610: STR
1611: PUSH
1612: LD_VAR 0 2
1616: PUSH
1617: LD_VAR 0 7
1621: ARRAY
1622: PPUSH
1623: LD_INT 3
1625: PPUSH
1626: CALL_OW 259
1630: STR
1631: PUSH
1632: LD_STRING ,
1634: STR
1635: PUSH
1636: LD_VAR 0 2
1640: PUSH
1641: LD_VAR 0 7
1645: ARRAY
1646: PPUSH
1647: LD_INT 4
1649: PPUSH
1650: CALL_OW 259
1654: STR
1655: PUSH
1656: LD_STRING },name=""})
1658: STR
1659: PPUSH
1660: CALL_OW 559
// end ;
1664: GO 1416
1666: POP
1667: POP
// for i = 1 to HUMANS do
1668: LD_ADDR_VAR 0 7
1672: PUSH
1673: DOUBLE
1674: LD_INT 1
1676: DEC
1677: ST_TO_ADDR
1678: LD_VAR 0 3
1682: PUSH
1683: FOR_TO
1684: IFFALSE 1933
// begin if GetClass ( HUMANS [ i ] ) = class_soldier then
1686: LD_VAR 0 3
1690: PUSH
1691: LD_VAR 0 7
1695: ARRAY
1696: PPUSH
1697: CALL_OW 257
1701: PUSH
1702: LD_INT 1
1704: EQUAL
1705: IFFALSE 1715
// class = Soldier ;
1707: LD_ADDR_VAR 0 6
1711: PUSH
1712: LD_STRING Soldier
1714: ST_TO_ADDR
// if GetClass ( HUMANS [ i ] ) = class_engineer then
1715: LD_VAR 0 3
1719: PUSH
1720: LD_VAR 0 7
1724: ARRAY
1725: PPUSH
1726: CALL_OW 257
1730: PUSH
1731: LD_INT 2
1733: EQUAL
1734: IFFALSE 1744
// class = Engineer ;
1736: LD_ADDR_VAR 0 6
1740: PUSH
1741: LD_STRING Engineer
1743: ST_TO_ADDR
// if GetClass ( HUMANS [ i ] ) = class_mechanic then
1744: LD_VAR 0 3
1748: PUSH
1749: LD_VAR 0 7
1753: ARRAY
1754: PPUSH
1755: CALL_OW 257
1759: PUSH
1760: LD_INT 3
1762: EQUAL
1763: IFFALSE 1773
// class = Mechanic ;
1765: LD_ADDR_VAR 0 6
1769: PUSH
1770: LD_STRING Mechanic
1772: ST_TO_ADDR
// if GetClass ( HUMANS [ i ] ) = class_scientistic then
1773: LD_VAR 0 3
1777: PUSH
1778: LD_VAR 0 7
1782: ARRAY
1783: PPUSH
1784: CALL_OW 257
1788: PUSH
1789: LD_INT 4
1791: EQUAL
1792: IFFALSE 1802
// class = Scientist ;
1794: LD_ADDR_VAR 0 6
1798: PUSH
1799: LD_STRING Scientist
1801: ST_TO_ADDR
// ToLua ( TeamSelect.setUpUnit({UID= & HUMANS [ i ] & ,isCommander=false,isInterlocutor=false,isHired=false,isChangeable=true,canChangeClass=true,canIgnoreClassRestrictions=false,class=" & class & ",skills={ & GetSkill ( HUMANS [ i ] , 1 ) & , & GetSkill ( HUMANS [ i ] , 2 ) & , & GetSkill ( HUMANS [ i ] , 3 ) & , & GetSkill ( HUMANS [ i ] , 4 ) & },name=""}) ) ;
1802: LD_STRING TeamSelect.setUpUnit({UID=
1804: PUSH
1805: LD_VAR 0 3
1809: PUSH
1810: LD_VAR 0 7
1814: ARRAY
1815: STR
1816: PUSH
1817: LD_STRING ,isCommander=false,isInterlocutor=false,isHired=false,isChangeable=true,canChangeClass=true,canIgnoreClassRestrictions=false,class="
1819: STR
1820: PUSH
1821: LD_VAR 0 6
1825: STR
1826: PUSH
1827: LD_STRING ",skills={
1829: STR
1830: PUSH
1831: LD_VAR 0 3
1835: PUSH
1836: LD_VAR 0 7
1840: ARRAY
1841: PPUSH
1842: LD_INT 1
1844: PPUSH
1845: CALL_OW 259
1849: STR
1850: PUSH
1851: LD_STRING ,
1853: STR
1854: PUSH
1855: LD_VAR 0 3
1859: PUSH
1860: LD_VAR 0 7
1864: ARRAY
1865: PPUSH
1866: LD_INT 2
1868: PPUSH
1869: CALL_OW 259
1873: STR
1874: PUSH
1875: LD_STRING ,
1877: STR
1878: PUSH
1879: LD_VAR 0 3
1883: PUSH
1884: LD_VAR 0 7
1888: ARRAY
1889: PPUSH
1890: LD_INT 3
1892: PPUSH
1893: CALL_OW 259
1897: STR
1898: PUSH
1899: LD_STRING ,
1901: STR
1902: PUSH
1903: LD_VAR 0 3
1907: PUSH
1908: LD_VAR 0 7
1912: ARRAY
1913: PPUSH
1914: LD_INT 4
1916: PPUSH
1917: CALL_OW 259
1921: STR
1922: PUSH
1923: LD_STRING },name=""})
1925: STR
1926: PPUSH
1927: CALL_OW 559
// end ;
1931: GO 1683
1933: POP
1934: POP
// for i = 1 to LEADER do
1935: LD_ADDR_VAR 0 7
1939: PUSH
1940: DOUBLE
1941: LD_INT 1
1943: DEC
1944: ST_TO_ADDR
1945: LD_VAR 0 4
1949: PUSH
1950: FOR_TO
1951: IFFALSE 2200
// begin if GetClass ( LEADER [ i ] ) = class_soldier then
1953: LD_VAR 0 4
1957: PUSH
1958: LD_VAR 0 7
1962: ARRAY
1963: PPUSH
1964: CALL_OW 257
1968: PUSH
1969: LD_INT 1
1971: EQUAL
1972: IFFALSE 1982
// class = Soldier ;
1974: LD_ADDR_VAR 0 6
1978: PUSH
1979: LD_STRING Soldier
1981: ST_TO_ADDR
// if GetClass ( LEADER [ i ] ) = class_engineer then
1982: LD_VAR 0 4
1986: PUSH
1987: LD_VAR 0 7
1991: ARRAY
1992: PPUSH
1993: CALL_OW 257
1997: PUSH
1998: LD_INT 2
2000: EQUAL
2001: IFFALSE 2011
// class = Engineer ;
2003: LD_ADDR_VAR 0 6
2007: PUSH
2008: LD_STRING Engineer
2010: ST_TO_ADDR
// if GetClass ( LEADER [ i ] ) = class_mechanic then
2011: LD_VAR 0 4
2015: PUSH
2016: LD_VAR 0 7
2020: ARRAY
2021: PPUSH
2022: CALL_OW 257
2026: PUSH
2027: LD_INT 3
2029: EQUAL
2030: IFFALSE 2040
// class = Mechanic ;
2032: LD_ADDR_VAR 0 6
2036: PUSH
2037: LD_STRING Mechanic
2039: ST_TO_ADDR
// if GetClass ( LEADER [ i ] ) = class_scientistic then
2040: LD_VAR 0 4
2044: PUSH
2045: LD_VAR 0 7
2049: ARRAY
2050: PPUSH
2051: CALL_OW 257
2055: PUSH
2056: LD_INT 4
2058: EQUAL
2059: IFFALSE 2069
// class = Scientist ;
2061: LD_ADDR_VAR 0 6
2065: PUSH
2066: LD_STRING Scientist
2068: ST_TO_ADDR
// ToLua ( TeamSelect.setUpUnit({UID= & LEADER [ i ] & ,isCommander=false,isInterlocutor=true,isHired=false,isChangeable=false,canChangeClass=false,canIgnoreClassRestrictions=false,class=" & class & ",skills={ & GetSkill ( LEADER [ i ] , 1 ) & , & GetSkill ( LEADER [ i ] , 2 ) & , & GetSkill ( LEADER [ i ] , 3 ) & , & GetSkill ( LEADER [ i ] , 4 ) & },name=""}) ) ;
2069: LD_STRING TeamSelect.setUpUnit({UID=
2071: PUSH
2072: LD_VAR 0 4
2076: PUSH
2077: LD_VAR 0 7
2081: ARRAY
2082: STR
2083: PUSH
2084: LD_STRING ,isCommander=false,isInterlocutor=true,isHired=false,isChangeable=false,canChangeClass=false,canIgnoreClassRestrictions=false,class="
2086: STR
2087: PUSH
2088: LD_VAR 0 6
2092: STR
2093: PUSH
2094: LD_STRING ",skills={
2096: STR
2097: PUSH
2098: LD_VAR 0 4
2102: PUSH
2103: LD_VAR 0 7
2107: ARRAY
2108: PPUSH
2109: LD_INT 1
2111: PPUSH
2112: CALL_OW 259
2116: STR
2117: PUSH
2118: LD_STRING ,
2120: STR
2121: PUSH
2122: LD_VAR 0 4
2126: PUSH
2127: LD_VAR 0 7
2131: ARRAY
2132: PPUSH
2133: LD_INT 2
2135: PPUSH
2136: CALL_OW 259
2140: STR
2141: PUSH
2142: LD_STRING ,
2144: STR
2145: PUSH
2146: LD_VAR 0 4
2150: PUSH
2151: LD_VAR 0 7
2155: ARRAY
2156: PPUSH
2157: LD_INT 3
2159: PPUSH
2160: CALL_OW 259
2164: STR
2165: PUSH
2166: LD_STRING ,
2168: STR
2169: PUSH
2170: LD_VAR 0 4
2174: PUSH
2175: LD_VAR 0 7
2179: ARRAY
2180: PPUSH
2181: LD_INT 4
2183: PPUSH
2184: CALL_OW 259
2188: STR
2189: PUSH
2190: LD_STRING },name=""})
2192: STR
2193: PPUSH
2194: CALL_OW 559
// end ;
2198: GO 1950
2200: POP
2201: POP
// counter = 0 ;
2202: LD_ADDR_LOC 5
2206: PUSH
2207: LD_INT 0
2209: ST_TO_ADDR
// ToLua ( TeamSelect.recalculate(MyID) ) ;
2210: LD_STRING TeamSelect.recalculate(MyID)
2212: PPUSH
2213: CALL_OW 559
// end ; Selected_Unit = 0 ;
2217: LD_ADDR_EXP 1
2221: PUSH
2222: LD_INT 0
2224: ST_TO_ADDR
// end ;
2225: LD_VAR 0 5
2229: RET
// export Selection ; function GetAllSelectedUnits ( ) ; var un ; begin
2230: LD_INT 0
2232: PPUSH
2233: PPUSH
// Selection = [ ] ;
2234: LD_ADDR_EXP 4
2238: PUSH
2239: EMPTY
2240: ST_TO_ADDR
// for un in all_units do
2241: LD_ADDR_VAR 0 2
2245: PUSH
2246: LD_OWVAR 3
2250: PUSH
2251: FOR_IN
2252: IFFALSE 2283
// if IsSelected ( un ) then
2254: LD_VAR 0 2
2258: PPUSH
2259: CALL_OW 306
2263: IFFALSE 2281
// Selection = Selection union un ;
2265: LD_ADDR_EXP 4
2269: PUSH
2270: LD_EXP 4
2274: PUSH
2275: LD_VAR 0 2
2279: UNION
2280: ST_TO_ADDR
2281: GO 2251
2283: POP
2284: POP
// end ;
2285: LD_VAR 0 1
2289: RET
// every 0 0$1 do
2290: GO 2292
2292: DISABLE
// begin GetAllSelectedUnits ( ) ;
2293: CALL 2230 0 0
// enable ;
2297: ENABLE
// end ; end_of_file
2298: END
// var Unit ; export Eliott ; every 0 0$3 do
2299: GO 2301
2301: DISABLE
// begin uc_side := 4 ;
2302: LD_ADDR_OWVAR 20
2306: PUSH
2307: LD_INT 4
2309: ST_TO_ADDR
// Unit := NewCharacter ( Abdul ) ;
2310: LD_ADDR_LOC 8
2314: PUSH
2315: LD_STRING Abdul
2317: PPUSH
2318: CALL_OW 25
2322: ST_TO_ADDR
// PlaceUnitXYR ( Unit , 114 , 187 , 15 , false ) ;
2323: LD_LOC 8
2327: PPUSH
2328: LD_INT 114
2330: PPUSH
2331: LD_INT 187
2333: PPUSH
2334: LD_INT 15
2336: PPUSH
2337: LD_INT 0
2339: PPUSH
2340: CALL_OW 50
// Unit := NewCharacter ( Belkov ) ;
2344: LD_ADDR_LOC 8
2348: PUSH
2349: LD_STRING Belkov
2351: PPUSH
2352: CALL_OW 25
2356: ST_TO_ADDR
// PlaceUnitXYR ( Unit , 114 , 187 , 15 , false ) ;
2357: LD_LOC 8
2361: PPUSH
2362: LD_INT 114
2364: PPUSH
2365: LD_INT 187
2367: PPUSH
2368: LD_INT 15
2370: PPUSH
2371: LD_INT 0
2373: PPUSH
2374: CALL_OW 50
// Unit := NewCharacter ( Bergkamp ) ;
2378: LD_ADDR_LOC 8
2382: PUSH
2383: LD_STRING Bergkamp
2385: PPUSH
2386: CALL_OW 25
2390: ST_TO_ADDR
// PlaceUnitXYR ( Unit , 114 , 187 , 15 , false ) ;
2391: LD_LOC 8
2395: PPUSH
2396: LD_INT 114
2398: PPUSH
2399: LD_INT 187
2401: PPUSH
2402: LD_INT 15
2404: PPUSH
2405: LD_INT 0
2407: PPUSH
2408: CALL_OW 50
// Unit := NewCharacter ( Bobby ) ;
2412: LD_ADDR_LOC 8
2416: PUSH
2417: LD_STRING Bobby
2419: PPUSH
2420: CALL_OW 25
2424: ST_TO_ADDR
// PlaceUnitXYR ( Unit , 114 , 187 , 15 , false ) ;
2425: LD_LOC 8
2429: PPUSH
2430: LD_INT 114
2432: PPUSH
2433: LD_INT 187
2435: PPUSH
2436: LD_INT 15
2438: PPUSH
2439: LD_INT 0
2441: PPUSH
2442: CALL_OW 50
// Unit := NewCharacter ( Borodin ) ;
2446: LD_ADDR_LOC 8
2450: PUSH
2451: LD_STRING Borodin
2453: PPUSH
2454: CALL_OW 25
2458: ST_TO_ADDR
// PlaceUnitXYR ( Unit , 114 , 187 , 15 , false ) ;
2459: LD_LOC 8
2463: PPUSH
2464: LD_INT 114
2466: PPUSH
2467: LD_INT 187
2469: PPUSH
2470: LD_INT 15
2472: PPUSH
2473: LD_INT 0
2475: PPUSH
2476: CALL_OW 50
// Unit := NewCharacter ( Brown ) ;
2480: LD_ADDR_LOC 8
2484: PUSH
2485: LD_STRING Brown
2487: PPUSH
2488: CALL_OW 25
2492: ST_TO_ADDR
// PlaceUnitXYR ( Unit , 114 , 187 , 15 , false ) ;
2493: LD_LOC 8
2497: PPUSH
2498: LD_INT 114
2500: PPUSH
2501: LD_INT 187
2503: PPUSH
2504: LD_INT 15
2506: PPUSH
2507: LD_INT 0
2509: PPUSH
2510: CALL_OW 50
// Unit := NewCharacter ( Burlak ) ;
2514: LD_ADDR_LOC 8
2518: PUSH
2519: LD_STRING Burlak
2521: PPUSH
2522: CALL_OW 25
2526: ST_TO_ADDR
// PlaceUnitXYR ( Unit , 114 , 187 , 15 , false ) ;
2527: LD_LOC 8
2531: PPUSH
2532: LD_INT 114
2534: PPUSH
2535: LD_INT 187
2537: PPUSH
2538: LD_INT 15
2540: PPUSH
2541: LD_INT 0
2543: PPUSH
2544: CALL_OW 50
// Unit := NewCharacter ( Bystrov ) ;
2548: LD_ADDR_LOC 8
2552: PUSH
2553: LD_STRING Bystrov
2555: PPUSH
2556: CALL_OW 25
2560: ST_TO_ADDR
// PlaceUnitXYR ( Unit , 114 , 187 , 15 , false ) ;
2561: LD_LOC 8
2565: PPUSH
2566: LD_INT 114
2568: PPUSH
2569: LD_INT 187
2571: PPUSH
2572: LD_INT 15
2574: PPUSH
2575: LD_INT 0
2577: PPUSH
2578: CALL_OW 50
// Unit := NewCharacter ( Coonie ) ;
2582: LD_ADDR_LOC 8
2586: PUSH
2587: LD_STRING Coonie
2589: PPUSH
2590: CALL_OW 25
2594: ST_TO_ADDR
// PlaceUnitXYR ( Unit , 114 , 187 , 15 , false ) ;
2595: LD_LOC 8
2599: PPUSH
2600: LD_INT 114
2602: PPUSH
2603: LD_INT 187
2605: PPUSH
2606: LD_INT 15
2608: PPUSH
2609: LD_INT 0
2611: PPUSH
2612: CALL_OW 50
// Unit := NewCharacter ( Cornell ) ;
2616: LD_ADDR_LOC 8
2620: PUSH
2621: LD_STRING Cornell
2623: PPUSH
2624: CALL_OW 25
2628: ST_TO_ADDR
// PlaceUnitXYR ( Unit , 114 , 187 , 15 , false ) ;
2629: LD_LOC 8
2633: PPUSH
2634: LD_INT 114
2636: PPUSH
2637: LD_INT 187
2639: PPUSH
2640: LD_INT 15
2642: PPUSH
2643: LD_INT 0
2645: PPUSH
2646: CALL_OW 50
// Unit := NewCharacter ( Cyrus ) ;
2650: LD_ADDR_LOC 8
2654: PUSH
2655: LD_STRING Cyrus
2657: PPUSH
2658: CALL_OW 25
2662: ST_TO_ADDR
// PlaceUnitXYR ( Unit , 114 , 187 , 15 , false ) ;
2663: LD_LOC 8
2667: PPUSH
2668: LD_INT 114
2670: PPUSH
2671: LD_INT 187
2673: PPUSH
2674: LD_INT 15
2676: PPUSH
2677: LD_INT 0
2679: PPUSH
2680: CALL_OW 50
// Unit := NewCharacter ( Davidov ) ;
2684: LD_ADDR_LOC 8
2688: PUSH
2689: LD_STRING Davidov
2691: PPUSH
2692: CALL_OW 25
2696: ST_TO_ADDR
// PlaceUnitXYR ( Unit , 114 , 187 , 15 , false ) ;
2697: LD_LOC 8
2701: PPUSH
2702: LD_INT 114
2704: PPUSH
2705: LD_INT 187
2707: PPUSH
2708: LD_INT 15
2710: PPUSH
2711: LD_INT 0
2713: PPUSH
2714: CALL_OW 50
// Unit := NewCharacter ( Denis ) ;
2718: LD_ADDR_LOC 8
2722: PUSH
2723: LD_STRING Denis
2725: PPUSH
2726: CALL_OW 25
2730: ST_TO_ADDR
// PlaceUnitXYR ( Unit , 114 , 187 , 15 , false ) ;
2731: LD_LOC 8
2735: PPUSH
2736: LD_INT 114
2738: PPUSH
2739: LD_INT 187
2741: PPUSH
2742: LD_INT 15
2744: PPUSH
2745: LD_INT 0
2747: PPUSH
2748: CALL_OW 50
// Unit := NewCharacter ( Dietrich ) ;
2752: LD_ADDR_LOC 8
2756: PUSH
2757: LD_STRING Dietrich
2759: PPUSH
2760: CALL_OW 25
2764: ST_TO_ADDR
// PlaceUnitXYR ( Unit , 114 , 187 , 15 , false ) ;
2765: LD_LOC 8
2769: PPUSH
2770: LD_INT 114
2772: PPUSH
2773: LD_INT 187
2775: PPUSH
2776: LD_INT 15
2778: PPUSH
2779: LD_INT 0
2781: PPUSH
2782: CALL_OW 50
// Unit := NewCharacter ( Dolgov ) ;
2786: LD_ADDR_LOC 8
2790: PUSH
2791: LD_STRING Dolgov
2793: PPUSH
2794: CALL_OW 25
2798: ST_TO_ADDR
// PlaceUnitXYR ( Unit , 114 , 187 , 15 , false ) ;
2799: LD_LOC 8
2803: PPUSH
2804: LD_INT 114
2806: PPUSH
2807: LD_INT 187
2809: PPUSH
2810: LD_INT 15
2812: PPUSH
2813: LD_INT 0
2815: PPUSH
2816: CALL_OW 50
// Unit := NewCharacter ( Donaldson ) ;
2820: LD_ADDR_LOC 8
2824: PUSH
2825: LD_STRING Donaldson
2827: PPUSH
2828: CALL_OW 25
2832: ST_TO_ADDR
// PlaceUnitXYR ( Unit , 114 , 187 , 15 , false ) ;
2833: LD_LOC 8
2837: PPUSH
2838: LD_INT 114
2840: PPUSH
2841: LD_INT 187
2843: PPUSH
2844: LD_INT 15
2846: PPUSH
2847: LD_INT 0
2849: PPUSH
2850: CALL_OW 50
// Unit := NewCharacter ( Eisenstein ) ;
2854: LD_ADDR_LOC 8
2858: PUSH
2859: LD_STRING Eisenstein
2861: PPUSH
2862: CALL_OW 25
2866: ST_TO_ADDR
// PlaceUnitXYR ( Unit , 114 , 187 , 15 , false ) ;
2867: LD_LOC 8
2871: PPUSH
2872: LD_INT 114
2874: PPUSH
2875: LD_INT 187
2877: PPUSH
2878: LD_INT 15
2880: PPUSH
2881: LD_INT 0
2883: PPUSH
2884: CALL_OW 50
// Unit := NewCharacter ( Fadeev ) ;
2888: LD_ADDR_LOC 8
2892: PUSH
2893: LD_STRING Fadeev
2895: PPUSH
2896: CALL_OW 25
2900: ST_TO_ADDR
// PlaceUnitXYR ( Unit , 114 , 187 , 15 , false ) ;
2901: LD_LOC 8
2905: PPUSH
2906: LD_INT 114
2908: PPUSH
2909: LD_INT 187
2911: PPUSH
2912: LD_INT 15
2914: PPUSH
2915: LD_INT 0
2917: PPUSH
2918: CALL_OW 50
// Unit := NewCharacter ( Farmer ) ;
2922: LD_ADDR_LOC 8
2926: PUSH
2927: LD_STRING Farmer
2929: PPUSH
2930: CALL_OW 25
2934: ST_TO_ADDR
// PlaceUnitXYR ( Unit , 114 , 187 , 15 , false ) ;
2935: LD_LOC 8
2939: PPUSH
2940: LD_INT 114
2942: PPUSH
2943: LD_INT 187
2945: PPUSH
2946: LD_INT 15
2948: PPUSH
2949: LD_INT 0
2951: PPUSH
2952: CALL_OW 50
// Unit := NewCharacter ( Frank ) ;
2956: LD_ADDR_LOC 8
2960: PUSH
2961: LD_STRING Frank
2963: PPUSH
2964: CALL_OW 25
2968: ST_TO_ADDR
// PlaceUnitXYR ( Unit , 114 , 187 , 15 , false ) ;
2969: LD_LOC 8
2973: PPUSH
2974: LD_INT 114
2976: PPUSH
2977: LD_INT 187
2979: PPUSH
2980: LD_INT 15
2982: PPUSH
2983: LD_INT 0
2985: PPUSH
2986: CALL_OW 50
// Unit := NewCharacter ( Furmanov ) ;
2990: LD_ADDR_LOC 8
2994: PUSH
2995: LD_STRING Furmanov
2997: PPUSH
2998: CALL_OW 25
3002: ST_TO_ADDR
// PlaceUnitXYR ( Unit , 114 , 187 , 15 , false ) ;
3003: LD_LOC 8
3007: PPUSH
3008: LD_INT 114
3010: PPUSH
3011: LD_INT 187
3013: PPUSH
3014: LD_INT 15
3016: PPUSH
3017: LD_INT 0
3019: PPUSH
3020: CALL_OW 50
// Unit := NewCharacter ( Gary ) ;
3024: LD_ADDR_LOC 8
3028: PUSH
3029: LD_STRING Gary
3031: PPUSH
3032: CALL_OW 25
3036: ST_TO_ADDR
// PlaceUnitXYR ( Unit , 114 , 187 , 15 , false ) ;
3037: LD_LOC 8
3041: PPUSH
3042: LD_INT 114
3044: PPUSH
3045: LD_INT 187
3047: PPUSH
3048: LD_INT 15
3050: PPUSH
3051: LD_INT 0
3053: PPUSH
3054: CALL_OW 50
// Unit := NewCharacter ( Gaydar ) ;
3058: LD_ADDR_LOC 8
3062: PUSH
3063: LD_STRING Gaydar
3065: PPUSH
3066: CALL_OW 25
3070: ST_TO_ADDR
// PlaceUnitXYR ( Unit , 114 , 187 , 15 , false ) ;
3071: LD_LOC 8
3075: PPUSH
3076: LD_INT 114
3078: PPUSH
3079: LD_INT 187
3081: PPUSH
3082: LD_INT 15
3084: PPUSH
3085: LD_INT 0
3087: PPUSH
3088: CALL_OW 50
// Unit := NewCharacter ( Gladkov ) ;
3092: LD_ADDR_LOC 8
3096: PUSH
3097: LD_STRING Gladkov
3099: PPUSH
3100: CALL_OW 25
3104: ST_TO_ADDR
// PlaceUnitXYR ( Unit , 114 , 187 , 15 , false ) ;
3105: LD_LOC 8
3109: PPUSH
3110: LD_INT 114
3112: PPUSH
3113: LD_INT 187
3115: PPUSH
3116: LD_INT 15
3118: PPUSH
3119: LD_INT 0
3121: PPUSH
3122: CALL_OW 50
// Unit := NewCharacter ( Gladstone ) ;
3126: LD_ADDR_LOC 8
3130: PUSH
3131: LD_STRING Gladstone
3133: PPUSH
3134: CALL_OW 25
3138: ST_TO_ADDR
// PlaceUnitXYR ( Unit , 114 , 187 , 15 , false ) ;
3139: LD_LOC 8
3143: PPUSH
3144: LD_INT 114
3146: PPUSH
3147: LD_INT 187
3149: PPUSH
3150: LD_INT 15
3152: PPUSH
3153: LD_INT 0
3155: PPUSH
3156: CALL_OW 50
// Unit := NewCharacter ( Gleb ) ;
3160: LD_ADDR_LOC 8
3164: PUSH
3165: LD_STRING Gleb
3167: PPUSH
3168: CALL_OW 25
3172: ST_TO_ADDR
// PlaceUnitXYR ( Unit , 114 , 187 , 15 , false ) ;
3173: LD_LOC 8
3177: PPUSH
3178: LD_INT 114
3180: PPUSH
3181: LD_INT 187
3183: PPUSH
3184: LD_INT 15
3186: PPUSH
3187: LD_INT 0
3189: PPUSH
3190: CALL_OW 50
// Unit := NewCharacter ( Gnyevko ) ;
3194: LD_ADDR_LOC 8
3198: PUSH
3199: LD_STRING Gnyevko
3201: PPUSH
3202: CALL_OW 25
3206: ST_TO_ADDR
// PlaceUnitXYR ( Unit , 114 , 187 , 15 , false ) ;
3207: LD_LOC 8
3211: PPUSH
3212: LD_INT 114
3214: PPUSH
3215: LD_INT 187
3217: PPUSH
3218: LD_INT 15
3220: PPUSH
3221: LD_INT 0
3223: PPUSH
3224: CALL_OW 50
// Unit := NewCharacter ( Gossudarov ) ;
3228: LD_ADDR_LOC 8
3232: PUSH
3233: LD_STRING Gossudarov
3235: PPUSH
3236: CALL_OW 25
3240: ST_TO_ADDR
// PlaceUnitXYR ( Unit , 114 , 187 , 15 , false ) ;
3241: LD_LOC 8
3245: PPUSH
3246: LD_INT 114
3248: PPUSH
3249: LD_INT 187
3251: PPUSH
3252: LD_INT 15
3254: PPUSH
3255: LD_INT 0
3257: PPUSH
3258: CALL_OW 50
// Unit := NewCharacter ( Grishko ) ;
3262: LD_ADDR_LOC 8
3266: PUSH
3267: LD_STRING Grishko
3269: PPUSH
3270: CALL_OW 25
3274: ST_TO_ADDR
// PlaceUnitXYR ( Unit , 114 , 187 , 15 , false ) ;
3275: LD_LOC 8
3279: PPUSH
3280: LD_INT 114
3282: PPUSH
3283: LD_INT 187
3285: PPUSH
3286: LD_INT 15
3288: PPUSH
3289: LD_INT 0
3291: PPUSH
3292: CALL_OW 50
// Unit := NewCharacter ( Harisson ) ;
3296: LD_ADDR_LOC 8
3300: PUSH
3301: LD_STRING Harisson
3303: PPUSH
3304: CALL_OW 25
3308: ST_TO_ADDR
// PlaceUnitXYR ( Unit , 114 , 187 , 15 , false ) ;
3309: LD_LOC 8
3313: PPUSH
3314: LD_INT 114
3316: PPUSH
3317: LD_INT 187
3319: PPUSH
3320: LD_INT 15
3322: PPUSH
3323: LD_INT 0
3325: PPUSH
3326: CALL_OW 50
// Unit := NewCharacter ( Heike ) ;
3330: LD_ADDR_LOC 8
3334: PUSH
3335: LD_STRING Heike
3337: PPUSH
3338: CALL_OW 25
3342: ST_TO_ADDR
// PlaceUnitXYR ( Unit , 114 , 187 , 15 , false ) ;
3343: LD_LOC 8
3347: PPUSH
3348: LD_INT 114
3350: PPUSH
3351: LD_INT 187
3353: PPUSH
3354: LD_INT 15
3356: PPUSH
3357: LD_INT 0
3359: PPUSH
3360: CALL_OW 50
// Unit := NewCharacter ( JMM ) ;
3364: LD_ADDR_LOC 8
3368: PUSH
3369: LD_STRING JMM
3371: PPUSH
3372: CALL_OW 25
3376: ST_TO_ADDR
// PlaceUnitXYR ( Unit , 114 , 187 , 15 , false ) ;
3377: LD_LOC 8
3381: PPUSH
3382: LD_INT 114
3384: PPUSH
3385: LD_INT 187
3387: PPUSH
3388: LD_INT 15
3390: PPUSH
3391: LD_INT 0
3393: PPUSH
3394: CALL_OW 50
// Unit := NewCharacter ( Joan ) ;
3398: LD_ADDR_LOC 8
3402: PUSH
3403: LD_STRING Joan
3405: PPUSH
3406: CALL_OW 25
3410: ST_TO_ADDR
// PlaceUnitXYR ( Unit , 114 , 187 , 15 , false ) ;
3411: LD_LOC 8
3415: PPUSH
3416: LD_INT 114
3418: PPUSH
3419: LD_INT 187
3421: PPUSH
3422: LD_INT 15
3424: PPUSH
3425: LD_INT 0
3427: PPUSH
3428: CALL_OW 50
// Unit := NewCharacter ( Kapitsova ) ;
3432: LD_ADDR_LOC 8
3436: PUSH
3437: LD_STRING Kapitsova
3439: PPUSH
3440: CALL_OW 25
3444: ST_TO_ADDR
// PlaceUnitXYR ( Unit , 114 , 187 , 15 , false ) ;
3445: LD_LOC 8
3449: PPUSH
3450: LD_INT 114
3452: PPUSH
3453: LD_INT 187
3455: PPUSH
3456: LD_INT 15
3458: PPUSH
3459: LD_INT 0
3461: PPUSH
3462: CALL_OW 50
// Unit := NewCharacter ( Karamazov ) ;
3466: LD_ADDR_LOC 8
3470: PUSH
3471: LD_STRING Karamazov
3473: PPUSH
3474: CALL_OW 25
3478: ST_TO_ADDR
// PlaceUnitXYR ( Unit , 114 , 187 , 15 , false ) ;
3479: LD_LOC 8
3483: PPUSH
3484: LD_INT 114
3486: PPUSH
3487: LD_INT 187
3489: PPUSH
3490: LD_INT 15
3492: PPUSH
3493: LD_INT 0
3495: PPUSH
3496: CALL_OW 50
// Unit := NewCharacter ( Khatam ) ;
3500: LD_ADDR_LOC 8
3504: PUSH
3505: LD_STRING Khatam
3507: PPUSH
3508: CALL_OW 25
3512: ST_TO_ADDR
// PlaceUnitXYR ( Unit , 114 , 187 , 15 , false ) ;
3513: LD_LOC 8
3517: PPUSH
3518: LD_INT 114
3520: PPUSH
3521: LD_INT 187
3523: PPUSH
3524: LD_INT 15
3526: PPUSH
3527: LD_INT 0
3529: PPUSH
3530: CALL_OW 50
// Unit := NewCharacter ( Kirilenkova ) ;
3534: LD_ADDR_LOC 8
3538: PUSH
3539: LD_STRING Kirilenkova
3541: PPUSH
3542: CALL_OW 25
3546: ST_TO_ADDR
// PlaceUnitXYR ( Unit , 114 , 187 , 15 , false ) ;
3547: LD_LOC 8
3551: PPUSH
3552: LD_INT 114
3554: PPUSH
3555: LD_INT 187
3557: PPUSH
3558: LD_INT 15
3560: PPUSH
3561: LD_INT 0
3563: PPUSH
3564: CALL_OW 50
// Unit := NewCharacter ( Kovalyuk ) ;
3568: LD_ADDR_LOC 8
3572: PUSH
3573: LD_STRING Kovalyuk
3575: PPUSH
3576: CALL_OW 25
3580: ST_TO_ADDR
// PlaceUnitXYR ( Unit , 114 , 187 , 15 , false ) ;
3581: LD_LOC 8
3585: PPUSH
3586: LD_INT 114
3588: PPUSH
3589: LD_INT 187
3591: PPUSH
3592: LD_INT 15
3594: PPUSH
3595: LD_INT 0
3597: PPUSH
3598: CALL_OW 50
// Unit := NewCharacter ( Kozlov ) ;
3602: LD_ADDR_LOC 8
3606: PUSH
3607: LD_STRING Kozlov
3609: PPUSH
3610: CALL_OW 25
3614: ST_TO_ADDR
// PlaceUnitXYR ( Unit , 114 , 187 , 15 , false ) ;
3615: LD_LOC 8
3619: PPUSH
3620: LD_INT 114
3622: PPUSH
3623: LD_INT 187
3625: PPUSH
3626: LD_INT 15
3628: PPUSH
3629: LD_INT 0
3631: PPUSH
3632: CALL_OW 50
// Unit := NewCharacter ( Kurin ) ;
3636: LD_ADDR_LOC 8
3640: PUSH
3641: LD_STRING Kurin
3643: PPUSH
3644: CALL_OW 25
3648: ST_TO_ADDR
// PlaceUnitXYR ( Unit , 114 , 187 , 15 , false ) ;
3649: LD_LOC 8
3653: PPUSH
3654: LD_INT 114
3656: PPUSH
3657: LD_INT 187
3659: PPUSH
3660: LD_INT 15
3662: PPUSH
3663: LD_INT 0
3665: PPUSH
3666: CALL_OW 50
// Unit := NewCharacter ( Kurt ) ;
3670: LD_ADDR_LOC 8
3674: PUSH
3675: LD_STRING Kurt
3677: PPUSH
3678: CALL_OW 25
3682: ST_TO_ADDR
// PlaceUnitXYR ( Unit , 114 , 187 , 15 , false ) ;
3683: LD_LOC 8
3687: PPUSH
3688: LD_INT 114
3690: PPUSH
3691: LD_INT 187
3693: PPUSH
3694: LD_INT 15
3696: PPUSH
3697: LD_INT 0
3699: PPUSH
3700: CALL_OW 50
// Unit := NewCharacter ( Kuzmov ) ;
3704: LD_ADDR_LOC 8
3708: PUSH
3709: LD_STRING Kuzmov
3711: PPUSH
3712: CALL_OW 25
3716: ST_TO_ADDR
// PlaceUnitXYR ( Unit , 114 , 187 , 15 , false ) ;
3717: LD_LOC 8
3721: PPUSH
3722: LD_INT 114
3724: PPUSH
3725: LD_INT 187
3727: PPUSH
3728: LD_INT 15
3730: PPUSH
3731: LD_INT 0
3733: PPUSH
3734: CALL_OW 50
// Unit := NewCharacter ( Lipshchin ) ;
3738: LD_ADDR_LOC 8
3742: PUSH
3743: LD_STRING Lipshchin
3745: PPUSH
3746: CALL_OW 25
3750: ST_TO_ADDR
// PlaceUnitXYR ( Unit , 114 , 187 , 15 , false ) ;
3751: LD_LOC 8
3755: PPUSH
3756: LD_INT 114
3758: PPUSH
3759: LD_INT 187
3761: PPUSH
3762: LD_INT 15
3764: PPUSH
3765: LD_INT 0
3767: PPUSH
3768: CALL_OW 50
// Unit := NewCharacter ( Lisa ) ;
3772: LD_ADDR_LOC 8
3776: PUSH
3777: LD_STRING Lisa
3779: PPUSH
3780: CALL_OW 25
3784: ST_TO_ADDR
// PlaceUnitXYR ( Unit , 114 , 187 , 15 , false ) ;
3785: LD_LOC 8
3789: PPUSH
3790: LD_INT 114
3792: PPUSH
3793: LD_INT 187
3795: PPUSH
3796: LD_INT 15
3798: PPUSH
3799: LD_INT 0
3801: PPUSH
3802: CALL_OW 50
// Unit := NewCharacter ( Mikhail ) ;
3806: LD_ADDR_LOC 8
3810: PUSH
3811: LD_STRING Mikhail
3813: PPUSH
3814: CALL_OW 25
3818: ST_TO_ADDR
// PlaceUnitXYR ( Unit , 114 , 187 , 15 , false ) ;
3819: LD_LOC 8
3823: PPUSH
3824: LD_INT 114
3826: PPUSH
3827: LD_INT 187
3829: PPUSH
3830: LD_INT 15
3832: PPUSH
3833: LD_INT 0
3835: PPUSH
3836: CALL_OW 50
// Unit := NewCharacter ( Morozov ) ;
3840: LD_ADDR_LOC 8
3844: PUSH
3845: LD_STRING Morozov
3847: PPUSH
3848: CALL_OW 25
3852: ST_TO_ADDR
// PlaceUnitXYR ( Unit , 114 , 187 , 15 , false ) ;
3853: LD_LOC 8
3857: PPUSH
3858: LD_INT 114
3860: PPUSH
3861: LD_INT 187
3863: PPUSH
3864: LD_INT 15
3866: PPUSH
3867: LD_INT 0
3869: PPUSH
3870: CALL_OW 50
// Unit := NewCharacter ( Oblukov ) ;
3874: LD_ADDR_LOC 8
3878: PUSH
3879: LD_STRING Oblukov
3881: PPUSH
3882: CALL_OW 25
3886: ST_TO_ADDR
// PlaceUnitXYR ( Unit , 114 , 187 , 15 , false ) ;
3887: LD_LOC 8
3891: PPUSH
3892: LD_INT 114
3894: PPUSH
3895: LD_INT 187
3897: PPUSH
3898: LD_INT 15
3900: PPUSH
3901: LD_INT 0
3903: PPUSH
3904: CALL_OW 50
// Unit := NewCharacter ( Officer ) ;
3908: LD_ADDR_LOC 8
3912: PUSH
3913: LD_STRING Officer
3915: PPUSH
3916: CALL_OW 25
3920: ST_TO_ADDR
// PlaceUnitXYR ( Unit , 114 , 187 , 15 , false ) ;
3921: LD_LOC 8
3925: PPUSH
3926: LD_INT 114
3928: PPUSH
3929: LD_INT 187
3931: PPUSH
3932: LD_INT 15
3934: PPUSH
3935: LD_INT 0
3937: PPUSH
3938: CALL_OW 50
// Unit := NewCharacter ( Omar ) ;
3942: LD_ADDR_LOC 8
3946: PUSH
3947: LD_STRING Omar
3949: PPUSH
3950: CALL_OW 25
3954: ST_TO_ADDR
// PlaceUnitXYR ( Unit , 114 , 187 , 15 , false ) ;
3955: LD_LOC 8
3959: PPUSH
3960: LD_INT 114
3962: PPUSH
3963: LD_INT 187
3965: PPUSH
3966: LD_INT 15
3968: PPUSH
3969: LD_INT 0
3971: PPUSH
3972: CALL_OW 50
// Unit := NewCharacter ( Petrosyan ) ;
3976: LD_ADDR_LOC 8
3980: PUSH
3981: LD_STRING Petrosyan
3983: PPUSH
3984: CALL_OW 25
3988: ST_TO_ADDR
// PlaceUnitXYR ( Unit , 114 , 187 , 15 , false ) ;
3989: LD_LOC 8
3993: PPUSH
3994: LD_INT 114
3996: PPUSH
3997: LD_INT 187
3999: PPUSH
4000: LD_INT 15
4002: PPUSH
4003: LD_INT 0
4005: PPUSH
4006: CALL_OW 50
// Unit := NewCharacter ( Petrovova ) ;
4010: LD_ADDR_LOC 8
4014: PUSH
4015: LD_STRING Petrovova
4017: PPUSH
4018: CALL_OW 25
4022: ST_TO_ADDR
// PlaceUnitXYR ( Unit , 114 , 187 , 15 , false ) ;
4023: LD_LOC 8
4027: PPUSH
4028: LD_INT 114
4030: PPUSH
4031: LD_INT 187
4033: PPUSH
4034: LD_INT 15
4036: PPUSH
4037: LD_INT 0
4039: PPUSH
4040: CALL_OW 50
// Unit := NewCharacter ( Phillips ) ;
4044: LD_ADDR_LOC 8
4048: PUSH
4049: LD_STRING Phillips
4051: PPUSH
4052: CALL_OW 25
4056: ST_TO_ADDR
// PlaceUnitXYR ( Unit , 114 , 187 , 15 , false ) ;
4057: LD_LOC 8
4061: PPUSH
4062: LD_INT 114
4064: PPUSH
4065: LD_INT 187
4067: PPUSH
4068: LD_INT 15
4070: PPUSH
4071: LD_INT 0
4073: PPUSH
4074: CALL_OW 50
// Unit := NewCharacter ( Platonov ) ;
4078: LD_ADDR_LOC 8
4082: PUSH
4083: LD_STRING Platonov
4085: PPUSH
4086: CALL_OW 25
4090: ST_TO_ADDR
// PlaceUnitXYR ( Unit , 114 , 187 , 15 , false ) ;
4091: LD_LOC 8
4095: PPUSH
4096: LD_INT 114
4098: PPUSH
4099: LD_INT 187
4101: PPUSH
4102: LD_INT 15
4104: PPUSH
4105: LD_INT 0
4107: PPUSH
4108: CALL_OW 50
// Unit := NewCharacter ( Pokryshkin ) ;
4112: LD_ADDR_LOC 8
4116: PUSH
4117: LD_STRING Pokryshkin
4119: PPUSH
4120: CALL_OW 25
4124: ST_TO_ADDR
// PlaceUnitXYR ( Unit , 114 , 187 , 15 , false ) ;
4125: LD_LOC 8
4129: PPUSH
4130: LD_INT 114
4132: PPUSH
4133: LD_INT 187
4135: PPUSH
4136: LD_INT 15
4138: PPUSH
4139: LD_INT 0
4141: PPUSH
4142: CALL_OW 50
// Unit := NewCharacter ( Popov ) ;
4146: LD_ADDR_LOC 8
4150: PUSH
4151: LD_STRING Popov
4153: PPUSH
4154: CALL_OW 25
4158: ST_TO_ADDR
// PlaceUnitXYR ( Unit , 114 , 187 , 15 , false ) ;
4159: LD_LOC 8
4163: PPUSH
4164: LD_INT 114
4166: PPUSH
4167: LD_INT 187
4169: PPUSH
4170: LD_INT 15
4172: PPUSH
4173: LD_INT 0
4175: PPUSH
4176: CALL_OW 50
// Unit := NewCharacter ( Powell ) ;
4180: LD_ADDR_LOC 8
4184: PUSH
4185: LD_STRING Powell
4187: PPUSH
4188: CALL_OW 25
4192: ST_TO_ADDR
// PlaceUnitXYR ( Unit , 114 , 187 , 15 , false ) ;
4193: LD_LOC 8
4197: PPUSH
4198: LD_INT 114
4200: PPUSH
4201: LD_INT 187
4203: PPUSH
4204: LD_INT 15
4206: PPUSH
4207: LD_INT 0
4209: PPUSH
4210: CALL_OW 50
// Unit := NewCharacter ( Roth ) ;
4214: LD_ADDR_LOC 8
4218: PUSH
4219: LD_STRING Roth
4221: PPUSH
4222: CALL_OW 25
4226: ST_TO_ADDR
// PlaceUnitXYR ( Unit , 114 , 187 , 15 , false ) ;
4227: LD_LOC 8
4231: PPUSH
4232: LD_INT 114
4234: PPUSH
4235: LD_INT 187
4237: PPUSH
4238: LD_INT 15
4240: PPUSH
4241: LD_INT 0
4243: PPUSH
4244: CALL_OW 50
// Unit := NewCharacter ( Scholtze ) ;
4248: LD_ADDR_LOC 8
4252: PUSH
4253: LD_STRING Scholtze
4255: PPUSH
4256: CALL_OW 25
4260: ST_TO_ADDR
// PlaceUnitXYR ( Unit , 114 , 187 , 15 , false ) ;
4261: LD_LOC 8
4265: PPUSH
4266: LD_INT 114
4268: PPUSH
4269: LD_INT 187
4271: PPUSH
4272: LD_INT 15
4274: PPUSH
4275: LD_INT 0
4277: PPUSH
4278: CALL_OW 50
// Unit := NewCharacter ( Sikorski ) ;
4282: LD_ADDR_LOC 8
4286: PUSH
4287: LD_STRING Sikorski
4289: PPUSH
4290: CALL_OW 25
4294: ST_TO_ADDR
// PlaceUnitXYR ( Unit , 114 , 187 , 15 , false ) ;
4295: LD_LOC 8
4299: PPUSH
4300: LD_INT 114
4302: PPUSH
4303: LD_INT 187
4305: PPUSH
4306: LD_INT 15
4308: PPUSH
4309: LD_INT 0
4311: PPUSH
4312: CALL_OW 50
// Unit := NewCharacter ( Simms ) ;
4316: LD_ADDR_LOC 8
4320: PUSH
4321: LD_STRING Simms
4323: PPUSH
4324: CALL_OW 25
4328: ST_TO_ADDR
// PlaceUnitXYR ( Unit , 114 , 187 , 15 , false ) ;
4329: LD_LOC 8
4333: PPUSH
4334: LD_INT 114
4336: PPUSH
4337: LD_INT 187
4339: PPUSH
4340: LD_INT 15
4342: PPUSH
4343: LD_INT 0
4345: PPUSH
4346: CALL_OW 50
// Unit := NewCharacter ( Stevens ) ;
4350: LD_ADDR_LOC 8
4354: PUSH
4355: LD_STRING Stevens
4357: PPUSH
4358: CALL_OW 25
4362: ST_TO_ADDR
// PlaceUnitXYR ( Unit , 114 , 187 , 15 , false ) ;
4363: LD_LOC 8
4367: PPUSH
4368: LD_INT 114
4370: PPUSH
4371: LD_INT 187
4373: PPUSH
4374: LD_INT 15
4376: PPUSH
4377: LD_INT 0
4379: PPUSH
4380: CALL_OW 50
// Unit := NewCharacter ( Stolypin ) ;
4384: LD_ADDR_LOC 8
4388: PUSH
4389: LD_STRING Stolypin
4391: PPUSH
4392: CALL_OW 25
4396: ST_TO_ADDR
// PlaceUnitXYR ( Unit , 114 , 187 , 15 , false ) ;
4397: LD_LOC 8
4401: PPUSH
4402: LD_INT 114
4404: PPUSH
4405: LD_INT 187
4407: PPUSH
4408: LD_INT 15
4410: PPUSH
4411: LD_INT 0
4413: PPUSH
4414: CALL_OW 50
// Unit := NewCharacter ( Titov ) ;
4418: LD_ADDR_LOC 8
4422: PUSH
4423: LD_STRING Titov
4425: PPUSH
4426: CALL_OW 25
4430: ST_TO_ADDR
// PlaceUnitXYR ( Unit , 114 , 187 , 15 , false ) ;
4431: LD_LOC 8
4435: PPUSH
4436: LD_INT 114
4438: PPUSH
4439: LD_INT 187
4441: PPUSH
4442: LD_INT 15
4444: PPUSH
4445: LD_INT 0
4447: PPUSH
4448: CALL_OW 50
// Unit := NewCharacter ( Tsaritsyn ) ;
4452: LD_ADDR_LOC 8
4456: PUSH
4457: LD_STRING Tsaritsyn
4459: PPUSH
4460: CALL_OW 25
4464: ST_TO_ADDR
// PlaceUnitXYR ( Unit , 114 , 187 , 15 , false ) ;
4465: LD_LOC 8
4469: PPUSH
4470: LD_INT 114
4472: PPUSH
4473: LD_INT 187
4475: PPUSH
4476: LD_INT 15
4478: PPUSH
4479: LD_INT 0
4481: PPUSH
4482: CALL_OW 50
// Unit := NewCharacter ( VanHouten ) ;
4486: LD_ADDR_LOC 8
4490: PUSH
4491: LD_STRING VanHouten
4493: PPUSH
4494: CALL_OW 25
4498: ST_TO_ADDR
// PlaceUnitXYR ( Unit , 114 , 187 , 15 , false ) ;
4499: LD_LOC 8
4503: PPUSH
4504: LD_INT 114
4506: PPUSH
4507: LD_INT 187
4509: PPUSH
4510: LD_INT 15
4512: PPUSH
4513: LD_INT 0
4515: PPUSH
4516: CALL_OW 50
// Unit := NewCharacter ( Vsevolod ) ;
4520: LD_ADDR_LOC 8
4524: PUSH
4525: LD_STRING Vsevolod
4527: PPUSH
4528: CALL_OW 25
4532: ST_TO_ADDR
// PlaceUnitXYR ( Unit , 114 , 187 , 15 , false ) ;
4533: LD_LOC 8
4537: PPUSH
4538: LD_INT 114
4540: PPUSH
4541: LD_INT 187
4543: PPUSH
4544: LD_INT 15
4546: PPUSH
4547: LD_INT 0
4549: PPUSH
4550: CALL_OW 50
// Unit := NewCharacter ( Williams ) ;
4554: LD_ADDR_LOC 8
4558: PUSH
4559: LD_STRING Williams
4561: PPUSH
4562: CALL_OW 25
4566: ST_TO_ADDR
// PlaceUnitXYR ( Unit , 114 , 187 , 15 , false ) ;
4567: LD_LOC 8
4571: PPUSH
4572: LD_INT 114
4574: PPUSH
4575: LD_INT 187
4577: PPUSH
4578: LD_INT 15
4580: PPUSH
4581: LD_INT 0
4583: PPUSH
4584: CALL_OW 50
// Unit := NewCharacter ( Xavier ) ;
4588: LD_ADDR_LOC 8
4592: PUSH
4593: LD_STRING Xavier
4595: PPUSH
4596: CALL_OW 25
4600: ST_TO_ADDR
// PlaceUnitXYR ( Unit , 114 , 187 , 15 , false ) ;
4601: LD_LOC 8
4605: PPUSH
4606: LD_INT 114
4608: PPUSH
4609: LD_INT 187
4611: PPUSH
4612: LD_INT 15
4614: PPUSH
4615: LD_INT 0
4617: PPUSH
4618: CALL_OW 50
// Unit := NewCharacter ( Yamoko ) ;
4622: LD_ADDR_LOC 8
4626: PUSH
4627: LD_STRING Yamoko
4629: PPUSH
4630: CALL_OW 25
4634: ST_TO_ADDR
// PlaceUnitXYR ( Unit , 114 , 187 , 15 , false ) ;
4635: LD_LOC 8
4639: PPUSH
4640: LD_INT 114
4642: PPUSH
4643: LD_INT 187
4645: PPUSH
4646: LD_INT 15
4648: PPUSH
4649: LD_INT 0
4651: PPUSH
4652: CALL_OW 50
// Unit := NewCharacter ( Yashin ) ;
4656: LD_ADDR_LOC 8
4660: PUSH
4661: LD_STRING Yashin
4663: PPUSH
4664: CALL_OW 25
4668: ST_TO_ADDR
// PlaceUnitXYR ( Unit , 114 , 187 , 15 , false ) ;
4669: LD_LOC 8
4673: PPUSH
4674: LD_INT 114
4676: PPUSH
4677: LD_INT 187
4679: PPUSH
4680: LD_INT 15
4682: PPUSH
4683: LD_INT 0
4685: PPUSH
4686: CALL_OW 50
// Eliott := NewCharacter ( Eliott ) ;
4690: LD_ADDR_EXP 5
4694: PUSH
4695: LD_STRING Eliott
4697: PPUSH
4698: CALL_OW 25
4702: ST_TO_ADDR
// PlaceUnitXYR ( Eliott , 114 , 187 , 15 , false ) ;
4703: LD_EXP 5
4707: PPUSH
4708: LD_INT 114
4710: PPUSH
4711: LD_INT 187
4713: PPUSH
4714: LD_INT 15
4716: PPUSH
4717: LD_INT 0
4719: PPUSH
4720: CALL_OW 50
// end ;
4724: END
