{
	"info": {
		"_postman_id": "65d60093-408e-4ea7-ae34-2fbb1b5043c0",
		"name": "Gaming Social Media ",
		"schema": "https://schema.getpostman.com/json/collection/v2.1.0/collection.json"
	},
	"item": [
		{
			"name": "Register first user",
			"event": [
				{
					"listen": "test",
					"script": {
						"id": "16b33a85-d747-491e-9e18-7397ad1f487e",
						"exec": [
							"pm.test(\"Status code is 200\", function () {",
							"    pm.response.to.have.status(200);",
							"});",
							"",
							"",
							""
						],
						"type": "text/javascript"
					}
				},
				{
					"listen": "prerequest",
					"script": {
						"id": "e192de84-bca4-4d0f-a083-3f6e7752bb64",
						"exec": [
							"",
							"const randomString = Math.random().toString(36).substring(7);",
							"const username = \"user_\" + randomString;",
							"const email = \"user\" + randomString + \"@test.com\";",
							"const firstName = randomString;",
							"const lastName = randomString;",
							"pm.environment.set(\"email\", email);",
							"pm.environment.set(\"firstRegisteredUserUsername\", username);",
							"pm.environment.set(\"firstName\", firstName);",
							"pm.environment.set(\"lastName\", lastName);",
							""
						],
						"type": "text/javascript"
					}
				}
			],
			"request": {
				"method": "POST",
				"header": [
					{
						"key": "Content-Type",
						"name": "Content-Type",
						"type": "text",
						"value": "application/x-www-form-urlencoded"
					}
				],
				"body": {
					"mode": "urlencoded",
					"urlencoded": [
						{
							"key": "loginUsername",
							"value": "{{firstRegisteredUserUsername}}",
							"type": "text"
						},
						{
							"key": "loginPassword",
							"value": "{{password}}",
							"type": "text"
						},
						{
							"key": "passwordConfirmation",
							"value": "{{password}}",
							"type": "text"
						},
						{
							"key": "firstName",
							"value": "{{firstName}}",
							"type": "text"
						},
						{
							"key": "lastName",
							"value": "{{lastName}}",
							"type": "text"
						},
						{
							"key": "email",
							"value": "{{email}}",
							"type": "text"
						},
						{
							"key": "age",
							"value": "26",
							"type": "text"
						},
						{
							"key": "gender",
							"value": "FEMALE",
							"type": "text"
						},
						{
							"key": "country",
							"value": "Bulgaria",
							"type": "text"
						}
					]
				},
				"url": {
					"raw": "{{baseURL}}/",
					"host": [
						"{{baseURL}}"
					],
					"path": [
						""
					]
				}
			},
			"response": [
				{
					"name": "Register",
					"originalRequest": {
						"method": "POST",
						"header": [
							{
								"key": "Content-Type",
								"name": "Content-Type",
								"value": "text/xm",
								"type": "text"
							}
						],
						"body": {
							"mode": "raw",
							"raw": "{\n  \"age\": 20,\n  \"country\": \"Bulgaria\",\n  \"description\": \"string\",\n  \"email\": \"desislava.stoyanova1992@gmail.com\",\n  \"firstName\": \"anotherTestUser\",\n  \"gender\": \"MALE\",\n  \"lastName\": \"anotherTestUser\",\n  \"login\": {\n    \"enabled\": true,\n    \"password\": \"anotherTestUser\",\n    \"username\": \"anotherTestUser\"\n  }"
						},
						"url": {
							"raw": "{{baseURL}}/",
							"host": [
								"{{baseURL}}"
							],
							"path": [
								""
							]
						}
					},
					"status": "Bad Request",
					"code": 400,
					"_postman_previewlanguage": "json",
					"header": [
						{
							"key": "X-Content-Type-Options",
							"value": "nosniff"
						},
						{
							"key": "X-XSS-Protection",
							"value": "1; mode=block"
						},
						{
							"key": "Cache-Control",
							"value": "no-cache, no-store, max-age=0, must-revalidate"
						},
						{
							"key": "Pragma",
							"value": "no-cache"
						},
						{
							"key": "Expires",
							"value": "0"
						},
						{
							"key": "X-Frame-Options",
							"value": "DENY"
						},
						{
							"key": "Content-Type",
							"value": "application/json;charset=UTF-8"
						},
						{
							"key": "Transfer-Encoding",
							"value": "chunked"
						},
						{
							"key": "Date",
							"value": "Mon, 18 Nov 2019 12:34:28 GMT"
						},
						{
							"key": "Connection",
							"value": "close"
						}
					],
					"cookie": [],
					"body": "{\n    \"timestamp\": \"2019-11-18T12:34:28.898+0000\",\n    \"status\": 400,\n    \"error\": \"Bad Request\",\n    \"errors\": [\n        {\n            \"codes\": [\n                \"NotNull.registerUserModel.gender\",\n                \"NotNull.gender\",\n                \"NotNull.com.gaming.project.gamingproject.entities.GenderType\",\n                \"NotNull\"\n            ],\n            \"arguments\": [\n                {\n                    \"codes\": [\n                        \"registerUserModel.gender\",\n                        \"gender\"\n                    ],\n                    \"arguments\": null,\n                    \"defaultMessage\": \"gender\",\n                    \"code\": \"gender\"\n                }\n            ],\n            \"defaultMessage\": \"must not be null\",\n            \"objectName\": \"registerUserModel\",\n            \"field\": \"gender\",\n            \"rejectedValue\": null,\n            \"bindingFailure\": false,\n            \"code\": \"NotNull\"\n        },\n        {\n            \"codes\": [\n                \"NotNull.registerUserModel.country\",\n                \"NotNull.country\",\n                \"NotNull.java.lang.String\",\n                \"NotNull\"\n            ],\n            \"arguments\": [\n                {\n                    \"codes\": [\n                        \"registerUserModel.country\",\n                        \"country\"\n                    ],\n                    \"arguments\": null,\n                    \"defaultMessage\": \"country\",\n                    \"code\": \"country\"\n                }\n            ],\n            \"defaultMessage\": \"must not be null\",\n            \"objectName\": \"registerUserModel\",\n            \"field\": \"country\",\n            \"rejectedValue\": null,\n            \"bindingFailure\": false,\n            \"code\": \"NotNull\"\n        }\n    ],\n    \"message\": \"Validation failed for object='registerUserModel'. Error count: 2\",\n    \"path\": \"/\"\n}"
				}
			]
		},
		{
			"name": "Get confirmation email link via MailHog",
			"event": [
				{
					"listen": "test",
					"script": {
						"id": "4ae81147-38df-4612-b73a-b195c9efb616",
						"exec": [
							"var jsonData = pm.response.json();",
							"",
							"if (jsonData.items[0] && jsonData.items[0].Content) {",
							"    let matches = /\\?token\\=([a-zA-Z\\d\\-]+)/g.exec(jsonData.items[0].Content.Body);",
							"    console.log(matches);",
							"    pm.environment.set(\"confirm_token\", \"http://localhost:8080/account-verified\" + matches[0]);",
							"}"
						],
						"type": "text/javascript"
					}
				}
			],
			"request": {
				"method": "GET",
				"header": [],
				"url": {
					"raw": "http://localhost:8025/api/v2/messages",
					"protocol": "http",
					"host": [
						"localhost"
					],
					"port": "8025",
					"path": [
						"api",
						"v2",
						"messages"
					]
				}
			},
			"response": []
		},
		{
			"name": "Confirm verification email link",
			"request": {
				"method": "GET",
				"header": [],
				"url": {
					"raw": "{{confirm_token}}",
					"host": [
						"{{confirm_token}}"
					]
				}
			},
			"response": []
		},
		{
			"name": "First registered user logging in",
			"event": [
				{
					"listen": "test",
					"script": {
						"id": "8c477642-7a61-485c-aac9-7e5b6ae223f4",
						"exec": [
							"pm.test(\"Status code is 200\", function () {",
							"    pm.response.to.have.status(200);",
							"});",
							"",
							""
						],
						"type": "text/javascript"
					}
				}
			],
			"request": {
				"method": "POST",
				"header": [],
				"body": {
					"mode": "formdata",
					"formdata": [
						{
							"key": "username",
							"value": "{{firstRegisteredUserUsername}}",
							"type": "text"
						},
						{
							"key": "password",
							"value": "{{password}}",
							"type": "text"
						}
					]
				},
				"url": {
					"raw": "{{baseURL}}/authenticate",
					"host": [
						"{{baseURL}}"
					],
					"path": [
						"authenticate"
					]
				}
			},
			"response": []
		},
		{
			"name": "Getting first registered user's info",
			"event": [
				{
					"listen": "test",
					"script": {
						"id": "decd7669-ba86-45c7-b5ba-c32b7c2f2756",
						"exec": [
							"let jsonData = pm.response.json();",
							"pm.environment.set(\"firstRegisteredUserID\",jsonData.id);",
							"pm.environment.set(\"firstRegisteredUserFirstName\",jsonData.firstName);",
							"pm.environment.set(\"firstRegisteredUserLastName\",jsonData.lastName);",
							"pm.environment.set(\"loggedInUserid\",jsonData.id);"
						],
						"type": "text/javascript"
					}
				}
			],
			"request": {
				"method": "GET",
				"header": [],
				"url": {
					"raw": "{{baseURL}}/users/getLogged",
					"host": [
						"{{baseURL}}"
					],
					"path": [
						"users",
						"getLogged"
					]
				}
			},
			"response": []
		},
		{
			"name": "First user creates post",
			"event": [
				{
					"listen": "test",
					"script": {
						"id": "0463fb92-a7d3-40a7-bdcf-65660c78d41f",
						"exec": [
							"",
							"let jsonData = pm.response.json();",
							"pm.environment.set(\"firstLoggedUserPostID\",jsonData.id);",
							"pm.environment.set(\"firstLoggedUserPostText\",jsonData.text);",
							"pm.environment.set(\"firstLoggedUserFirstName\",jsonData.userFirstName);",
							"pm.environment.set(\"firstLoggedUserLastName\",jsonData.userLastName);",
							"",
							"",
							"pm.test(\"Content-Type is present\", function () {",
							"    pm.response.to.have.header(\"Content-Type\");",
							"});",
							"",
							"pm.test(\"Successful POST request\", function () {",
							"    pm.expect(pm.response.code).to.be.oneOf([200,201]);",
							"});",
							"",
							"",
							""
						],
						"type": "text/javascript"
					}
				},
				{
					"listen": "prerequest",
					"script": {
						"id": "56a7ee8a-404e-4bb7-8212-b2d74bba816e",
						"exec": [
							""
						],
						"type": "text/javascript"
					}
				}
			],
			"protocolProfileBehavior": {
				"followAuthorizationHeader": true
			},
			"request": {
				"method": "POST",
				"header": [
					{
						"key": "Content-Type",
						"name": "Content-Type",
						"type": "text",
						"value": "application/json"
					}
				],
				"body": {
					"mode": "raw",
					"raw": "{\r\n  \"postAccessibility\": \"PUBLIC\",\r\n  \"text\": \"text_{{$guid}}\"\r\n   \r\n}"
				},
				"url": {
					"raw": "{{baseURL}}/posts/",
					"host": [
						"{{baseURL}}"
					],
					"path": [
						"posts",
						""
					]
				}
			},
			"response": []
		},
		{
			"name": "Getting first registered user's post",
			"event": [
				{
					"listen": "test",
					"script": {
						"id": "f3f65d7d-a98c-4dfd-9664-691741525276",
						"exec": [
							"let id = pm.environment.get(\"firstLoggedUserPostID\");",
							"let text = pm.environment.get(\"firstLoggedUserPostText\");",
							"var jsonData = pm.response.json();",
							"",
							"pm.test(\"Status code is 200\", function () {",
							"    pm.response.to.have.status(200);",
							"});",
							"",
							"pm.test(\"Verify last created post is listed\", function () {",
							"    pm.expect(jsonData.content[0].id).to.eql(id);",
							"});",
							"",
							"pm.test(\"Assert post text\", function () {",
							"    pm.expect(jsonData.content[0].text).to.eql(text);",
							"});",
							""
						],
						"type": "text/javascript"
					}
				},
				{
					"listen": "prerequest",
					"script": {
						"id": "5d737d7e-033a-4c1d-9f22-262b5cb9242a",
						"exec": [
							""
						],
						"type": "text/javascript"
					}
				}
			],
			"protocolProfileBehavior": {
				"disableBodyPruning": true
			},
			"request": {
				"method": "GET",
				"header": [
					{
						"key": "Content-Type",
						"name": "Content-Type",
						"type": "text",
						"value": "application/json"
					}
				],
				"body": {
					"mode": "raw",
					"raw": "{\r\n  \"content\": [\r\n    {}\r\n  ],\r\n  \"empty\": true,\r\n  \"first\": true,\r\n  \"last\": true,\r\n  \"number\": 0,\r\n  \"numberOfElements\": 0,\r\n  \"pageable\": {\r\n    \"offset\": 0,\r\n    \"pageNumber\": 0,\r\n    \"pageSize\": 0,\r\n    \"paged\": true,\r\n    \"sort\": {\r\n      \"empty\": true,\r\n      \"sorted\": true,\r\n      \"unsorted\": true\r\n    },\r\n    \"unpaged\": true\r\n  },\r\n  \"size\": 0,\r\n  \"sort\": {\r\n    \"empty\": true,\r\n    \"sorted\": true,\r\n    \"unsorted\": true\r\n  },\r\n  \"totalElements\": 0,\r\n  \"totalPages\": 0\r\n}"
				},
				"url": {
					"raw": "{{baseURL}}/posts/{{firstRegisteredUserUsername}}",
					"host": [
						"{{baseURL}}"
					],
					"path": [
						"posts",
						"{{firstRegisteredUserUsername}}"
					]
				}
			},
			"response": []
		},
		{
			"name": "Register second user",
			"event": [
				{
					"listen": "test",
					"script": {
						"id": "16b33a85-d747-491e-9e18-7397ad1f487e",
						"exec": [
							"pm.test(\"Status code is 200\", function () {",
							"    pm.response.to.have.status(200);",
							"});",
							"",
							""
						],
						"type": "text/javascript"
					}
				},
				{
					"listen": "prerequest",
					"script": {
						"id": "e192de84-bca4-4d0f-a083-3f6e7752bb64",
						"exec": [
							"",
							"const randomString = Math.random().toString(36).substring(7);",
							"const username = \"user_\" + randomString;",
							"const email = \"user\" + randomString + \"@test.com\";",
							"const firstName = randomString;",
							"const lastName = randomString;",
							"pm.environment.set(\"email\", email);",
							"pm.environment.set(\"secondRegisteredUserUsername\", username);",
							"pm.environment.set(\"firstName\", firstName);",
							"pm.environment.set(\"lastName\", lastName);",
							""
						],
						"type": "text/javascript"
					}
				}
			],
			"request": {
				"method": "POST",
				"header": [
					{
						"key": "Content-Type",
						"name": "Content-Type",
						"type": "text",
						"value": "application/x-www-form-urlencoded"
					}
				],
				"body": {
					"mode": "urlencoded",
					"urlencoded": [
						{
							"key": "loginUsername",
							"value": "{{secondRegisteredUserUsername}}",
							"type": "text"
						},
						{
							"key": "loginPassword",
							"value": "{{password}}",
							"type": "text"
						},
						{
							"key": "passwordConfirmation",
							"value": "{{password}}",
							"type": "text"
						},
						{
							"key": "firstName",
							"value": "{{firstName}}",
							"type": "text"
						},
						{
							"key": "lastName",
							"value": "{{lastName}}",
							"type": "text"
						},
						{
							"key": "email",
							"value": "{{email}}",
							"type": "text"
						},
						{
							"key": "age",
							"value": "26",
							"type": "text"
						},
						{
							"key": "gender",
							"value": "FEMALE",
							"type": "text"
						},
						{
							"key": "country",
							"value": "Bulgaria",
							"type": "text"
						}
					]
				},
				"url": {
					"raw": "{{baseURL}}/",
					"host": [
						"{{baseURL}}"
					],
					"path": [
						""
					]
				}
			},
			"response": [
				{
					"name": "Register",
					"originalRequest": {
						"method": "POST",
						"header": [
							{
								"key": "Content-Type",
								"name": "Content-Type",
								"value": "text/xm",
								"type": "text"
							}
						],
						"body": {
							"mode": "raw",
							"raw": "{\n  \"age\": 20,\n  \"country\": \"Bulgaria\",\n  \"description\": \"string\",\n  \"email\": \"desislava.stoyanova1992@gmail.com\",\n  \"firstName\": \"anotherTestUser\",\n  \"gender\": \"MALE\",\n  \"lastName\": \"anotherTestUser\",\n  \"login\": {\n    \"enabled\": true,\n    \"password\": \"anotherTestUser\",\n    \"username\": \"anotherTestUser\"\n  }"
						},
						"url": {
							"raw": "{{baseURL}}/",
							"host": [
								"{{baseURL}}"
							],
							"path": [
								""
							]
						}
					},
					"status": "Bad Request",
					"code": 400,
					"_postman_previewlanguage": "json",
					"header": [
						{
							"key": "X-Content-Type-Options",
							"value": "nosniff"
						},
						{
							"key": "X-XSS-Protection",
							"value": "1; mode=block"
						},
						{
							"key": "Cache-Control",
							"value": "no-cache, no-store, max-age=0, must-revalidate"
						},
						{
							"key": "Pragma",
							"value": "no-cache"
						},
						{
							"key": "Expires",
							"value": "0"
						},
						{
							"key": "X-Frame-Options",
							"value": "DENY"
						},
						{
							"key": "Content-Type",
							"value": "application/json;charset=UTF-8"
						},
						{
							"key": "Transfer-Encoding",
							"value": "chunked"
						},
						{
							"key": "Date",
							"value": "Mon, 18 Nov 2019 12:34:28 GMT"
						},
						{
							"key": "Connection",
							"value": "close"
						}
					],
					"cookie": [],
					"body": "{\n    \"timestamp\": \"2019-11-18T12:34:28.898+0000\",\n    \"status\": 400,\n    \"error\": \"Bad Request\",\n    \"errors\": [\n        {\n            \"codes\": [\n                \"NotNull.registerUserModel.gender\",\n                \"NotNull.gender\",\n                \"NotNull.com.gaming.project.gamingproject.entities.GenderType\",\n                \"NotNull\"\n            ],\n            \"arguments\": [\n                {\n                    \"codes\": [\n                        \"registerUserModel.gender\",\n                        \"gender\"\n                    ],\n                    \"arguments\": null,\n                    \"defaultMessage\": \"gender\",\n                    \"code\": \"gender\"\n                }\n            ],\n            \"defaultMessage\": \"must not be null\",\n            \"objectName\": \"registerUserModel\",\n            \"field\": \"gender\",\n            \"rejectedValue\": null,\n            \"bindingFailure\": false,\n            \"code\": \"NotNull\"\n        },\n        {\n            \"codes\": [\n                \"NotNull.registerUserModel.country\",\n                \"NotNull.country\",\n                \"NotNull.java.lang.String\",\n                \"NotNull\"\n            ],\n            \"arguments\": [\n                {\n                    \"codes\": [\n                        \"registerUserModel.country\",\n                        \"country\"\n                    ],\n                    \"arguments\": null,\n                    \"defaultMessage\": \"country\",\n                    \"code\": \"country\"\n                }\n            ],\n            \"defaultMessage\": \"must not be null\",\n            \"objectName\": \"registerUserModel\",\n            \"field\": \"country\",\n            \"rejectedValue\": null,\n            \"bindingFailure\": false,\n            \"code\": \"NotNull\"\n        }\n    ],\n    \"message\": \"Validation failed for object='registerUserModel'. Error count: 2\",\n    \"path\": \"/\"\n}"
				}
			]
		},
		{
			"name": "Get confirmation email link via MailHog",
			"event": [
				{
					"listen": "test",
					"script": {
						"id": "7822485a-17d1-4642-b183-cdef00cb4b9f",
						"exec": [
							"var jsonData = pm.response.json();",
							"//pm.environment.set(\"regConfirmationEmailLink\", jsonData.items[0].Content.Body);",
							"console.log(jsonData.items[0].Content.Body);",
							"//var response = JSON.parse(responseBody);",
							"if (jsonData.items[0] && jsonData.items[0].Content) {",
							"    let matches = /\\?token\\=([a-zA-Z\\d\\-]+)/g.exec(jsonData.items[0].Content.Body);",
							"    console.log(matches);",
							"    pm.environment.set(\"confirm_token\", \"http://localhost:8080/account-verified\" + matches[0]);",
							"}"
						],
						"type": "text/javascript"
					}
				}
			],
			"request": {
				"method": "GET",
				"header": [],
				"url": {
					"raw": "http://localhost:8025/api/v2/messages",
					"protocol": "http",
					"host": [
						"localhost"
					],
					"port": "8025",
					"path": [
						"api",
						"v2",
						"messages"
					]
				}
			},
			"response": []
		},
		{
			"name": "Confirm verification email link",
			"request": {
				"method": "GET",
				"header": [],
				"url": {
					"raw": "{{confirm_token}}",
					"host": [
						"{{confirm_token}}"
					]
				}
			},
			"response": []
		},
		{
			"name": "Second registered user logging in",
			"event": [
				{
					"listen": "test",
					"script": {
						"id": "8c477642-7a61-485c-aac9-7e5b6ae223f4",
						"exec": [
							"pm.test(\"Status code is 200\", function () {",
							"    pm.response.to.have.status(200);",
							"});",
							"",
							"",
							"",
							""
						],
						"type": "text/javascript"
					}
				}
			],
			"protocolProfileBehavior": {
				"followAuthorizationHeader": true
			},
			"request": {
				"method": "POST",
				"header": [],
				"body": {
					"mode": "formdata",
					"formdata": [
						{
							"key": "username",
							"value": "{{secondRegisteredUserUsername}}",
							"type": "text"
						},
						{
							"key": "password",
							"value": "{{password}}",
							"type": "text"
						}
					]
				},
				"url": {
					"raw": "{{baseURL}}/authenticate",
					"host": [
						"{{baseURL}}"
					],
					"path": [
						"authenticate"
					]
				}
			},
			"response": []
		},
		{
			"name": "Getting second registered user's info",
			"event": [
				{
					"listen": "test",
					"script": {
						"id": "c25e258b-19c4-41be-a636-035eea1a9fb3",
						"exec": [
							"let jsonData = pm.response.json();",
							"pm.environment.set(\"secondRegisteredUserID\",jsonData.id);",
							"pm.environment.set(\"secondRegisteredUserFirstName\",jsonData.firstName);",
							"pm.environment.set(\"secondRegisteredUserLastName\",jsonData.lastName);",
							"",
							"",
							""
						],
						"type": "text/javascript"
					}
				}
			],
			"request": {
				"method": "GET",
				"header": [],
				"url": {
					"raw": "{{baseURL}}/users/getLogged",
					"host": [
						"{{baseURL}}"
					],
					"path": [
						"users",
						"getLogged"
					]
				}
			},
			"response": []
		},
		{
			"name": "Second  user creates post",
			"event": [
				{
					"listen": "test",
					"script": {
						"id": "0463fb92-a7d3-40a7-bdcf-65660c78d41f",
						"exec": [
							"",
							"let jsonData = pm.response.json();",
							"pm.environment.set(\"secondLoggedUserPostID\",jsonData.id);",
							"pm.environment.set(\"secondLoggedUserPostText\",jsonData.text);",
							"pm.environment.set(\"secondLoggedUserFirstName\",jsonData.userFirstName);",
							"pm.environment.set(\"secondLoggedUserLastName\",jsonData.userLastName);",
							"",
							"",
							"pm.test(\"Content-Type is present\", function () {",
							"    pm.response.to.have.header(\"Content-Type\");",
							"});",
							"",
							"pm.test(\"Successful POST request\", function () {",
							"    pm.expect(pm.response.code).to.be.oneOf([200,201]);",
							"});"
						],
						"type": "text/javascript"
					}
				},
				{
					"listen": "prerequest",
					"script": {
						"id": "56a7ee8a-404e-4bb7-8212-b2d74bba816e",
						"exec": [
							""
						],
						"type": "text/javascript"
					}
				}
			],
			"protocolProfileBehavior": {
				"followAuthorizationHeader": true
			},
			"request": {
				"method": "POST",
				"header": [
					{
						"key": "Content-Type",
						"name": "Content-Type",
						"value": "application/json",
						"type": "text"
					}
				],
				"body": {
					"mode": "raw",
					"raw": "{\r\n  \"postAccessibility\": \"PUBLIC\",\r\n  \"text\": \"text_{{$guid}}\"\r\n   \r\n}"
				},
				"url": {
					"raw": "{{baseURL}}/posts/",
					"host": [
						"{{baseURL}}"
					],
					"path": [
						"posts",
						""
					]
				}
			},
			"response": []
		},
		{
			"name": "Getting second registered user's post",
			"event": [
				{
					"listen": "test",
					"script": {
						"id": "f3f65d7d-a98c-4dfd-9664-691741525276",
						"exec": [
							"",
							"var jsonData = pm.response.json();",
							"let id = pm.environment.get(\"secondLoggedUserPostID\");",
							"let text = pm.environment.get(\"secondLoggedUserPostText\");",
							"",
							"",
							"pm.test(\"Status code is 200\", function () {",
							"    pm.response.to.have.status(200);",
							"});",
							"",
							"pm.test(\"Verify last created post is listed\", function () {",
							"    pm.expect(jsonData.content[0].id).to.eql(id);",
							"});",
							"",
							"pm.test(\"Assert post text\", function () {",
							"    pm.expect(jsonData.content[0].text).to.eql(text);",
							"});",
							""
						],
						"type": "text/javascript"
					}
				},
				{
					"listen": "prerequest",
					"script": {
						"id": "5d737d7e-033a-4c1d-9f22-262b5cb9242a",
						"exec": [
							""
						],
						"type": "text/javascript"
					}
				}
			],
			"protocolProfileBehavior": {
				"disableBodyPruning": true
			},
			"request": {
				"method": "GET",
				"header": [
					{
						"key": "Content-Type",
						"name": "Content-Type",
						"type": "text",
						"value": "application/json"
					}
				],
				"body": {
					"mode": "raw",
					"raw": "{\r\n  \"content\": [\r\n    {}\r\n  ],\r\n  \"empty\": true,\r\n  \"first\": true,\r\n  \"last\": true,\r\n  \"number\": 0,\r\n  \"numberOfElements\": 0,\r\n  \"pageable\": {\r\n    \"offset\": 0,\r\n    \"pageNumber\": 0,\r\n    \"pageSize\": 0,\r\n    \"paged\": true,\r\n    \"sort\": {\r\n      \"empty\": true,\r\n      \"sorted\": true,\r\n      \"unsorted\": true\r\n    },\r\n    \"unpaged\": true\r\n  },\r\n  \"size\": 0,\r\n  \"sort\": {\r\n    \"empty\": true,\r\n    \"sorted\": true,\r\n    \"unsorted\": true\r\n  },\r\n  \"totalElements\": 0,\r\n  \"totalPages\": 0\r\n}"
				},
				"url": {
					"raw": "{{baseURL}}/posts/{{secondRegisteredUserUsername}}",
					"host": [
						"{{baseURL}}"
					],
					"path": [
						"posts",
						"{{secondRegisteredUserUsername}}"
					]
				}
			},
			"response": []
		},
		{
			"name": "Filter users by first and last name",
			"event": [
				{
					"listen": "test",
					"script": {
						"id": "98258aa7-ec19-40d2-b17c-b12842c39048",
						"exec": [
							"",
							"let jsonData = pm.response.json();",
							"",
							"pm.test(\"Status code is 200\", function () {",
							"    pm.response.to.have.status(200);",
							"});",
							"",
							"pm.test(\"Assert logged user is listed\", function () {",
							"    var jsonData = pm.response.json();",
							"    let firstName = pm.environment.get(\"firstRegisteredUserFirstName\");",
							"    pm.expect(jsonData[0].firstName).to.eql(firstName);",
							"});"
						],
						"type": "text/javascript"
					}
				}
			],
			"protocolProfileBehavior": {
				"disableBodyPruning": true
			},
			"request": {
				"method": "GET",
				"header": [],
				"body": {
					"mode": "raw",
					"raw": ""
				},
				"url": {
					"raw": "{{baseURL}}/users/filter?firstName={{firstRegisteredUserFirstName}}&lastName={{firstRegisteredUserLastName}}",
					"host": [
						"{{baseURL}}"
					],
					"path": [
						"users",
						"filter"
					],
					"query": [
						{
							"key": "firstName",
							"value": "{{firstRegisteredUserFirstName}}"
						},
						{
							"key": "lastName",
							"value": "{{firstRegisteredUserLastName}}"
						}
					]
				},
				"description": "Get list of users filtered by first name"
			},
			"response": []
		},
		{
			"name": "Like post of another user",
			"event": [
				{
					"listen": "test",
					"script": {
						"id": "c4ff78a4-7d3b-4f6c-a1cb-aba44d08c2d2",
						"exec": [
							"pm.test(\"Status code is 200\", function () {",
							"    pm.response.to.have.status(200);",
							"});"
						],
						"type": "text/javascript"
					}
				}
			],
			"request": {
				"method": "PUT",
				"header": [
					{
						"key": "Content-Type",
						"value": "application/json",
						"type": "text"
					}
				],
				"body": {
					"mode": "raw",
					"raw": "{\n  \"postId\": {{firstLoggedUserPostID}},\n  \"userId\": {{firstRegisteredUserID}}\n}"
				},
				"url": {
					"raw": "{{baseURL}}/posts/like/",
					"host": [
						"{{baseURL}}"
					],
					"path": [
						"posts",
						"like",
						""
					]
				},
				"description": "\nAdd like to post"
			},
			"response": []
		},
		{
			"name": "Dislike post of another user",
			"event": [
				{
					"listen": "test",
					"script": {
						"id": "e4b45a2d-bb3b-4ab2-8022-92cf817be8be",
						"exec": [
							"pm.test(\"Status code is 200\", function () {",
							"    pm.response.to.have.status(200);",
							"});"
						],
						"type": "text/javascript"
					}
				}
			],
			"request": {
				"method": "PUT",
				"header": [
					{
						"key": "Content-Type",
						"value": "application/json",
						"type": "text"
					}
				],
				"body": {
					"mode": "raw",
					"raw": "{\n  \"postId\": {{firstLoggedUserPostID}},\n  \"userID\": {{firstRegisteredUserID}}\n}"
				},
				"url": {
					"raw": "{{baseURL}}/posts/dislike/",
					"host": [
						"{{baseURL}}"
					],
					"path": [
						"posts",
						"dislike",
						""
					]
				},
				"description": "Remove like from post - dislike"
			},
			"response": []
		},
		{
			"name": "Add comment to a random user's post",
			"event": [
				{
					"listen": "test",
					"script": {
						"id": "1cadd6f8-2dad-4ac2-9815-107a11c3a292",
						"exec": [
							"let jsonData = pm.response.json();",
							"let assertText = pm.environment.get(\"commentText\");",
							"pm.environment.set(\"randomTextForComments\", jsonData.text);",
							"",
							"pm.test(\"Status code is 200\", function () {",
							"    pm.response.to.have.status(200);",
							"});",
							"",
							"pm.test(\"Assert comment is added\", function () {",
							"    pm.expect(pm.response.text()).to.include(assertText);",
							"});"
						],
						"type": "text/javascript"
					}
				},
				{
					"listen": "prerequest",
					"script": {
						"id": "55ce3d58-3744-4cb6-9aea-e063197ab1fc",
						"exec": [
							"const randomString = Math.random().toString(36).substring(7);",
							"let commentText = \"comment\" + randomString;",
							"pm.environment.set(\"commentText\", commentText);"
						],
						"type": "text/javascript"
					}
				}
			],
			"request": {
				"method": "POST",
				"header": [
					{
						"key": "Content-Type",
						"value": "application/json",
						"type": "text"
					}
				],
				"body": {
					"mode": "raw",
					"raw": "{\n  \"picture\": \"string\",\n  \"postId\": {{firstLoggedUserPostID}},\n  \"text\": \"{{commentText}}\"\n}"
				},
				"url": {
					"raw": "{{baseURL}}/users/addComment",
					"host": [
						"{{baseURL}}"
					],
					"path": [
						"users",
						"addComment"
					]
				}
			},
			"response": []
		},
		{
			"name": "Make friend request",
			"event": [
				{
					"listen": "test",
					"script": {
						"id": "717b3801-5711-4a7c-bf0c-5771619ba328",
						"exec": [
							"pm.test(\"Status code is 200\", function () {",
							"    pm.response.to.have.status(200);",
							"});"
						],
						"type": "text/javascript"
					}
				}
			],
			"request": {
				"method": "PUT",
				"header": [
					{
						"key": "Content-Type",
						"value": "application/json",
						"type": "text"
					}
				],
				"url": {
					"raw": "{{baseURL}}/request/{{firstRegisteredUserID}}",
					"host": [
						"{{baseURL}}"
					],
					"path": [
						"request",
						"{{firstRegisteredUserID}}"
					]
				}
			},
			"response": []
		},
		{
			"name": "Remove friend request",
			"event": [
				{
					"listen": "test",
					"script": {
						"id": "4445932b-e3ca-4f97-8d82-8bba9dc5f00f",
						"exec": [
							"pm.test(\"Status code is 200\", function () {",
							"    pm.response.to.have.status(200);",
							"});"
						],
						"type": "text/javascript"
					}
				}
			],
			"request": {
				"method": "DELETE",
				"header": [
					{
						"key": "Content-Type",
						"value": "application/json",
						"type": "text"
					}
				],
				"url": {
					"raw": "{{baseURL}}/request/{{secondRegisteredUserID}}-{{firstRegisteredUserID}}",
					"host": [
						"{{baseURL}}"
					],
					"path": [
						"request",
						"{{secondRegisteredUserID}}-{{firstRegisteredUserID}}"
					]
				}
			},
			"response": []
		},
		{
			"name": "Delete post",
			"event": [
				{
					"listen": "test",
					"script": {
						"id": "277e9c81-70c0-4852-b541-e3cd16bb2e4c",
						"exec": [
							"pm.test(\"Status code is 200\", function () {",
							"    pm.response.to.have.status(200);",
							"});"
						],
						"type": "text/javascript"
					}
				}
			],
			"request": {
				"method": "DELETE",
				"header": [
					{
						"key": "",
						"value": "",
						"type": "text",
						"disabled": true
					}
				],
				"url": {
					"raw": "{{baseURL}}/posts/{{secondLoggedUserPostID}}",
					"host": [
						"{{baseURL}}"
					],
					"path": [
						"posts",
						"{{secondLoggedUserPostID}}"
					]
				}
			},
			"response": []
		},
		{
			"name": "Assert post is deleted by getting all posts",
			"event": [
				{
					"listen": "test",
					"script": {
						"id": "c48270f6-6341-4ebe-aca5-6b9f71339fa8",
						"exec": [
							"",
							"var postText = pm.environment.get(\"secondLoggedUserPostText\");",
							"",
							"",
							"pm.test(\"Status code is 200\", function () {",
							"    pm.response.to.have.status(200);",
							"});",
							"pm.test(\"Assert second logged user post is deleted\", function () {",
							"    pm.expect(pm.response.text()).to.not.include(\"postTex\");",
							"});"
						],
						"type": "text/javascript"
					}
				}
			],
			"request": {
				"method": "GET",
				"header": [],
				"url": {
					"raw": "{{baseURL}}/posts/page/public",
					"host": [
						"{{baseURL}}"
					],
					"path": [
						"posts",
						"page",
						"public"
					]
				}
			},
			"response": []
		}
	],
	"protocolProfileBehavior": {}
}