(footprint "R_1812_4532Metric" (version 20221018) (generator pcbnew)
  (layer "F.Cu")
  (descr "Resistor SMD 1812 (4532 Metric), square (rectangular) end terminal, IPC_7351 nominal, (Body size source: https://www.nikhef.nl/pub/departments/mt/projects/detectorR_D/dtddice/ERJ2G.pdf)")
  (tags "resistor")
  (attr smd)
  (fp_text reference "REF**" (at 0 -2.65) (layer "F.SilkS")
      (effects (font (size 1 1) (thickness 0.15)))
    (tstamp 07c8f8a5-66ea-44d9-b61d-c9babf036cfe)
  )
  (fp_text value "R_1812_4532Metric" (at 0 2.65) (layer "F.Fab")
      (effects (font (size 1 1) (thickness 0.15)))
    (tstamp bf7de5e2-a180-452d-b12e-efddf77a751e)
  )
  (fp_text user "${REFERENCE}" (at 0 0) (layer "F.Fab")
      (effects (font (size 1 1) (thickness 0.15)))
    (tstamp fa90bba1-aa25-4bc0-8f65-431b59c1a883)
  )
  (fp_line (start -1.386252 -1.71) (end 1.386252 -1.71)
    (stroke (width 0.12) (type solid)) (layer "F.SilkS") (tstamp c3360467-300e-40cd-abab-d10c7d427400))
  (fp_line (start -1.386252 1.71) (end 1.386252 1.71)
    (stroke (width 0.12) (type solid)) (layer "F.SilkS") (tstamp 033d170d-c7cb-4f98-8639-e5c43c12873d))
  (fp_line (start -2.95 -1.95) (end 2.95 -1.95)
    (stroke (width 0.05) (type solid)) (layer "F.CrtYd") (tstamp d658cdfd-d499-4f7e-8867-7543d500999d))
  (fp_line (start -2.95 1.95) (end -2.95 -1.95)
    (stroke (width 0.05) (type solid)) (layer "F.CrtYd") (tstamp c8d21a4f-5a5e-4d65-a12f-98a3307df9db))
  (fp_line (start 2.95 -1.95) (end 2.95 1.95)
    (stroke (width 0.05) (type solid)) (layer "F.CrtYd") (tstamp 7390ef03-582c-4371-90f9-25527b3556c4))
  (fp_line (start 2.95 1.95) (end -2.95 1.95)
    (stroke (width 0.05) (type solid)) (layer "F.CrtYd") (tstamp 2d3ddd4e-d048-4b57-83ae-d172277651e3))
  (fp_line (start -2.25 -1.6) (end 2.25 -1.6)
    (stroke (width 0.1) (type solid)) (layer "F.Fab") (tstamp 0899dd30-70eb-431c-beb2-593f0a3d43a0))
  (fp_line (start -2.25 1.6) (end -2.25 -1.6)
    (stroke (width 0.1) (type solid)) (layer "F.Fab") (tstamp b9797948-c512-4453-9764-ededd93d327e))
  (fp_line (start 2.25 -1.6) (end 2.25 1.6)
    (stroke (width 0.1) (type solid)) (layer "F.Fab") (tstamp 943ed307-722d-44d3-bd32-c1e17f570863))
  (fp_line (start 2.25 1.6) (end -2.25 1.6)
    (stroke (width 0.1) (type solid)) (layer "F.Fab") (tstamp ef631a4f-8282-4268-b741-c312832645b5))
  (pad "1" smd roundrect (at -2.1375 0) (size 1.125 3.4) (layers "F.Cu" "F.Paste" "F.Mask") (roundrect_rratio 0.222222) (tstamp 8018b937-34a6-481f-af88-bc8cc517f0fd))
  (pad "2" smd roundrect (at 2.1375 0) (size 1.125 3.4) (layers "F.Cu" "F.Paste" "F.Mask") (roundrect_rratio 0.222222) (tstamp c294cc3d-89a4-40b2-9a21-15be4ecb5644))
  (model "${KIPRJMOD}/Alakart_KicadLib/3dModels/R_1812_4532Metric.wrl"
    (offset (xyz 0 0 0))
    (scale (xyz 1 1 1))
    (rotate (xyz 0 0 0))
  )
)
