M48
; DRILL file {KiCad 7.0.7-2.fc38} date Paz 01 Eki 2023 12:47:10
; FORMAT={-:-/ absolute / metric / decimal}
; #@! TF.CreationDate,2023-10-01T12:47:10+03:00
; #@! TF.GenerationSoftware,Kicad,Pcbnew,7.0.7-2.fc38
; #@! TF.FileFunction,NonPlated,1,2,NPTH
FMAT,2
METRIC
; #@! TA.AperFunction,NonPlated,NPTH,ComponentDrill
T1C0.650
%
G90
G05
T1
X147.22Y-73.492
X153.0Y-73.492
T0
M30
