(footprint "L_2512_6332Metric" (version 20221018) (generator pcbnew)
  (layer "F.Cu")
  (descr "Inductor SMD 2512 (6332 Metric), square (rectangular) end terminal, IPC_7351 nominal, (Body size source: http://www.tortai-tech.com/upload/download/2011102023233369053.pdf), generated with kicad-footprint-generator")
  (tags "inductor")
  (attr smd)
  (fp_text reference "REF**" (at 0 -2.62) (layer "F.SilkS")
      (effects (font (size 1 1) (thickness 0.15)))
    (tstamp d082793b-860e-43ed-8d89-0abb6524a08e)
  )
  (fp_text value "L_2512_6332Metric" (at 0 2.62) (layer "F.Fab")
      (effects (font (size 1 1) (thickness 0.15)))
    (tstamp 638227ad-ab6f-4f35-a3fa-6b051268e9e4)
  )
  (fp_text user "${REFERENCE}" (at 0 0) (layer "F.Fab")
      (effects (font (size 1 1) (thickness 0.15)))
    (tstamp ce051b8b-94fd-47be-9b5a-4e5efc1d1024)
  )
  (fp_line (start -2.052064 -1.71) (end 2.052064 -1.71)
    (stroke (width 0.12) (type solid)) (layer "F.SilkS") (tstamp 578bba2c-07d3-4a8b-a63a-325026e3dc7d))
  (fp_line (start -2.052064 1.71) (end 2.052064 1.71)
    (stroke (width 0.12) (type solid)) (layer "F.SilkS") (tstamp 94f8cff2-c23c-45b7-87ae-e32514d611e9))
  (fp_line (start -3.82 -1.92) (end 3.82 -1.92)
    (stroke (width 0.05) (type solid)) (layer "F.CrtYd") (tstamp de5b38aa-0bc6-4974-8fd6-922a6fff3269))
  (fp_line (start -3.82 1.92) (end -3.82 -1.92)
    (stroke (width 0.05) (type solid)) (layer "F.CrtYd") (tstamp 29afb00b-0493-48c3-bdf4-6fb1c7323465))
  (fp_line (start 3.82 -1.92) (end 3.82 1.92)
    (stroke (width 0.05) (type solid)) (layer "F.CrtYd") (tstamp 40d27f21-092c-4b5d-8216-8da38cf95cff))
  (fp_line (start 3.82 1.92) (end -3.82 1.92)
    (stroke (width 0.05) (type solid)) (layer "F.CrtYd") (tstamp 40360db8-4e53-4057-99b3-3e4b828256a5))
  (fp_line (start -3.15 -1.6) (end 3.15 -1.6)
    (stroke (width 0.1) (type solid)) (layer "F.Fab") (tstamp 8856ed52-49bc-46e2-9c8d-555793f95055))
  (fp_line (start -3.15 1.6) (end -3.15 -1.6)
    (stroke (width 0.1) (type solid)) (layer "F.Fab") (tstamp 995b05df-481d-4f49-ba31-b50d8d4f606d))
  (fp_line (start 3.15 -1.6) (end 3.15 1.6)
    (stroke (width 0.1) (type solid)) (layer "F.Fab") (tstamp 5bb66f52-9d2b-4b51-8edc-a1f245a7852c))
  (fp_line (start 3.15 1.6) (end -3.15 1.6)
    (stroke (width 0.1) (type solid)) (layer "F.Fab") (tstamp 5a04cde7-e47b-4abf-b757-1a1f9c15d685))
  (pad "1" smd roundrect (at -2.9 0) (size 1.35 3.35) (layers "F.Cu" "F.Paste" "F.Mask") (roundrect_rratio 0.185185) (tstamp e637b940-a37e-4c0f-bf9b-d1142992c8b5))
  (pad "2" smd roundrect (at 2.9 0) (size 1.35 3.35) (layers "F.Cu" "F.Paste" "F.Mask") (roundrect_rratio 0.185185) (tstamp 7438f8a2-f724-4ad8-abba-c68a1ecbeaf5))
  (model "${KIPRJMOD}/Alakart_KicadLib/3dModels/L_2512_6332Metric.wrl"
    (offset (xyz 0 0 0))
    (scale (xyz 1 1 1))
    (rotate (xyz 0 0 0))
  )
)
