%TF.GenerationSoftware,KiCad,Pcbnew,7.0.7-2.fc38*%
%TF.CreationDate,2023-10-01T12:47:13+03:00*%
%TF.ProjectId,alakart,616c616b-6172-4742-9e6b-696361645f70,rev?*%
%TF.SameCoordinates,Original*%
%TF.FileFunction,Paste,Top*%
%TF.FilePolarity,Positive*%
%FSLAX46Y46*%
G04 Gerber Fmt 4.6, Leading zero omitted, Abs format (unit mm)*
G04 Created by KiCad (PCBNEW 7.0.7-2.fc38) date 2023-10-01 12:47:13*
%MOMM*%
%LPD*%
G01*
G04 APERTURE LIST*
G04 Aperture macros list*
%AMRoundRect*
0 Rectangle with rounded corners*
0 $1 Rounding radius*
0 $2 $3 $4 $5 $6 $7 $8 $9 X,Y pos of 4 corners*
0 Add a 4 corners polygon primitive as box body*
4,1,4,$2,$3,$4,$5,$6,$7,$8,$9,$2,$3,0*
0 Add four circle primitives for the rounded corners*
1,1,$1+$1,$2,$3*
1,1,$1+$1,$4,$5*
1,1,$1+$1,$6,$7*
1,1,$1+$1,$8,$9*
0 Add four rect primitives between the rounded corners*
20,1,$1+$1,$2,$3,$4,$5,0*
20,1,$1+$1,$4,$5,$6,$7,0*
20,1,$1+$1,$6,$7,$8,$9,0*
20,1,$1+$1,$8,$9,$2,$3,0*%
G04 Aperture macros list end*
%ADD10RoundRect,0.243750X0.456250X-0.243750X0.456250X0.243750X-0.456250X0.243750X-0.456250X-0.243750X0*%
%ADD11RoundRect,0.150000X0.587500X0.150000X-0.587500X0.150000X-0.587500X-0.150000X0.587500X-0.150000X0*%
%ADD12RoundRect,0.200000X-0.275000X0.200000X-0.275000X-0.200000X0.275000X-0.200000X0.275000X0.200000X0*%
%ADD13R,1.000000X1.450000*%
%ADD14RoundRect,0.200000X0.200000X0.275000X-0.200000X0.275000X-0.200000X-0.275000X0.200000X-0.275000X0*%
%ADD15RoundRect,0.232500X-0.232500X-0.232500X0.232500X-0.232500X0.232500X0.232500X-0.232500X0.232500X0*%
%ADD16RoundRect,0.062500X-0.375000X-0.062500X0.375000X-0.062500X0.375000X0.062500X-0.375000X0.062500X0*%
%ADD17RoundRect,0.062500X-0.062500X-0.375000X0.062500X-0.375000X0.062500X0.375000X-0.062500X0.375000X0*%
%ADD18RoundRect,0.200000X0.275000X-0.200000X0.275000X0.200000X-0.275000X0.200000X-0.275000X-0.200000X0*%
%ADD19RoundRect,0.225000X0.225000X0.250000X-0.225000X0.250000X-0.225000X-0.250000X0.225000X-0.250000X0*%
%ADD20RoundRect,0.225000X-0.250000X0.225000X-0.250000X-0.225000X0.250000X-0.225000X0.250000X0.225000X0*%
%ADD21RoundRect,0.225000X-0.225000X-0.250000X0.225000X-0.250000X0.225000X0.250000X-0.225000X0.250000X0*%
%ADD22R,0.400000X0.650000*%
%ADD23RoundRect,0.243750X0.243750X0.456250X-0.243750X0.456250X-0.243750X-0.456250X0.243750X-0.456250X0*%
%ADD24RoundRect,0.243750X-0.243750X-0.456250X0.243750X-0.456250X0.243750X0.456250X-0.243750X0.456250X0*%
%ADD25RoundRect,0.243750X-0.456250X0.243750X-0.456250X-0.243750X0.456250X-0.243750X0.456250X0.243750X0*%
%ADD26R,0.600000X1.140000*%
%ADD27R,0.300000X1.140000*%
G04 APERTURE END LIST*
D10*
%TO.C,D7*%
X154863800Y-82522300D03*
X154863800Y-80647300D03*
%TD*%
D11*
%TO.C,Q1*%
X148247500Y-83090000D03*
X148247500Y-81190000D03*
X146372500Y-82140000D03*
%TD*%
D12*
%TO.C,R5*%
X148880000Y-105885000D03*
X148880000Y-107535000D03*
%TD*%
D13*
%TO.C,S1*%
X146350000Y-103500000D03*
X146350000Y-98350000D03*
X148050000Y-103500000D03*
X148050000Y-98350000D03*
%TD*%
D14*
%TO.C,R8*%
X147395000Y-96510000D03*
X145745000Y-96510000D03*
%TD*%
D15*
%TO.C,U1*%
X147948000Y-87089600D03*
X147948000Y-88239600D03*
X147948000Y-89389600D03*
X149098000Y-87089600D03*
X149098000Y-88239600D03*
X149098000Y-89389600D03*
X150248000Y-87089600D03*
X150248000Y-88239600D03*
X150248000Y-89389600D03*
D16*
X146660500Y-86489600D03*
X146660500Y-86989600D03*
X146660500Y-87489600D03*
X146660500Y-87989600D03*
X146660500Y-88489600D03*
X146660500Y-88989600D03*
X146660500Y-89489600D03*
X146660500Y-89989600D03*
D17*
X147348000Y-90677100D03*
X147848000Y-90677100D03*
X148348000Y-90677100D03*
X148848000Y-90677100D03*
X149348000Y-90677100D03*
X149848000Y-90677100D03*
X150348000Y-90677100D03*
X150848000Y-90677100D03*
D16*
X151535500Y-89989600D03*
X151535500Y-89489600D03*
X151535500Y-88989600D03*
X151535500Y-88489600D03*
X151535500Y-87989600D03*
X151535500Y-87489600D03*
X151535500Y-86989600D03*
X151535500Y-86489600D03*
D17*
X150848000Y-85802100D03*
X150348000Y-85802100D03*
X149848000Y-85802100D03*
X149348000Y-85802100D03*
X148848000Y-85802100D03*
X148348000Y-85802100D03*
X147848000Y-85802100D03*
X147348000Y-85802100D03*
%TD*%
D18*
%TO.C,R1*%
X153162000Y-79234800D03*
X153162000Y-77584800D03*
%TD*%
D10*
%TO.C,D6*%
X152933400Y-82522300D03*
X152933400Y-80647300D03*
%TD*%
D13*
%TO.C,S2*%
X152570000Y-103475000D03*
X152570000Y-98325000D03*
X154270000Y-103475000D03*
X154270000Y-98325000D03*
%TD*%
D19*
%TO.C,C8*%
X155410200Y-90068400D03*
X153860200Y-90068400D03*
%TD*%
D12*
%TO.C,R16*%
X151612600Y-77559400D03*
X151612600Y-79209400D03*
%TD*%
D20*
%TO.C,C3*%
X150250000Y-98100000D03*
X150250000Y-99650000D03*
%TD*%
D14*
%TO.C,R12*%
X150500000Y-96525000D03*
X148850000Y-96525000D03*
%TD*%
D21*
%TO.C,C5*%
X145025000Y-79710000D03*
X146575000Y-79710000D03*
%TD*%
D22*
%TO.C,U3*%
X148829000Y-79740800D03*
X149479000Y-79740800D03*
X150129000Y-79740800D03*
X150129000Y-77840800D03*
X149479000Y-77840800D03*
X148829000Y-77840800D03*
%TD*%
D19*
%TO.C,C10*%
X155410200Y-87122000D03*
X153860200Y-87122000D03*
%TD*%
D14*
%TO.C,R17*%
X146625000Y-77830000D03*
X144975000Y-77830000D03*
%TD*%
D12*
%TO.C,R13*%
X149960000Y-82905000D03*
X149960000Y-81255000D03*
%TD*%
D23*
%TO.C,D3*%
X147297500Y-107260000D03*
X145422500Y-107260000D03*
%TD*%
D14*
%TO.C,R9*%
X147455000Y-94450000D03*
X145805000Y-94450000D03*
%TD*%
D12*
%TO.C,R3*%
X150370000Y-105875000D03*
X150370000Y-107525000D03*
%TD*%
D24*
%TO.C,D2*%
X151852500Y-107238800D03*
X153727500Y-107238800D03*
%TD*%
D18*
%TO.C,R7*%
X150240000Y-103205000D03*
X150240000Y-101555000D03*
%TD*%
D25*
%TO.C,D1*%
X154863800Y-77269100D03*
X154863800Y-79144100D03*
%TD*%
D19*
%TO.C,C9*%
X155410200Y-88595200D03*
X153860200Y-88595200D03*
%TD*%
D26*
%TO.C,J5*%
X153310000Y-74561500D03*
X152510000Y-74561500D03*
D27*
X151360000Y-74561500D03*
X150360000Y-74561500D03*
X149860000Y-74561500D03*
X148860000Y-74561500D03*
D26*
X146910000Y-74561500D03*
X147710000Y-74561500D03*
D27*
X148360000Y-74561500D03*
X149360000Y-74561500D03*
X150860000Y-74561500D03*
X151860000Y-74561500D03*
%TD*%
D21*
%TO.C,C4*%
X148831000Y-94462600D03*
X150381000Y-94462600D03*
%TD*%
D14*
%TO.C,R10*%
X153415000Y-105340000D03*
X151765000Y-105340000D03*
%TD*%
D24*
%TO.C,D4*%
X151919700Y-96393000D03*
X153794700Y-96393000D03*
%TD*%
D18*
%TO.C,R11*%
X155540000Y-107745000D03*
X155540000Y-106095000D03*
%TD*%
M02*
