(footprint "C_1210_3225Metric" (version 20221018) (generator pcbnew)
  (layer "F.Cu")
  (descr "Capacitor SMD 1210 (3225 Metric), square (rectangular) end terminal, IPC_7351 nominal, (Body size source: IPC-SM-782 page 76, https://www.pcb-3d.com/wordpress/wp-content/uploads/ipc-sm-782a_amendment_1_and_2.pdf)")
  (tags "capacitor")
  (attr smd)
  (fp_text reference "REF**" (at 0 -2.3) (layer "F.SilkS")
      (effects (font (size 1 1) (thickness 0.15)))
    (tstamp ba50cbf0-c8e2-4263-b5b2-a672c5571e4c)
  )
  (fp_text value "C_1210_3225Metric" (at 0 2.3) (layer "F.Fab")
      (effects (font (size 1 1) (thickness 0.15)))
    (tstamp 7545b299-e0fe-40f2-adba-d22c1074409b)
  )
  (fp_text user "${REFERENCE}" (at 0 0) (layer "F.Fab")
      (effects (font (size 0.8 0.8) (thickness 0.12)))
    (tstamp 08e506ac-6e33-4976-bb69-5bc0c8aa9fc1)
  )
  (fp_line (start -0.711252 -1.36) (end 0.711252 -1.36)
    (stroke (width 0.12) (type solid)) (layer "F.SilkS") (tstamp 229a5c26-5bb8-4091-95cc-3cae1b9b9abd))
  (fp_line (start -0.711252 1.36) (end 0.711252 1.36)
    (stroke (width 0.12) (type solid)) (layer "F.SilkS") (tstamp e8e3e62a-3492-4400-989d-75f88b91de23))
  (fp_line (start -2.3 -1.6) (end 2.3 -1.6)
    (stroke (width 0.05) (type solid)) (layer "F.CrtYd") (tstamp 3b8139bc-995e-413c-b534-ff02c24165bb))
  (fp_line (start -2.3 1.6) (end -2.3 -1.6)
    (stroke (width 0.05) (type solid)) (layer "F.CrtYd") (tstamp 4fc6646f-79ae-400e-becd-b3c83583fb50))
  (fp_line (start 2.3 -1.6) (end 2.3 1.6)
    (stroke (width 0.05) (type solid)) (layer "F.CrtYd") (tstamp 7c081c51-0c76-499b-845b-2cfac584c383))
  (fp_line (start 2.3 1.6) (end -2.3 1.6)
    (stroke (width 0.05) (type solid)) (layer "F.CrtYd") (tstamp 0fd34971-9091-4427-b04a-9a9d8a486e24))
  (fp_line (start -1.6 -1.25) (end 1.6 -1.25)
    (stroke (width 0.1) (type solid)) (layer "F.Fab") (tstamp b46fd3db-2617-46f7-8727-0290face1d83))
  (fp_line (start -1.6 1.25) (end -1.6 -1.25)
    (stroke (width 0.1) (type solid)) (layer "F.Fab") (tstamp ffd4ab2d-f802-47d6-9bc6-70de2b75f053))
  (fp_line (start 1.6 -1.25) (end 1.6 1.25)
    (stroke (width 0.1) (type solid)) (layer "F.Fab") (tstamp d66bdaf1-3412-4bd5-ac2b-31ef414d628b))
  (fp_line (start 1.6 1.25) (end -1.6 1.25)
    (stroke (width 0.1) (type solid)) (layer "F.Fab") (tstamp e26428b2-47a9-4690-a13f-af1b3b91068e))
  (pad "1" smd roundrect (at -1.475 0) (size 1.15 2.7) (layers "F.Cu" "F.Paste" "F.Mask") (roundrect_rratio 0.217391) (tstamp 3f8fd7e9-61c1-4fa9-92f6-762298e161d8))
  (pad "2" smd roundrect (at 1.475 0) (size 1.15 2.7) (layers "F.Cu" "F.Paste" "F.Mask") (roundrect_rratio 0.217391) (tstamp 584ba531-83e4-40ff-a284-a4520b8b7d41))
  (model "${KIPRJMOD}/Alakart_KicadLib/3dModels/C_1210_3225Metric.wrl"
    (offset (xyz 0 0 0))
    (scale (xyz 1 1 1))
    (rotate (xyz 0 0 0))
  )
)
