(footprint "SOT-363_SC-70-6" (version 20221018) (generator pcbnew)
  (layer "F.Cu")
  (descr "SOT-363, SC-70-6")
  (tags "SOT-363 SC-70-6")
  (attr smd)
  (fp_text reference "REF**" (at 0 -2) (layer "F.SilkS")
      (effects (font (size 1 1) (thickness 0.15)))
    (tstamp ba5e12ed-3c26-4b66-a6df-38f72030d493)
  )
  (fp_text value "SOT-363_SC-70-6" (at 0 2 180) (layer "F.Fab")
      (effects (font (size 1 1) (thickness 0.15)))
    (tstamp 42b3d5d1-6417-4a5f-8e0b-991fa896d2a0)
  )
  (fp_text user "${REFERENCE}" (at 0 0 90) (layer "F.Fab")
      (effects (font (size 0.5 0.5) (thickness 0.075)))
    (tstamp 06cf618e-a7bc-41f6-8440-ecf91943189c)
  )
  (fp_line (start -0.7 1.16) (end 0.7 1.16)
    (stroke (width 0.12) (type solid)) (layer "F.SilkS") (tstamp 23602ac9-1856-4319-b5b5-e00ffa7e413c))
  (fp_line (start 0.7 -1.16) (end -1.2 -1.16)
    (stroke (width 0.12) (type solid)) (layer "F.SilkS") (tstamp 728ccb5f-9162-4f40-b128-7974191ff13a))
  (fp_line (start -1.6 -1.4) (end -1.6 1.4)
    (stroke (width 0.05) (type solid)) (layer "F.CrtYd") (tstamp d7dd4c19-438f-4aa5-a896-9f073dd7a7c7))
  (fp_line (start -1.6 -1.4) (end 1.6 -1.4)
    (stroke (width 0.05) (type solid)) (layer "F.CrtYd") (tstamp 988e60ca-644b-4ce8-9be1-895969936594))
  (fp_line (start -1.6 1.4) (end 1.6 1.4)
    (stroke (width 0.05) (type solid)) (layer "F.CrtYd") (tstamp 0ec5fa1e-0ba1-4739-9443-bd9536a5825f))
  (fp_line (start 1.6 1.4) (end 1.6 -1.4)
    (stroke (width 0.05) (type solid)) (layer "F.CrtYd") (tstamp 85bc296a-a9bb-4eb3-821b-121ec3ad465d))
  (fp_line (start -0.675 -0.6) (end -0.675 1.1)
    (stroke (width 0.1) (type solid)) (layer "F.Fab") (tstamp 38a7cfd4-99ad-4bad-8005-e899dcb2c224))
  (fp_line (start -0.175 -1.1) (end -0.675 -0.6)
    (stroke (width 0.1) (type solid)) (layer "F.Fab") (tstamp b75ae859-295b-4ee7-95c0-34bba57b06fb))
  (fp_line (start 0.675 -1.1) (end -0.175 -1.1)
    (stroke (width 0.1) (type solid)) (layer "F.Fab") (tstamp 88d654f5-c59f-4a60-a30d-9a95a5c7e17e))
  (fp_line (start 0.675 -1.1) (end 0.675 1.1)
    (stroke (width 0.1) (type solid)) (layer "F.Fab") (tstamp 0c9476c7-66bc-4d31-ad73-65c0f18716f3))
  (fp_line (start 0.675 1.1) (end -0.675 1.1)
    (stroke (width 0.1) (type solid)) (layer "F.Fab") (tstamp e5505e2c-6145-4940-8763-b21e5d4f1532))
  (pad "1" smd rect (at -0.95 -0.65) (size 0.65 0.4) (layers "F.Cu" "F.Paste" "F.Mask") (tstamp 28e708b8-d3c9-486e-884b-ca1b86dea289))
  (pad "2" smd rect (at -0.95 0) (size 0.65 0.4) (layers "F.Cu" "F.Paste" "F.Mask") (tstamp 60822f64-2a21-4020-aefa-02ecd6127a3b))
  (pad "3" smd rect (at -0.95 0.65) (size 0.65 0.4) (layers "F.Cu" "F.Paste" "F.Mask") (tstamp 5dff1eb8-15d1-4564-b736-17c9de953d19))
  (pad "4" smd rect (at 0.95 0.65) (size 0.65 0.4) (layers "F.Cu" "F.Paste" "F.Mask") (tstamp a748f67e-fe7f-4071-8955-824616328c92))
  (pad "5" smd rect (at 0.95 0) (size 0.65 0.4) (layers "F.Cu" "F.Paste" "F.Mask") (tstamp ad12a386-7b9b-438c-8c2b-a6b004f1cc7d))
  (pad "6" smd rect (at 0.95 -0.65) (size 0.65 0.4) (layers "F.Cu" "F.Paste" "F.Mask") (tstamp 097ac030-c735-4bb9-a2cc-54d24d45b532))
  (model "${KIPRJMOD}/Alakart_KicadLib/3dModels/SOT-363_SC-70-6.wrl"
    (offset (xyz 0 0 0))
    (scale (xyz 1 1 1))
    (rotate (xyz 0 0 0))
  )
)
