(footprint "TSSOP-28_4.4x9.7mm_P0.65mm" (version 20221018) (generator pcbnew)
  (layer "F.Cu")
  (descr "TSSOP, 28 Pin (JEDEC MO-153 Var AE https://www.jedec.org/document_search?search_api_views_fulltext=MO-153)")
  (tags "TSSOP SO")
  (attr smd)
  (fp_text reference "REF**" (at 0 -5.8) (layer "F.SilkS")
      (effects (font (size 1 1) (thickness 0.15)))
    (tstamp a31a34bb-63b1-46fc-a4ba-4329f5129d49)
  )
  (fp_text value "TSSOP-28_4.4x9.7mm_P0.65mm" (at 0 5.8) (layer "F.Fab")
      (effects (font (size 1 1) (thickness 0.15)))
    (tstamp 908f7904-3ede-4a1b-a6da-10c4abfdf38e)
  )
  (fp_text user "${REFERENCE}" (at 0 0) (layer "F.Fab")
      (effects (font (size 1 1) (thickness 0.15)))
    (tstamp 3a143aae-57e4-453d-ad78-877cdc6f658e)
  )
  (fp_line (start -2.31 -4.96) (end -2.31 -4.685)
    (stroke (width 0.12) (type solid)) (layer "F.SilkS") (tstamp 22c20b31-deb3-4584-befd-f6e3e9296fa6))
  (fp_line (start -2.31 -4.685) (end -3.6 -4.685)
    (stroke (width 0.12) (type solid)) (layer "F.SilkS") (tstamp 37854acd-279c-4539-b72b-3c6b8120fb92))
  (fp_line (start -2.31 4.96) (end -2.31 4.685)
    (stroke (width 0.12) (type solid)) (layer "F.SilkS") (tstamp 068dc619-9d20-4295-985d-180f2df3b20f))
  (fp_line (start 0 -4.96) (end -2.31 -4.96)
    (stroke (width 0.12) (type solid)) (layer "F.SilkS") (tstamp d9ec9d18-f207-409e-b503-048ee3222a1d))
  (fp_line (start 0 -4.96) (end 2.31 -4.96)
    (stroke (width 0.12) (type solid)) (layer "F.SilkS") (tstamp 76809d1d-a8e0-4846-b264-06347206b97e))
  (fp_line (start 0 4.96) (end -2.31 4.96)
    (stroke (width 0.12) (type solid)) (layer "F.SilkS") (tstamp 20513800-d537-411e-95ea-6bc8800bc957))
  (fp_line (start 0 4.96) (end 2.31 4.96)
    (stroke (width 0.12) (type solid)) (layer "F.SilkS") (tstamp 46a1dc6c-41aa-4dfc-b1b9-b946344cb85a))
  (fp_line (start 2.31 -4.96) (end 2.31 -4.685)
    (stroke (width 0.12) (type solid)) (layer "F.SilkS") (tstamp c77b111a-f0df-4457-bcc0-d30d986345ed))
  (fp_line (start 2.31 4.96) (end 2.31 4.685)
    (stroke (width 0.12) (type solid)) (layer "F.SilkS") (tstamp 74706154-f6f8-438b-a028-56c3abe553c7))
  (fp_line (start -3.85 -5.1) (end -3.85 5.1)
    (stroke (width 0.05) (type solid)) (layer "F.CrtYd") (tstamp e808d232-9cd1-48a8-b544-737a09074ca5))
  (fp_line (start -3.85 5.1) (end 3.85 5.1)
    (stroke (width 0.05) (type solid)) (layer "F.CrtYd") (tstamp 5c15597b-376d-4a3e-a6bc-cc3d4c9f6f7b))
  (fp_line (start 3.85 -5.1) (end -3.85 -5.1)
    (stroke (width 0.05) (type solid)) (layer "F.CrtYd") (tstamp 91dc4595-b5a9-41b6-8ca0-6d9fc37af8b9))
  (fp_line (start 3.85 5.1) (end 3.85 -5.1)
    (stroke (width 0.05) (type solid)) (layer "F.CrtYd") (tstamp fc7f5578-8024-4be7-add6-d2dc2036daf0))
  (fp_line (start -2.2 -3.85) (end -1.2 -4.85)
    (stroke (width 0.1) (type solid)) (layer "F.Fab") (tstamp fa82e959-af86-4483-919f-0e51331cd0e2))
  (fp_line (start -2.2 4.85) (end -2.2 -3.85)
    (stroke (width 0.1) (type solid)) (layer "F.Fab") (tstamp be041f7e-fd55-42dc-8805-49383baaa2df))
  (fp_line (start -1.2 -4.85) (end 2.2 -4.85)
    (stroke (width 0.1) (type solid)) (layer "F.Fab") (tstamp 168d5f7a-2e32-443d-bebe-dc284a560dbf))
  (fp_line (start 2.2 -4.85) (end 2.2 4.85)
    (stroke (width 0.1) (type solid)) (layer "F.Fab") (tstamp 5b79a7df-2569-40e6-bf89-d52d09f21bb2))
  (fp_line (start 2.2 4.85) (end -2.2 4.85)
    (stroke (width 0.1) (type solid)) (layer "F.Fab") (tstamp 8992ab57-2327-476f-a0ad-2eeb6d14c904))
  (pad "1" smd roundrect (at -2.8625 -4.225) (size 1.475 0.4) (layers "F.Cu" "F.Paste" "F.Mask") (roundrect_rratio 0.25) (tstamp 36c71c16-8d1b-4675-a74b-391838f38dd9))
  (pad "2" smd roundrect (at -2.8625 -3.575) (size 1.475 0.4) (layers "F.Cu" "F.Paste" "F.Mask") (roundrect_rratio 0.25) (tstamp 8c24ce4e-1406-40e3-adf4-82fea51239e6))
  (pad "3" smd roundrect (at -2.8625 -2.925) (size 1.475 0.4) (layers "F.Cu" "F.Paste" "F.Mask") (roundrect_rratio 0.25) (tstamp 0b4b15e9-3b22-4eb1-bf30-fbbc71230fcf))
  (pad "4" smd roundrect (at -2.8625 -2.275) (size 1.475 0.4) (layers "F.Cu" "F.Paste" "F.Mask") (roundrect_rratio 0.25) (tstamp 8b702b8a-6015-4f7a-8ba9-1b42480a346b))
  (pad "5" smd roundrect (at -2.8625 -1.625) (size 1.475 0.4) (layers "F.Cu" "F.Paste" "F.Mask") (roundrect_rratio 0.25) (tstamp 3e199418-f180-4c74-9577-980ed49922e5))
  (pad "6" smd roundrect (at -2.8625 -0.975) (size 1.475 0.4) (layers "F.Cu" "F.Paste" "F.Mask") (roundrect_rratio 0.25) (tstamp 1bbf5db1-7786-4a3e-93fd-501c90c84a50))
  (pad "7" smd roundrect (at -2.8625 -0.325) (size 1.475 0.4) (layers "F.Cu" "F.Paste" "F.Mask") (roundrect_rratio 0.25) (tstamp 812bf372-f986-452a-9a61-e58ed1d4c536))
  (pad "8" smd roundrect (at -2.8625 0.325) (size 1.475 0.4) (layers "F.Cu" "F.Paste" "F.Mask") (roundrect_rratio 0.25) (tstamp d19d4f46-aa5d-4936-af25-83156391678a))
  (pad "9" smd roundrect (at -2.8625 0.975) (size 1.475 0.4) (layers "F.Cu" "F.Paste" "F.Mask") (roundrect_rratio 0.25) (tstamp 1ade4038-b34d-434b-b0e2-7c44967a5928))
  (pad "10" smd roundrect (at -2.8625 1.625) (size 1.475 0.4) (layers "F.Cu" "F.Paste" "F.Mask") (roundrect_rratio 0.25) (tstamp b9e0ea19-3f01-48ee-b9be-9bfecaa2845e))
  (pad "11" smd roundrect (at -2.8625 2.275) (size 1.475 0.4) (layers "F.Cu" "F.Paste" "F.Mask") (roundrect_rratio 0.25) (tstamp c41dcef2-87fa-482f-8c3a-81a7232f5057))
  (pad "12" smd roundrect (at -2.8625 2.925) (size 1.475 0.4) (layers "F.Cu" "F.Paste" "F.Mask") (roundrect_rratio 0.25) (tstamp 925992b8-4a30-4f3d-90ba-4df4d3408c7b))
  (pad "13" smd roundrect (at -2.8625 3.575) (size 1.475 0.4) (layers "F.Cu" "F.Paste" "F.Mask") (roundrect_rratio 0.25) (tstamp 37b7dfc1-3cef-4fb0-9ff8-50db1e23b04a))
  (pad "14" smd roundrect (at -2.8625 4.225) (size 1.475 0.4) (layers "F.Cu" "F.Paste" "F.Mask") (roundrect_rratio 0.25) (tstamp 112e1fe7-f6b1-4504-8687-6d38b6679ca6))
  (pad "15" smd roundrect (at 2.8625 4.225) (size 1.475 0.4) (layers "F.Cu" "F.Paste" "F.Mask") (roundrect_rratio 0.25) (tstamp aa75033d-a265-46a3-bf28-f104d35c6f66))
  (pad "16" smd roundrect (at 2.8625 3.575) (size 1.475 0.4) (layers "F.Cu" "F.Paste" "F.Mask") (roundrect_rratio 0.25) (tstamp 23c1a57f-e07b-445c-828f-2c62711e21bb))
  (pad "17" smd roundrect (at 2.8625 2.925) (size 1.475 0.4) (layers "F.Cu" "F.Paste" "F.Mask") (roundrect_rratio 0.25) (tstamp 11f3e593-d2f5-422d-bcc1-427d2f2fba9c))
  (pad "18" smd roundrect (at 2.8625 2.275) (size 1.475 0.4) (layers "F.Cu" "F.Paste" "F.Mask") (roundrect_rratio 0.25) (tstamp ca3fb6f3-9e79-4a8c-a756-b85bcd6d6491))
  (pad "19" smd roundrect (at 2.8625 1.625) (size 1.475 0.4) (layers "F.Cu" "F.Paste" "F.Mask") (roundrect_rratio 0.25) (tstamp 99d8fe5f-296f-4a05-bc10-c35901e3fa8b))
  (pad "20" smd roundrect (at 2.8625 0.975) (size 1.475 0.4) (layers "F.Cu" "F.Paste" "F.Mask") (roundrect_rratio 0.25) (tstamp 48aff222-20b7-4980-81c3-32db41dd9a54))
  (pad "21" smd roundrect (at 2.8625 0.325) (size 1.475 0.4) (layers "F.Cu" "F.Paste" "F.Mask") (roundrect_rratio 0.25) (tstamp e8683151-939c-4c94-be63-e4c4bbdbc0b8))
  (pad "22" smd roundrect (at 2.8625 -0.325) (size 1.475 0.4) (layers "F.Cu" "F.Paste" "F.Mask") (roundrect_rratio 0.25) (tstamp c96780d1-7673-4d82-b504-3b6c60d89778))
  (pad "23" smd roundrect (at 2.8625 -0.975) (size 1.475 0.4) (layers "F.Cu" "F.Paste" "F.Mask") (roundrect_rratio 0.25) (tstamp 2ddbad4c-ec10-4f07-a38d-4353c4d43acc))
  (pad "24" smd roundrect (at 2.8625 -1.625) (size 1.475 0.4) (layers "F.Cu" "F.Paste" "F.Mask") (roundrect_rratio 0.25) (tstamp 43174867-835e-4775-9804-5b7069952166))
  (pad "25" smd roundrect (at 2.8625 -2.275) (size 1.475 0.4) (layers "F.Cu" "F.Paste" "F.Mask") (roundrect_rratio 0.25) (tstamp bdbe0e07-44f9-44d8-8883-6c8ab9bba712))
  (pad "26" smd roundrect (at 2.8625 -2.925) (size 1.475 0.4) (layers "F.Cu" "F.Paste" "F.Mask") (roundrect_rratio 0.25) (tstamp 1861493d-b6cf-4451-90e5-629c7267e585))
  (pad "27" smd roundrect (at 2.8625 -3.575) (size 1.475 0.4) (layers "F.Cu" "F.Paste" "F.Mask") (roundrect_rratio 0.25) (tstamp 891f0240-4b7f-459e-90ce-969f9d5a638d))
  (pad "28" smd roundrect (at 2.8625 -4.225) (size 1.475 0.4) (layers "F.Cu" "F.Paste" "F.Mask") (roundrect_rratio 0.25) (tstamp d24cb5f6-7484-4303-9b8d-a8bee47814e9))
  (model "${KIPRJMOD}/Alakart_KicadLib/3dModels/TSSOP-28_4.4x9.7mm_P0.65mm.wrl"
    (offset (xyz 0 0 0))
    (scale (xyz 1 1 1))
    (rotate (xyz 0 0 0))
  )
)
