(footprint "QFN-20-1EP_4x4mm_P0.5mm_EP2.5x2.5mm" (version 20221018) (generator pcbnew)
  (layer "F.Cu")
  (descr "QFN, 20 Pin (http://ww1.microchip.com/downloads/en/PackagingSpec/00000049BQ.pdf#page=274), generated with kicad-footprint-generator ipc_noLead_generator.py")
  (tags "QFN NoLead")
  (attr smd)
  (fp_text reference "REF**" (at 0 -3.3) (layer "F.SilkS")
      (effects (font (size 1 1) (thickness 0.15)))
    (tstamp f064b72d-0a53-4be0-9633-b01462617c7d)
  )
  (fp_text value "QFN-20-1EP_4x4mm_P0.5mm_EP2.5x2.5mm" (at 0 3.3) (layer "F.Fab")
      (effects (font (size 1 1) (thickness 0.15)))
    (tstamp 68b12868-7e2c-40ff-8c16-7b0051bb4d98)
  )
  (fp_text user "${REFERENCE}" (at 0 0) (layer "F.Fab")
      (effects (font (size 1 1) (thickness 0.15)))
    (tstamp efdb6d10-d6da-44ed-a2d2-08b155be442e)
  )
  (fp_line (start -2.11 2.11) (end -2.11 1.385)
    (stroke (width 0.12) (type solid)) (layer "F.SilkS") (tstamp 165ae081-71d8-4b71-8245-092b5b976022))
  (fp_line (start -1.385 -2.11) (end -2.11 -2.11)
    (stroke (width 0.12) (type solid)) (layer "F.SilkS") (tstamp 2459fc97-126a-4435-8f2b-a231e9b60716))
  (fp_line (start -1.385 2.11) (end -2.11 2.11)
    (stroke (width 0.12) (type solid)) (layer "F.SilkS") (tstamp fdd8702e-d52d-41f6-9988-34e50d3b4b68))
  (fp_line (start 1.385 -2.11) (end 2.11 -2.11)
    (stroke (width 0.12) (type solid)) (layer "F.SilkS") (tstamp bfda6fd2-1501-4835-806f-e0d56ada45a6))
  (fp_line (start 1.385 2.11) (end 2.11 2.11)
    (stroke (width 0.12) (type solid)) (layer "F.SilkS") (tstamp d0ed9591-5c9c-4b50-8c85-aa7fe4788642))
  (fp_line (start 2.11 -2.11) (end 2.11 -1.385)
    (stroke (width 0.12) (type solid)) (layer "F.SilkS") (tstamp 6c3e1959-cf5f-4fbc-9da1-770724285bcf))
  (fp_line (start 2.11 2.11) (end 2.11 1.385)
    (stroke (width 0.12) (type solid)) (layer "F.SilkS") (tstamp b4a33048-8932-4a20-b0f2-abe2a3ce3aef))
  (fp_line (start -2.6 -2.6) (end -2.6 2.6)
    (stroke (width 0.05) (type solid)) (layer "F.CrtYd") (tstamp f2f1a0c2-7d42-4a2c-8163-5a1785c8b17a))
  (fp_line (start -2.6 2.6) (end 2.6 2.6)
    (stroke (width 0.05) (type solid)) (layer "F.CrtYd") (tstamp ca63a1bf-0183-4de1-9ee9-efdfe277d9e0))
  (fp_line (start 2.6 -2.6) (end -2.6 -2.6)
    (stroke (width 0.05) (type solid)) (layer "F.CrtYd") (tstamp 185e701d-8acc-4ecf-8ee4-0584311ac51c))
  (fp_line (start 2.6 2.6) (end 2.6 -2.6)
    (stroke (width 0.05) (type solid)) (layer "F.CrtYd") (tstamp 08be8584-7d14-498e-b4ed-524622ad0cd0))
  (fp_line (start -2 -1) (end -1 -2)
    (stroke (width 0.1) (type solid)) (layer "F.Fab") (tstamp c7671ae6-a4f6-43ae-b177-d728f35015bb))
  (fp_line (start -2 2) (end -2 -1)
    (stroke (width 0.1) (type solid)) (layer "F.Fab") (tstamp 86f2379d-4696-4865-a432-1f9bc6e93e66))
  (fp_line (start -1 -2) (end 2 -2)
    (stroke (width 0.1) (type solid)) (layer "F.Fab") (tstamp aa384963-eaba-45d8-aec4-1392261d4331))
  (fp_line (start 2 -2) (end 2 2)
    (stroke (width 0.1) (type solid)) (layer "F.Fab") (tstamp dc7d41b1-17a1-44b3-9461-a10768cec89a))
  (fp_line (start 2 2) (end -2 2)
    (stroke (width 0.1) (type solid)) (layer "F.Fab") (tstamp 26ecb34f-f95a-449f-90e9-11ff77f86985))
  (pad "" smd roundrect (at -0.625 -0.625) (size 1.01 1.01) (layers "F.Paste") (roundrect_rratio 0.247525) (tstamp bce23594-3761-4fe9-b46e-0287ffb8b2ed))
  (pad "" smd roundrect (at -0.625 0.625) (size 1.01 1.01) (layers "F.Paste") (roundrect_rratio 0.247525) (tstamp d32f6d03-74b3-4f8b-aed7-4762b83d280d))
  (pad "" smd roundrect (at 0.625 -0.625) (size 1.01 1.01) (layers "F.Paste") (roundrect_rratio 0.247525) (tstamp 9dee6e5c-bc32-4592-a6d8-a2e5c5b8c263))
  (pad "" smd roundrect (at 0.625 0.625) (size 1.01 1.01) (layers "F.Paste") (roundrect_rratio 0.247525) (tstamp 96c71f7d-4838-4348-ab85-4c20a2189745))
  (pad "1" smd roundrect (at -1.9375 -1) (size 0.825 0.25) (layers "F.Cu" "F.Paste" "F.Mask") (roundrect_rratio 0.25) (tstamp 021af45b-457a-453e-bda2-26340c6d5e8c))
  (pad "2" smd roundrect (at -1.9375 -0.5) (size 0.825 0.25) (layers "F.Cu" "F.Paste" "F.Mask") (roundrect_rratio 0.25) (tstamp 1894398c-1972-40e5-8b6a-f95b12ce78f8))
  (pad "3" smd roundrect (at -1.9375 0) (size 0.825 0.25) (layers "F.Cu" "F.Paste" "F.Mask") (roundrect_rratio 0.25) (tstamp 574d17e8-b36a-41b3-8837-81a201a67333))
  (pad "4" smd roundrect (at -1.9375 0.5) (size 0.825 0.25) (layers "F.Cu" "F.Paste" "F.Mask") (roundrect_rratio 0.25) (tstamp d8cde5ff-ab55-4f9b-ae58-302b5fe0d4ba))
  (pad "5" smd roundrect (at -1.9375 1) (size 0.825 0.25) (layers "F.Cu" "F.Paste" "F.Mask") (roundrect_rratio 0.25) (tstamp 52419834-3fd9-4912-924b-0ef28b6d4e39))
  (pad "6" smd roundrect (at -1 1.9375) (size 0.25 0.825) (layers "F.Cu" "F.Paste" "F.Mask") (roundrect_rratio 0.25) (tstamp d65ec832-69dc-4027-927f-0ac020119a36))
  (pad "7" smd roundrect (at -0.5 1.9375) (size 0.25 0.825) (layers "F.Cu" "F.Paste" "F.Mask") (roundrect_rratio 0.25) (tstamp 6abed340-77b3-4deb-b301-1b832c12b57c))
  (pad "8" smd roundrect (at 0 1.9375) (size 0.25 0.825) (layers "F.Cu" "F.Paste" "F.Mask") (roundrect_rratio 0.25) (tstamp f6889839-3ed3-40b0-8fea-2e90735bdc08))
  (pad "9" smd roundrect (at 0.5 1.9375) (size 0.25 0.825) (layers "F.Cu" "F.Paste" "F.Mask") (roundrect_rratio 0.25) (tstamp e6885448-8713-4400-b152-df68de4bb7d0))
  (pad "10" smd roundrect (at 1 1.9375) (size 0.25 0.825) (layers "F.Cu" "F.Paste" "F.Mask") (roundrect_rratio 0.25) (tstamp 14468bdb-7f79-4a2a-912f-c9d55dbd8e88))
  (pad "11" smd roundrect (at 1.9375 1) (size 0.825 0.25) (layers "F.Cu" "F.Paste" "F.Mask") (roundrect_rratio 0.25) (tstamp 3d8a0e4d-0b93-4e1a-ab35-6827fe9c2859))
  (pad "12" smd roundrect (at 1.9375 0.5) (size 0.825 0.25) (layers "F.Cu" "F.Paste" "F.Mask") (roundrect_rratio 0.25) (tstamp 7ea074a7-0b55-480a-a5ec-f0c98e4c0972))
  (pad "13" smd roundrect (at 1.9375 0) (size 0.825 0.25) (layers "F.Cu" "F.Paste" "F.Mask") (roundrect_rratio 0.25) (tstamp 9575afb1-c8dc-492b-b7cb-43905b3674c0))
  (pad "14" smd roundrect (at 1.9375 -0.5) (size 0.825 0.25) (layers "F.Cu" "F.Paste" "F.Mask") (roundrect_rratio 0.25) (tstamp 038a6a28-d201-404b-8680-04e576943fd4))
  (pad "15" smd roundrect (at 1.9375 -1) (size 0.825 0.25) (layers "F.Cu" "F.Paste" "F.Mask") (roundrect_rratio 0.25) (tstamp d1bca13f-f274-4204-856a-6ad4b1e9233b))
  (pad "16" smd roundrect (at 1 -1.9375) (size 0.25 0.825) (layers "F.Cu" "F.Paste" "F.Mask") (roundrect_rratio 0.25) (tstamp 5c8b3074-e090-48a2-becd-98198a3e189e))
  (pad "17" smd roundrect (at 0.5 -1.9375) (size 0.25 0.825) (layers "F.Cu" "F.Paste" "F.Mask") (roundrect_rratio 0.25) (tstamp 36067ae0-f75f-4cbf-b772-801724e76eb8))
  (pad "18" smd roundrect (at 0 -1.9375) (size 0.25 0.825) (layers "F.Cu" "F.Paste" "F.Mask") (roundrect_rratio 0.25) (tstamp 13e90e88-2d86-4ac2-bfea-27a74156c4e7))
  (pad "19" smd roundrect (at -0.5 -1.9375) (size 0.25 0.825) (layers "F.Cu" "F.Paste" "F.Mask") (roundrect_rratio 0.25) (tstamp c765b340-5c36-4ba2-b770-0bcb768d32ff))
  (pad "20" smd roundrect (at -1 -1.9375) (size 0.25 0.825) (layers "F.Cu" "F.Paste" "F.Mask") (roundrect_rratio 0.25) (tstamp bbc33377-d522-4573-ab26-15f1f671d1f4))
  (pad "21" smd rect (at 0 0) (size 2.5 2.5) (layers "F.Cu" "F.Mask") (tstamp c9470caa-acad-4d13-abd5-fcfa4a92db34))
  (model "${KIPRJMOD}/Alakart_KicadLib/3dModels/FT231XQ-R--3DModel-STEP-56544.STEP"
    (offset (xyz 0 0 0))
    (scale (xyz 1 1 1))
    (rotate (xyz 90 180 0))
  )
)
