(footprint "L_0402_1005Metric" (version 20221018) (generator pcbnew)
  (layer "F.Cu")
  (descr "Inductor SMD 0402 (1005 Metric), square (rectangular) end terminal, IPC_7351 nominal, (Body size source: http://www.tortai-tech.com/upload/download/2011102023233369053.pdf), generated with kicad-footprint-generator")
  (tags "inductor")
  (attr smd)
  (fp_text reference "REF**" (at 0 -1.17) (layer "F.SilkS")
      (effects (font (size 1 1) (thickness 0.15)))
    (tstamp 5f7cfd23-ba30-4112-8e8a-084eff185daa)
  )
  (fp_text value "L_0402_1005Metric" (at 0 1.17) (layer "F.Fab")
      (effects (font (size 1 1) (thickness 0.15)))
    (tstamp 534be459-0d3a-4a4f-839c-04a21d8e5c28)
  )
  (fp_text user "${REFERENCE}" (at 0 0) (layer "F.Fab")
      (effects (font (size 0.25 0.25) (thickness 0.04)))
    (tstamp b97776cd-36ef-4231-b3ff-6fa6e7347e10)
  )
  (fp_line (start -0.93 -0.47) (end 0.93 -0.47)
    (stroke (width 0.05) (type solid)) (layer "F.CrtYd") (tstamp e3a32dcb-516f-4225-b080-19ec937fc237))
  (fp_line (start -0.93 0.47) (end -0.93 -0.47)
    (stroke (width 0.05) (type solid)) (layer "F.CrtYd") (tstamp 9d94b2cd-6f71-4c16-a91e-b6624ec3ec59))
  (fp_line (start 0.93 -0.47) (end 0.93 0.47)
    (stroke (width 0.05) (type solid)) (layer "F.CrtYd") (tstamp bca3e59d-5431-4c7a-8ad9-6534092cfb19))
  (fp_line (start 0.93 0.47) (end -0.93 0.47)
    (stroke (width 0.05) (type solid)) (layer "F.CrtYd") (tstamp 566f1185-9e95-45a6-81fd-2bdb7fd01107))
  (fp_line (start -0.5 -0.25) (end 0.5 -0.25)
    (stroke (width 0.1) (type solid)) (layer "F.Fab") (tstamp d23f18da-56cb-4a32-8eeb-17f5c58fe19e))
  (fp_line (start -0.5 0.25) (end -0.5 -0.25)
    (stroke (width 0.1) (type solid)) (layer "F.Fab") (tstamp c2bdec94-67eb-4cfc-b6c6-320f519b6a42))
  (fp_line (start 0.5 -0.25) (end 0.5 0.25)
    (stroke (width 0.1) (type solid)) (layer "F.Fab") (tstamp 8d273d34-e6cf-4e80-8fb2-08ad72f4400a))
  (fp_line (start 0.5 0.25) (end -0.5 0.25)
    (stroke (width 0.1) (type solid)) (layer "F.Fab") (tstamp a9cec81b-84c4-4c08-aaac-72770dc47137))
  (pad "1" smd roundrect (at -0.485 0) (size 0.59 0.64) (layers "F.Cu" "F.Paste" "F.Mask") (roundrect_rratio 0.25) (tstamp 8d57f103-1c4d-42b3-9a1c-788495c7aba4))
  (pad "2" smd roundrect (at 0.485 0) (size 0.59 0.64) (layers "F.Cu" "F.Paste" "F.Mask") (roundrect_rratio 0.25) (tstamp 5803ccd7-5f47-477b-995b-63712661ba11))
  (model "${KIPRJMOD}/Alakart_KicadLib/3dModels/L_0402_1005Metric.wrl"
    (offset (xyz 0 0 0))
    (scale (xyz 1 1 1))
    (rotate (xyz 0 0 0))
  )
)
