(footprint "L_1812_4532Metric" (version 20221018) (generator pcbnew)
  (layer "F.Cu")
  (descr "Inductor SMD 1812 (4532 Metric), square (rectangular) end terminal, IPC_7351 nominal, (Body size source: https://www.nikhef.nl/pub/departments/mt/projects/detectorR_D/dtddice/ERJ2G.pdf), generated with kicad-footprint-generator")
  (tags "inductor")
  (attr smd)
  (fp_text reference "REF**" (at 0 -2.65) (layer "F.SilkS")
      (effects (font (size 1 1) (thickness 0.15)))
    (tstamp 1a2198a3-9277-43dd-aa13-ebd2fb1a47bf)
  )
  (fp_text value "L_1812_4532Metric" (at 0 2.65) (layer "F.Fab")
      (effects (font (size 1 1) (thickness 0.15)))
    (tstamp 1d9cc89e-431c-481a-a386-255d804e3877)
  )
  (fp_text user "${REFERENCE}" (at 0 0) (layer "F.Fab")
      (effects (font (size 1 1) (thickness 0.15)))
    (tstamp 819224ff-0577-45a8-b036-e61578572ab1)
  )
  (fp_line (start -1.386252 -1.71) (end 1.386252 -1.71)
    (stroke (width 0.12) (type solid)) (layer "F.SilkS") (tstamp 699b3688-55af-4809-8013-2816862fc13d))
  (fp_line (start -1.386252 1.71) (end 1.386252 1.71)
    (stroke (width 0.12) (type solid)) (layer "F.SilkS") (tstamp 6139d088-203f-4a8e-88dc-dc4063e3e272))
  (fp_line (start -2.95 -1.95) (end 2.95 -1.95)
    (stroke (width 0.05) (type solid)) (layer "F.CrtYd") (tstamp 962ab2e8-8e7a-45ea-bec9-19685363c803))
  (fp_line (start -2.95 1.95) (end -2.95 -1.95)
    (stroke (width 0.05) (type solid)) (layer "F.CrtYd") (tstamp 9a929e92-c818-4646-932b-cf80f150fbea))
  (fp_line (start 2.95 -1.95) (end 2.95 1.95)
    (stroke (width 0.05) (type solid)) (layer "F.CrtYd") (tstamp c592311d-d171-4c0c-b27f-f7c551276550))
  (fp_line (start 2.95 1.95) (end -2.95 1.95)
    (stroke (width 0.05) (type solid)) (layer "F.CrtYd") (tstamp c6911dce-6890-49a3-8f03-77edf4a4bf98))
  (fp_line (start -2.25 -1.6) (end 2.25 -1.6)
    (stroke (width 0.1) (type solid)) (layer "F.Fab") (tstamp bbc8a7b9-9baa-401e-9fe0-fe0e1c39f822))
  (fp_line (start -2.25 1.6) (end -2.25 -1.6)
    (stroke (width 0.1) (type solid)) (layer "F.Fab") (tstamp a0efd553-54e8-4fca-afc3-562afa9892b3))
  (fp_line (start 2.25 -1.6) (end 2.25 1.6)
    (stroke (width 0.1) (type solid)) (layer "F.Fab") (tstamp 5ad58e21-b3bd-409e-aa31-8e6e29fafcb0))
  (fp_line (start 2.25 1.6) (end -2.25 1.6)
    (stroke (width 0.1) (type solid)) (layer "F.Fab") (tstamp a1cbcb38-560f-4ef4-9434-2ae9f41b735a))
  (pad "1" smd roundrect (at -2.1375 0) (size 1.125 3.4) (layers "F.Cu" "F.Paste" "F.Mask") (roundrect_rratio 0.222222) (tstamp 57161443-3309-427c-a3e7-dd340401e221))
  (pad "2" smd roundrect (at 2.1375 0) (size 1.125 3.4) (layers "F.Cu" "F.Paste" "F.Mask") (roundrect_rratio 0.222222) (tstamp 87a875e5-10ae-4cce-b94b-cdf513cdbbed))
  (model "${KIPRJMOD}/Alakart_KicadLib/3dModels/L_1812_4532Metric.wrl"
    (offset (xyz 0 0 0))
    (scale (xyz 1 1 1))
    (rotate (xyz 0 0 0))
  )
)
