(footprint "SOT-23" (version 20221018) (generator pcbnew)
  (layer "F.Cu")
  (descr "SOT, 3 Pin (https://www.jedec.org/system/files/docs/to-236h.pdf variant AB), generated with kicad-footprint-generator ipc_gullwing_generator.py")
  (tags "SOT TO_SOT_SMD")
  (attr smd)
  (fp_text reference "REF**" (at 0 -2.4) (layer "F.SilkS")
      (effects (font (size 1 1) (thickness 0.15)))
    (tstamp a789b715-a607-4e33-8841-9629668002af)
  )
  (fp_text value "SOT-23" (at 0 2.4) (layer "F.Fab")
      (effects (font (size 1 1) (thickness 0.15)))
    (tstamp 09c66217-272f-4cad-9179-550976bbecab)
  )
  (fp_text user "${REFERENCE}" (at 0 0) (layer "F.Fab")
      (effects (font (size 0.32 0.32) (thickness 0.05)))
    (tstamp 3e8cafd4-0309-47b4-8410-fac7b6171cdb)
  )
  (fp_line (start 0 -1.56) (end -1.675 -1.56)
    (stroke (width 0.12) (type solid)) (layer "F.SilkS") (tstamp 65913275-9e79-40a2-8d3f-355fe1bd6bd5))
  (fp_line (start 0 -1.56) (end 0.65 -1.56)
    (stroke (width 0.12) (type solid)) (layer "F.SilkS") (tstamp 383f734c-9dcf-41ef-bcb6-395310ea0841))
  (fp_line (start 0 1.56) (end -0.65 1.56)
    (stroke (width 0.12) (type solid)) (layer "F.SilkS") (tstamp a04fbb41-9bb9-455e-8724-b25329303184))
  (fp_line (start 0 1.56) (end 0.65 1.56)
    (stroke (width 0.12) (type solid)) (layer "F.SilkS") (tstamp 567a79db-12d6-49fb-bae6-d2ec8dd3e55a))
  (fp_line (start -1.92 -1.7) (end -1.92 1.7)
    (stroke (width 0.05) (type solid)) (layer "F.CrtYd") (tstamp f79f744d-af21-4861-97fd-0bf52c2d37da))
  (fp_line (start -1.92 1.7) (end 1.92 1.7)
    (stroke (width 0.05) (type solid)) (layer "F.CrtYd") (tstamp 16663d90-f6c2-4dd8-a534-260c198e97bf))
  (fp_line (start 1.92 -1.7) (end -1.92 -1.7)
    (stroke (width 0.05) (type solid)) (layer "F.CrtYd") (tstamp 462056b6-646f-402f-9139-07a56eb3eda5))
  (fp_line (start 1.92 1.7) (end 1.92 -1.7)
    (stroke (width 0.05) (type solid)) (layer "F.CrtYd") (tstamp e8598ab1-5816-464c-af7b-4aabbb49826b))
  (fp_line (start -0.65 -1.125) (end -0.325 -1.45)
    (stroke (width 0.1) (type solid)) (layer "F.Fab") (tstamp 870f472e-8d36-481b-aea6-6e543ac19292))
  (fp_line (start -0.65 1.45) (end -0.65 -1.125)
    (stroke (width 0.1) (type solid)) (layer "F.Fab") (tstamp 65d6b921-d298-4f30-9aa2-53fbfd9f0127))
  (fp_line (start -0.325 -1.45) (end 0.65 -1.45)
    (stroke (width 0.1) (type solid)) (layer "F.Fab") (tstamp cc96d31c-e9af-4b8f-a36c-1c99e1391fa5))
  (fp_line (start 0.65 -1.45) (end 0.65 1.45)
    (stroke (width 0.1) (type solid)) (layer "F.Fab") (tstamp 3d9a7400-09d2-4f64-9ea6-5b5b272de1bb))
  (fp_line (start 0.65 1.45) (end -0.65 1.45)
    (stroke (width 0.1) (type solid)) (layer "F.Fab") (tstamp 960759d9-294d-49cb-80d8-737278337712))
  (pad "1" smd roundrect (at -0.9375 -0.95) (size 1.475 0.6) (layers "F.Cu" "F.Paste" "F.Mask") (roundrect_rratio 0.25) (tstamp 81d9e34a-f8bf-4c3e-b270-b92cb8654702))
  (pad "2" smd roundrect (at -0.9375 0.95) (size 1.475 0.6) (layers "F.Cu" "F.Paste" "F.Mask") (roundrect_rratio 0.25) (tstamp 91b69a54-9edf-44a0-b463-b58b9d10d58f))
  (pad "3" smd roundrect (at 0.9375 0) (size 1.475 0.6) (layers "F.Cu" "F.Paste" "F.Mask") (roundrect_rratio 0.25) (tstamp 2cb16931-6c72-4466-bc5c-2507038e3f7e))
  (model "${KIPRJMOD}/Alakart_KicadLib/3dModels/SOT-23.step"
    (offset (xyz 0 0 0))
    (scale (xyz 1 1 1))
    (rotate (xyz 0 0 0))
  )
)
