(footprint "L_2010_5025Metric" (version 20221018) (generator pcbnew)
  (layer "F.Cu")
  (descr "Inductor SMD 2010 (5025 Metric), square (rectangular) end terminal, IPC_7351 nominal, (Body size source: http://www.tortai-tech.com/upload/download/2011102023233369053.pdf), generated with kicad-footprint-generator")
  (tags "inductor")
  (attr smd)
  (fp_text reference "REF**" (at 0 -2.28) (layer "F.SilkS")
      (effects (font (size 1 1) (thickness 0.15)))
    (tstamp e942f1dc-55b9-4a28-8969-81cc39855295)
  )
  (fp_text value "L_2010_5025Metric" (at 0 2.28) (layer "F.Fab")
      (effects (font (size 1 1) (thickness 0.15)))
    (tstamp 333242cc-6129-4e35-8293-93f2afc1e3c0)
  )
  (fp_text user "${REFERENCE}" (at 0 0) (layer "F.Fab")
      (effects (font (size 1 1) (thickness 0.15)))
    (tstamp 173ec1f4-c523-4213-87fb-0eaab8adf1e3)
  )
  (fp_line (start -1.402064 -1.36) (end 1.402064 -1.36)
    (stroke (width 0.12) (type solid)) (layer "F.SilkS") (tstamp 9db8fecb-0c24-4306-8a6e-e0b8394a5860))
  (fp_line (start -1.402064 1.36) (end 1.402064 1.36)
    (stroke (width 0.12) (type solid)) (layer "F.SilkS") (tstamp e6a83c5f-5300-4d85-add6-d35d236acb08))
  (fp_line (start -3.18 -1.58) (end 3.18 -1.58)
    (stroke (width 0.05) (type solid)) (layer "F.CrtYd") (tstamp 08c6d5a5-ef17-4bff-84f2-8cd62f5dca45))
  (fp_line (start -3.18 1.58) (end -3.18 -1.58)
    (stroke (width 0.05) (type solid)) (layer "F.CrtYd") (tstamp 68feb493-c7d1-4fb9-837c-b294d2bf89b5))
  (fp_line (start 3.18 -1.58) (end 3.18 1.58)
    (stroke (width 0.05) (type solid)) (layer "F.CrtYd") (tstamp d48e8a1f-28d9-4516-97ad-8c9631520d71))
  (fp_line (start 3.18 1.58) (end -3.18 1.58)
    (stroke (width 0.05) (type solid)) (layer "F.CrtYd") (tstamp e1a40f95-fe79-4908-9fb2-c0d1cad62cce))
  (fp_line (start -2.5 -1.25) (end 2.5 -1.25)
    (stroke (width 0.1) (type solid)) (layer "F.Fab") (tstamp 023de8f0-722d-4914-a460-ea290843ca57))
  (fp_line (start -2.5 1.25) (end -2.5 -1.25)
    (stroke (width 0.1) (type solid)) (layer "F.Fab") (tstamp ad38b39f-49d0-4e50-b62d-dcf4b0925d4c))
  (fp_line (start 2.5 -1.25) (end 2.5 1.25)
    (stroke (width 0.1) (type solid)) (layer "F.Fab") (tstamp f20e5dfa-a84e-4e32-b07d-2d65a8527760))
  (fp_line (start 2.5 1.25) (end -2.5 1.25)
    (stroke (width 0.1) (type solid)) (layer "F.Fab") (tstamp 819bd602-bb6a-468f-b0fb-1a79a24cb45c))
  (pad "1" smd roundrect (at -2.25 0) (size 1.35 2.65) (layers "F.Cu" "F.Paste" "F.Mask") (roundrect_rratio 0.185185) (tstamp 37b3f931-f51f-4cba-a1b7-4fcac0e8db72))
  (pad "2" smd roundrect (at 2.25 0) (size 1.35 2.65) (layers "F.Cu" "F.Paste" "F.Mask") (roundrect_rratio 0.185185) (tstamp 44b83255-f441-4222-a6c0-48943ea64444))
  (model "${KIPRJMOD}/Alakart_KicadLib/3dModels/L_2010_5025Metric.wrl"
    (offset (xyz 0 0 0))
    (scale (xyz 1 1 1))
    (rotate (xyz 0 0 0))
  )
)
