(footprint "TestPoint_THTPad_1.0x1.0mm_Drill0.5mm" (version 20221018) (generator pcbnew)
  (layer "F.Cu")
  (descr "THT rectangular pad as test Point, square 1.0mm side length, hole diameter 0.5mm")
  (tags "test point THT pad rectangle square")
  (attr exclude_from_pos_files exclude_from_bom)
  (fp_text reference "REF**" (at 0 -1.448) (layer "F.SilkS")
      (effects (font (size 1 1) (thickness 0.15)))
    (tstamp c8a252c6-0b48-4d43-9b5d-9fca8d57001c)
  )
  (fp_text value "TestPoint_THTPad_1.0x1.0mm_Drill0.5mm" (at 0 1.55) (layer "F.Fab")
      (effects (font (size 1 1) (thickness 0.15)))
    (tstamp c0466e39-f1c3-486b-883f-0a30c7103420)
  )
  (fp_text user "${REFERENCE}" (at 0 -1.45) (layer "F.Fab")
      (effects (font (size 1 1) (thickness 0.15)))
    (tstamp 69ab2fba-3dfb-4c81-92b7-171a27f429f1)
  )
  (fp_line (start -1 -1) (end -1 1)
    (stroke (width 0.05) (type solid)) (layer "F.CrtYd") (tstamp f75828b7-375a-422b-94a5-5ed3db8a3cbf))
  (fp_line (start -1 -1) (end 1 -1)
    (stroke (width 0.05) (type solid)) (layer "F.CrtYd") (tstamp a6420d67-a586-4118-a65b-b65759fcf13f))
  (fp_line (start 1 1) (end -1 1)
    (stroke (width 0.05) (type solid)) (layer "F.CrtYd") (tstamp bf5bb7a6-0115-4723-be6d-243b9dce747f))
  (fp_line (start 1 1) (end 1 -1)
    (stroke (width 0.05) (type solid)) (layer "F.CrtYd") (tstamp d7e377b4-af0b-4ead-8da2-a968f60f5a10))
  (pad "1" thru_hole oval (at 0 0) (size 1.2 1.2) (drill 0.7) (layers "*.Cu" "*.Mask") (tstamp a7db0445-5907-4c33-b453-1bc5a8ee576a))
)
