(footprint "R_1206_3216Metric" (version 20221018) (generator pcbnew)
  (layer "F.Cu")
  (descr "Resistor SMD 1206 (3216 Metric), square (rectangular) end terminal, IPC_7351 nominal, (Body size source: IPC-SM-782 page 72, https://www.pcb-3d.com/wordpress/wp-content/uploads/ipc-sm-782a_amendment_1_and_2.pdf)")
  (tags "resistor")
  (attr smd)
  (fp_text reference "REF**" (at 0 -1.82) (layer "F.SilkS")
      (effects (font (size 1 1) (thickness 0.15)))
    (tstamp aa958b8d-703c-4d5d-8a6f-8094603b30c9)
  )
  (fp_text value "R_1206_3216Metric" (at 0 1.82) (layer "F.Fab")
      (effects (font (size 1 1) (thickness 0.15)))
    (tstamp 7f57f535-4bc6-49c8-ad8e-3a5728fedc49)
  )
  (fp_text user "${REFERENCE}" (at 0 0) (layer "F.Fab")
      (effects (font (size 0.8 0.8) (thickness 0.12)))
    (tstamp f76b5b71-f784-4fa2-a423-99e4954ebe12)
  )
  (fp_line (start -0.727064 -0.91) (end 0.727064 -0.91)
    (stroke (width 0.12) (type solid)) (layer "F.SilkS") (tstamp 695ab2dc-dc7f-43d4-a19a-9031231c4718))
  (fp_line (start -0.727064 0.91) (end 0.727064 0.91)
    (stroke (width 0.12) (type solid)) (layer "F.SilkS") (tstamp 197ad961-e783-46ae-b85d-b96c97d73ba5))
  (fp_line (start -2.28 -1.12) (end 2.28 -1.12)
    (stroke (width 0.05) (type solid)) (layer "F.CrtYd") (tstamp cdd7bd4e-fde4-467f-8aab-baffad35a5ba))
  (fp_line (start -2.28 1.12) (end -2.28 -1.12)
    (stroke (width 0.05) (type solid)) (layer "F.CrtYd") (tstamp ffa65f00-c734-4cae-94c3-ba27d56d3dea))
  (fp_line (start 2.28 -1.12) (end 2.28 1.12)
    (stroke (width 0.05) (type solid)) (layer "F.CrtYd") (tstamp d2e3a7ca-d542-4b47-8aa5-8d75c3ca8ff8))
  (fp_line (start 2.28 1.12) (end -2.28 1.12)
    (stroke (width 0.05) (type solid)) (layer "F.CrtYd") (tstamp ae4d2615-4dd2-4203-9d9d-5dc6b69cf615))
  (fp_line (start -1.6 -0.8) (end 1.6 -0.8)
    (stroke (width 0.1) (type solid)) (layer "F.Fab") (tstamp ac36ef75-5354-48e4-b14c-eef00e40520a))
  (fp_line (start -1.6 0.8) (end -1.6 -0.8)
    (stroke (width 0.1) (type solid)) (layer "F.Fab") (tstamp 1a265bb0-b48f-4410-8314-4bd048e3a08b))
  (fp_line (start 1.6 -0.8) (end 1.6 0.8)
    (stroke (width 0.1) (type solid)) (layer "F.Fab") (tstamp 336eda3b-f501-4677-acc4-283821f678e8))
  (fp_line (start 1.6 0.8) (end -1.6 0.8)
    (stroke (width 0.1) (type solid)) (layer "F.Fab") (tstamp b0e1320a-4c9f-433e-80bc-5c6a7124ebad))
  (pad "1" smd roundrect (at -1.4625 0) (size 1.125 1.75) (layers "F.Cu" "F.Paste" "F.Mask") (roundrect_rratio 0.222222) (tstamp dbad0287-b397-45bd-8a16-43e87bdf7c5c))
  (pad "2" smd roundrect (at 1.4625 0) (size 1.125 1.75) (layers "F.Cu" "F.Paste" "F.Mask") (roundrect_rratio 0.222222) (tstamp 0f7c8c85-86aa-4632-9ea9-d90a66b5867e))
  (model "${KIPRJMOD}/Alakart_KicadLib/3dModels/R_1206_3216Metric.wrl"
    (offset (xyz 0 0 0))
    (scale (xyz 1 1 1))
    (rotate (xyz 0 0 0))
  )
)
