{
    "container",

    "articleWrapper": [
        "max-w-screen-sm",
        "max-w-screen-md",
        "max-w-screen-lg",
        "max-w-screen-xl",
        "max-w-full"
    ],

    "backgroundColor": [
        "bg-light",
        "bg-dark",
        "bg-primary",
        "bg-accent"
    ]
}
