<?xml version="1.0" encoding="utf-8"?>
<!-- Generator: Adobe Illustrator 26.0.3, SVG Export Plug-In . SVG Version: 6.00 Build 0)  -->
<svg version="1.1" id="Layer_1" xmlns="http://www.w3.org/2000/svg" xmlns:xlink="http://www.w3.org/1999/xlink" x="0px" y="0px"
	 viewBox="0 0 56 48" style="enable-background:new 0 0 56 48;" xml:space="preserve">
<style type="text/css">
	.st0{fill:#0665D0;}
	.st1{fill:#FFFFFF;}
</style>
<rect class="st0" width="56" height="48"/>
<path class="st1" d="M17.1,34.2c0,1.3,1,2.3,2.3,2.3h17.2c1.3,0,2.3-1,2.3-2.3V20.9H17.1V34.2z M32.7,24.6c0-0.3,0.3-0.6,0.6-0.6h2
	c0.3,0,0.6,0.3,0.6,0.6v2c0,0.3-0.3,0.6-0.6,0.6h-2c-0.3,0-0.6-0.3-0.6-0.6V24.6z M32.7,30.8c0-0.3,0.3-0.6,0.6-0.6h2
	c0.3,0,0.6,0.3,0.6,0.6v2c0,0.3-0.3,0.6-0.6,0.6h-2c-0.3,0-0.6-0.3-0.6-0.6V30.8z M26.4,24.6c0-0.3,0.3-0.6,0.6-0.6h2
	c0.3,0,0.6,0.3,0.6,0.6v2c0,0.3-0.3,0.6-0.6,0.6h-2c-0.3,0-0.6-0.3-0.6-0.6V24.6z M26.4,30.8c0-0.3,0.3-0.6,0.6-0.6h2
	c0.3,0,0.6,0.3,0.6,0.6v2c0,0.3-0.3,0.6-0.6,0.6h-2c-0.3,0-0.6-0.3-0.6-0.6V30.8z M20.2,24.6c0-0.3,0.3-0.6,0.6-0.6h2
	c0.3,0,0.6,0.3,0.6,0.6v2c0,0.3-0.3,0.6-0.6,0.6h-2c-0.3,0-0.6-0.3-0.6-0.6V24.6z M20.2,30.8c0-0.3,0.3-0.6,0.6-0.6h2
	c0.3,0,0.6,0.3,0.6,0.6v2c0,0.3-0.3,0.6-0.6,0.6h-2c-0.3,0-0.6-0.3-0.6-0.6V30.8z M36.6,14.6h-2.3v-2.3c0-0.4-0.4-0.8-0.8-0.8h-1.6
	c-0.4,0-0.8,0.4-0.8,0.8v2.3h-6.2v-2.3c0-0.4-0.4-0.8-0.8-0.8h-1.6c-0.4,0-0.8,0.4-0.8,0.8v2.3h-2.3c-1.3,0-2.3,1-2.3,2.3v2.3h21.9
	V17C38.9,15.7,37.9,14.6,36.6,14.6z"/>
</svg>
