<?xml version="1.0" encoding="utf-8"?>
<!-- Generator: Adobe Illustrator 26.0.3, SVG Export Plug-In . SVG Version: 6.00 Build 0)  -->
<svg version="1.1" id="Layer_1" xmlns="http://www.w3.org/2000/svg" xmlns:xlink="http://www.w3.org/1999/xlink" x="0px" y="0px"
	 viewBox="0 0 56 48" style="enable-background:new 0 0 56 48;" xml:space="preserve">
<style type="text/css">
	.st0{fill:#0665D0;}
	.st1{fill:#FFFFFF;}
</style>
<rect class="st0" width="56" height="48"/>
<path class="st1" d="M28,11.5c-6.9,0-12.5,5.6-12.5,12.5S21.1,36.5,28,36.5S40.5,30.9,40.5,24S34.9,11.5,28,11.5z M28.8,25.1
	c0,0.5-0.4,0.8-0.8,0.8h-5.8c-0.5,0-0.8-0.4-0.8-0.8c0-0.5,0.4-0.8,0.8-0.8h4.9v-7.9c0-0.5,0.4-0.8,0.8-0.8c0.5,0,0.8,0.4,0.8,0.8
	L28.8,25.1z"/>
</svg>
