%YAML 1.1
%TAG !u! tag:unity3d.com,2011:
--- !u!114 &11400000
MonoBehaviour:
  m_ObjectHideFlags: 0
  m_CorrespondingSourceObject: {fileID: 0}
  m_PrefabInstance: {fileID: 0}
  m_PrefabAsset: {fileID: 0}
  m_GameObject: {fileID: 0}
  m_Enabled: 1
  m_EditorHideFlags: 0
  m_Script: {fileID: 11500000, guid: 68286ce34977f8d4983dd0cae99ab780, type: 3}
  m_Name: Peach
  m_EditorClassIdentifier: 
  Fname: 4
  Artwork: {fileID: 21300000, guid: 848fa5663d60047f79a9b118936f4ee0, type: 3}
  GrowTimer: 5
  waterReserve: 0
