[
  {
    "table": "tableJS1",
    "data": [
      [
        "Abricot",
        0.0001,
        0.0001,
        0.0001,
        0.0001,
        1.5,
        0.0001,
        0.0001,
        0.0001,
        50.0,
        0.0001,
        0.0001,
        0.0001,
        0.0001,
        0.0001,
        0.0001,
        0.0001,
        0.0001,
        0.0001,
        0.0001,
        0.4,
        0.0001,
        0.0001,
        0.0001,
        11.7,
        0.0001,
        0.0001,
        0.0001,
        2.1
      ],
      [
        "Ac\u00e9rola",
        0.0001,
        0.0001,
        0.0001,
        0.0001,
        0.4,
        0.0001,
        0.0001,
        0.0001,
        32.0,
        1677.0,
        0.0001,
        0.0001,
        0.0001,
        0.0001,
        0.0001,
        0.0001,
        2055.56,
        1.1,
        0.0001,
        0.3,
        0.0001,
        0.0001,
        0.0001,
        7.6,
        0.0001,
        0.0001,
        0.0001,
        0.0001
      ],
      [
        "Airelles",
        90.7,
        0.0001,
        0.0001,
        0.0001,
        0.4,
        0.0001,
        20.0,
        0.0001,
        0.0001,
        8.0,
        320.0,
        0.0001,
        0.0001,
        0.0001,
        0.0001,
        0.0001,
        0.0001,
        2.0,
        0.0001,
        0.1,
        0.0001,
        0.0001,
        56.0,
        8.7,
        0.0001,
        104.5,
        0.0001,
        0.0001
      ],
      [
        "Ananas",
        86.5,
        0.0001,
        0.0001,
        0.0001,
        0.4,
        0.0001,
        15.0,
        11.0,
        0.0001,
        18.0,
        146.0,
        0.0001,
        0.08,
        0.0001,
        0.0001,
        0.0001,
        0.0001,
        1.2,
        0.0001,
        0.2,
        0.0001,
        0.09,
        0.0001,
        11.3,
        0.0001,
        0.0001,
        0.0001,
        0.0001
      ],
      [
        "Argousier",
        0.0001,
        0.0001,
        0.0001,
        0.0001,
        0.9,
        0.0001,
        0.0001,
        0.0001,
        52.0,
        400.0,
        0.0001,
        0.0001,
        0.0001,
        0.0001,
        0.0001,
        0.0001,
        0.0001,
        4.7,
        0.0001,
        2.5,
        0.0001,
        0.0001,
        0.0001,
        10.2,
        0.0001,
        0.0001,
        0.0001,
        0.0001
      ],
      [
        "Artichaut",
        0.0001,
        0.0001,
        0.0001,
        0.0001,
        3.5,
        0.0001,
        0.0001,
        0.0001,
        64.0,
        0.0001,
        0.0001,
        0.0001,
        0.0001,
        0.0001,
        0.0001,
        0.0001,
        0.0001,
        0.0001,
        0.0001,
        0.4,
        0.0001,
        0.0001,
        0.0001,
        14.3,
        0.0001,
        0.0001,
        0.0001,
        4.7
      ],
      [
        "Asperge",
        0.0001,
        0.0001,
        0.0001,
        0.0001,
        2.2,
        0.0001,
        0.0001,
        0.0001,
        20.0,
        0.0001,
        0.0001,
        0.0001,
        0.0001,
        0.0001,
        0.0001,
        0.0001,
        0.0001,
        0.0001,
        0.0001,
        0.2,
        0.0001,
        0.0001,
        0.0001,
        3.7,
        0.0001,
        0.0001,
        0.0001,
        1.8
      ],
      [
        "Aubergine",
        89.7,
        0.0001,
        0.0001,
        0.0001,
        1.23,
        0.0001,
        15.0,
        15.0,
        0.0001,
        1.3,
        123.0,
        0.0001,
        0.076,
        0.0001,
        0.0001,
        0.0001,
        0.0001,
        4.3,
        0.0001,
        0.28,
        0.0001,
        0.086,
        0.0001,
        4.17,
        0.0001,
        0.0001,
        0.0001,
        0.0001
      ],
      [
        "Avocat",
        76.4,
        0.0001,
        0.0001,
        0.0001,
        1.8,
        185.0,
        33.0,
        44.0,
        0.0001,
        0.0001,
        0.0001,
        0.0001,
        0.0001,
        0.0001,
        0.0001,
        0.0001,
        0.0001,
        5.1,
        54.0,
        15.0,
        0.0001,
        0.28,
        0.0001,
        0.8,
        0.0001,
        0.0001,
        1.0,
        0.0001
      ],
      [
        "Baie de goji",
        2.1,
        0.0001,
        0.0001,
        0.0001,
        4.0,
        0.0001,
        0.0001,
        0.0001,
        98.0,
        13.6,
        0.0001,
        0.0001,
        0.0001,
        0.0001,
        0.0001,
        0.0001,
        2255.0,
        0.0001,
        0.0001,
        0.1,
        0.0001,
        0.0001,
        53.0,
        21.6,
        0.0001,
        0.0001,
        1.9,
        3.6
      ],
      [
        "Banane",
        0.0001,
        0.0001,
        0.0001,
        0.0001,
        1.3,
        0.0001,
        0.0001,
        0.0001,
        105.0,
        0.0001,
        0.0001,
        0.0001,
        0.0001,
        0.0001,
        0.0001,
        0.0001,
        0.0001,
        0.0001,
        0.0001,
        0.4,
        0.0001,
        0.0001,
        0.0001,
        27.0,
        0.0001,
        0.0001,
        0.0001,
        2.1
      ],
      [
        "Bette \u00e0 carde",
        0.0001,
        0.0001,
        0.0001,
        0.0001,
        0.7,
        0.0001,
        0.0001,
        0.0001,
        7.0,
        0.0001,
        0.0001,
        0.0001,
        0.0001,
        0.0001,
        0.0001,
        0.0001,
        0.0001,
        0.0001,
        0.0001,
        0.1,
        0.0001,
        0.0001,
        0.0001,
        1.4,
        0.0001,
        0.0001,
        0.0001,
        0.6
      ],
      [
        "Betterave",
        0.0001,
        0.0001,
        0.0001,
        0.0001,
        1.2,
        0.0001,
        0.0001,
        0.0001,
        31.0,
        0.0001,
        0.0001,
        0.0001,
        0.0001,
        0.0001,
        0.0001,
        0.0001,
        0.0001,
        0.0001,
        0.0001,
        0.1,
        0.0001,
        0.0001,
        0.0001,
        6.9,
        0.0001,
        0.0001,
        0.0001,
        1.4
      ],
      [
        "Brocoli",
        0.0001,
        0.0001,
        0.0001,
        0.0001,
        1.3,
        0.0001,
        0.0001,
        0.0001,
        16.0,
        0.0001,
        0.0001,
        0.0001,
        0.0001,
        0.0001,
        0.0001,
        0.0001,
        0.0001,
        0.0001,
        0.0001,
        0.2,
        0.0001,
        0.0001,
        0.0001,
        3.1,
        0.0001,
        0.0001,
        0.0001,
        1.1
      ],
      [
        "Brugnon",
        86.8,
        0.0001,
        0.0001,
        0.0001,
        1.16,
        150.0,
        0.0001,
        0.0001,
        0.0001,
        5.4,
        0.0001,
        0.0001,
        0.0001,
        0.0001,
        0.0001,
        0.0001,
        0.0001,
        0.0001,
        0.0001,
        0.31,
        0.0001,
        0.0001,
        0.0001,
        8.9,
        0.0001,
        226.5,
        0.0001,
        0.0001
      ],
      [
        "Canneberge",
        0.0001,
        0.0001,
        0.0001,
        0.0001,
        0.2,
        0.0001,
        0.0001,
        0.0001,
        23.0,
        0.0001,
        0.0001,
        0.0001,
        0.0001,
        0.0001,
        0.0001,
        0.0001,
        0.0001,
        0.0001,
        0.0001,
        0.1,
        0.0001,
        0.0001,
        0.0001,
        6.1,
        0.0001,
        0.0001,
        0.0001,
        2.3
      ],
      [
        "Carambole",
        90.5,
        0.0001,
        0.0001,
        0.0001,
        1.25,
        0.0001,
        0.0001,
        0.0001,
        0.0001,
        45.8,
        0.0001,
        0.0001,
        0.049,
        0.24,
        0.0001,
        0.0001,
        0.0001,
        2.3,
        77.0,
        0.2,
        0.0001,
        0.16,
        0.0001,
        4.25,
        0.0001,
        0.0001,
        0.31,
        0.0001
      ],
      [
        "Carotte",
        91.3,
        0.0001,
        0.0001,
        0.0001,
        1.15,
        25.0,
        10.0,
        12.0,
        0.0001,
        34.4,
        133.0,
        0.0001,
        0.0001,
        0.0001,
        0.0001,
        0.0001,
        0.0001,
        0.0001,
        0.0001,
        0.32,
        0.0001,
        0.0001,
        0.0001,
        3.9,
        0.39,
        114.1,
        0.0001,
        0.0001
      ],
      [
        "Cassis",
        94.9,
        80.0,
        0.0001,
        0.0001,
        1.07,
        0.0001,
        0.0001,
        0.0001,
        0.0001,
        26.0,
        144.0,
        0.0001,
        0.0001,
        0.0001,
        0.0001,
        0.0001,
        71.0,
        1.9,
        0.0001,
        0.3,
        0.0001,
        0.0001,
        40.0,
        1.24,
        0.0001,
        0.0001,
        0.6,
        0.0001
      ],
      [
        "Chou chinois",
        0.0001,
        0.0001,
        0.0001,
        0.0001,
        0.7,
        0.0001,
        0.0001,
        0.0001,
        30.0,
        0.0001,
        0.0001,
        0.0001,
        0.0001,
        0.0001,
        0.0001,
        0.0001,
        0.0001,
        0.0001,
        0.0001,
        0.2,
        0.0001,
        0.0001,
        0.0001,
        6.9,
        0.0001,
        0.0001,
        0.0001,
        1.8
      ],
      [
        "Chou fris\u00e9",
        85.1,
        591.0,
        0.0001,
        0.0001,
        4.33,
        5930.0,
        0.0001,
        0.0001,
        0.0001,
        145.0,
        489.0,
        0.0001,
        0.0001,
        0.0001,
        0.0001,
        3.47,
        0.0001,
        4.9,
        101.0,
        1.07,
        0.0001,
        0.0001,
        185.0,
        4.2,
        0.0001,
        224.0,
        1.29,
        0.0001
      ],
      [
        "Chou-rave",
        82.0,
        0.0001,
        0.0001,
        0.0001,
        1.4,
        0.0001,
        0.0001,
        0.0001,
        64.0,
        181.0,
        322.0,
        0.0001,
        0.0001,
        0.0001,
        0.0001,
        0.0001,
        0.0001,
        0.0001,
        0.0001,
        0.4,
        0.0001,
        0.0001,
        0.0001,
        15.0,
        0.0001,
        0.0001,
        0.0001,
        5.4
      ],
      [
        "Chou",
        91.0,
        0.0001,
        0.0001,
        0.0001,
        1.7,
        22.0,
        0.0001,
        46.0,
        0.0001,
        62.0,
        350.0,
        0.0001,
        0.0001,
        0.0001,
        0.0001,
        0.0001,
        0.0001,
        3.6,
        16.0,
        0.1,
        0.0001,
        0.0001,
        24.0,
        2.6,
        0.0001,
        0.0001,
        0.0001,
        0.0001
      ],
      [
        "Choux de Bruxelles",
        0.0001,
        0.0001,
        0.0001,
        0.0001,
        0.3,
        0.0001,
        0.0001,
        0.0001,
        6.0,
        0.0001,
        0.0001,
        0.0001,
        0.0001,
        0.0001,
        0.0001,
        0.0001,
        0.0001,
        0.0001,
        0.0001,
        0.1,
        0.0001,
        0.0001,
        0.0001,
        1.2,
        0.0001,
        0.0001,
        0.0001,
        0.6
      ],
      [
        "Citrouille",
        87.6,
        0.0001,
        0.0001,
        0.0001,
        2.6,
        0.0001,
        18.0,
        0.0001,
        0.0001,
        60.0,
        298.0,
        0.0001,
        0.0001,
        0.0001,
        0.0001,
        0.0001,
        0.0001,
        4.6,
        87.0,
        0.5,
        0.0001,
        0.14,
        27.0,
        2.8,
        0.0001,
        0.0001,
        0.0001,
        0.0001
      ],
      [
        "Cl\u00e9mentine",
        91.0,
        0.0001,
        0.0001,
        0.0001,
        1.1,
        0.0001,
        8.0,
        44.0,
        0.0001,
        12.0,
        0.0001,
        0.0001,
        0.05,
        0.0001,
        0.0001,
        1.1,
        128.0,
        2.16,
        0.0001,
        0.13,
        0.0001,
        0.0001,
        0.0001,
        4.59,
        0.0001,
        0.0001,
        0.0001,
        0.0001
      ],
      [
        "Coing",
        86.6,
        0.0001,
        0.0001,
        0.035,
        0.8,
        0.0001,
        0.0001,
        0.0001,
        0.0001,
        18.7,
        147.0,
        0.0001,
        0.09,
        0.0001,
        0.0001,
        0.0001,
        0.0001,
        1.7,
        0.0001,
        0.19,
        0.15,
        0.05,
        0.0001,
        11.9,
        0.0001,
        0.0001,
        0.0001,
        0.0001
      ],
      [
        "Combava",
        83.5,
        0.0001,
        0.0001,
        0.13,
        0.48,
        0.0001,
        8.0,
        0.0001,
        0.0001,
        15.0,
        197.0,
        0.0001,
        0.0001,
        0.0001,
        0.0001,
        0.0001,
        0.0001,
        1.9,
        3.0,
        0.1,
        0.0001,
        0.0001,
        11.0,
        13.4,
        0.0001,
        0.0001,
        0.0001,
        0.0001
      ],
      [
        "Concombre et Cornichon",
        90.8,
        0.0001,
        0.0001,
        0.0001,
        1.0,
        20.5,
        11.5,
        0.0001,
        0.0001,
        43.0,
        152.0,
        0.0001,
        0.0001,
        0.0001,
        0.0001,
        0.0001,
        0.0001,
        0.0,
        0.0001,
        0.5,
        0.0001,
        0.0001,
        23.0,
        6.6,
        0.0001,
        0.0001,
        0.6,
        0.0001
      ],
      [
        "Courges",
        96.0,
        0.0001,
        4.8,
        0.0001,
        0.64,
        45.0,
        0.0001,
        24.7,
        0.0001,
        8.25,
        157.0,
        0.0001,
        0.0001,
        0.0001,
        0.0001,
        0.0001,
        0.0001,
        0.6,
        0.0001,
        0.11,
        0.0001,
        0.0001,
        19.2,
        2.04,
        0.0001,
        0.0001,
        0.0001,
        0.0001
      ],
      [
        "Courgette",
        86.41,
        0.0001,
        0.0001,
        0.07,
        1.0,
        0.0001,
        0.0001,
        0.0001,
        0.0001,
        21.0,
        0.0001,
        0.02,
        0.0001,
        0.0001,
        0.0001,
        0.0001,
        4226.0,
        1.46,
        0.0001,
        0.1,
        0.0001,
        0.15,
        0.0001,
        10.23,
        0.0001,
        0.0001,
        0.7,
        0.0001
      ],
      [
        "C\u00e9leri",
        94.7,
        0.0001,
        0.0001,
        0.0001,
        0.6,
        210.0,
        0.0001,
        0.0001,
        0.0001,
        6.0,
        170.0,
        0.04,
        0.0001,
        0.0001,
        0.0001,
        0.0001,
        0.0001,
        0.9,
        0.0001,
        0.1,
        0.0001,
        0.07,
        0.0001,
        2.5,
        0.0001,
        0.0001,
        0.3,
        0.0001
      ],
      [
        "Datte",
        0.0001,
        0.0001,
        0.0001,
        0.0001,
        0.6,
        0.0001,
        0.0001,
        0.0001,
        70.0,
        0.0001,
        0.0001,
        0.0001,
        0.0001,
        0.0001,
        0.0001,
        0.0001,
        0.0001,
        0.0001,
        0.0001,
        0.1,
        0.0001,
        0.0001,
        0.0001,
        18.7,
        0.0001,
        0.0001,
        0.0001,
        2.0
      ],
      [
        "Endive",
        0.0001,
        0.0001,
        0.0001,
        0.0001,
        0.4,
        0.0001,
        0.0001,
        0.0001,
        8.0,
        0.0001,
        0.0001,
        0.0001,
        0.0001,
        0.0001,
        0.0001,
        0.0001,
        0.0001,
        0.0001,
        0.0001,
        0.1,
        0.0001,
        0.0001,
        0.0001,
        1.9,
        0.0001,
        0.0001,
        0.0001,
        1.5
      ],
      [
        "Epinards",
        0.0001,
        0.0001,
        0.0001,
        0.0001,
        0.9,
        0.0001,
        0.0001,
        0.0001,
        7.0,
        0.0001,
        0.0001,
        0.0001,
        0.0001,
        0.0001,
        0.0001,
        0.0001,
        0.0001,
        0.0001,
        0.0001,
        0.1,
        0.0001,
        0.0001,
        0.0001,
        1.2,
        0.0001,
        0.0001,
        0.0001,
        0.7
      ],
      [
        "Fenouil",
        93.0,
        0.0001,
        0.0001,
        0.0001,
        0.9,
        12.0,
        0.0001,
        26.0,
        0.0001,
        5.0,
        440.0,
        0.0001,
        0.0001,
        0.0001,
        0.0001,
        0.0001,
        0.0001,
        1.9,
        47.5,
        0.2,
        0.0001,
        0.0001,
        24.0,
        3.01,
        0.0001,
        0.0001,
        0.0001,
        0.0001
      ],
      [
        "Figue",
        0.0001,
        0.0001,
        0.0001,
        0.0001,
        0.8,
        0.0001,
        0.0001,
        0.0001,
        74.0,
        0.0001,
        0.0001,
        0.0001,
        0.0001,
        0.0001,
        0.0001,
        0.0001,
        0.0001,
        0.0001,
        0.0001,
        0.3,
        0.0001,
        0.0001,
        0.0001,
        19.2,
        0.0001,
        0.0001,
        0.0001,
        2.9
      ],
      [
        "Fraise",
        89.9,
        0.0001,
        0.0001,
        0.0001,
        0.7,
        0.0001,
        12.0,
        0.0001,
        0.0001,
        60.0,
        152.0,
        0.0001,
        0.0001,
        0.3,
        0.0001,
        0.0001,
        0.0001,
        2.0,
        62.0,
        0.4,
        0.0001,
        0.0001,
        20.0,
        7.0,
        0.0001,
        0.0001,
        0.0001,
        0.0001
      ],
      [
        "Framboise",
        0.0001,
        0.0001,
        0.0001,
        0.0001,
        0.8,
        0.0001,
        0.0001,
        0.0001,
        34.0,
        0.0001,
        0.0001,
        0.0001,
        0.0001,
        0.0001,
        0.0001,
        0.0001,
        0.0001,
        0.0001,
        0.0001,
        0.4,
        0.0001,
        0.0001,
        0.0001,
        7.8,
        0.0001,
        0.0001,
        0.0001,
        4.2
      ],
      [
        "Fruit de la passion",
        0.0001,
        0.0001,
        0.0001,
        0.0001,
        0.8,
        0.0001,
        0.0001,
        0.0001,
        35.0,
        0.0001,
        0.0001,
        0.0001,
        0.0001,
        0.0001,
        0.0001,
        0.0001,
        0.0001,
        0.0001,
        0.0001,
        0.3,
        0.0001,
        0.0001,
        0.0001,
        8.4,
        0.0001,
        0.0001,
        0.0001,
        3.7
      ],
      [
        "Goyave",
        81.0,
        0.0001,
        0.0001,
        0.0001,
        2.6,
        0.0001,
        0.0001,
        0.0001,
        68.0,
        228.0,
        417.0,
        0.0001,
        0.0001,
        0.0001,
        0.0001,
        0.0001,
        31.0,
        0.0001,
        0.0001,
        0.9,
        0.0001,
        0.0001,
        0.0001,
        14.3,
        0.0001,
        0.0001,
        0.0001,
        5.4
      ],
      [
        "Grenade",
        0.0001,
        0.0001,
        0.0001,
        0.0001,
        1.3,
        0.0001,
        0.0001,
        0.0001,
        64.0,
        0.0001,
        0.0001,
        0.0001,
        0.0001,
        0.0001,
        0.0001,
        0.0001,
        0.0001,
        0.0001,
        0.0001,
        0.9,
        0.0001,
        0.0001,
        0.0001,
        14.5,
        0.0001,
        0.0001,
        0.0001,
        3.1
      ],
      [
        "Griottes",
        82.8,
        0.0001,
        0.0001,
        0.0001,
        1.16,
        0.0001,
        11.2,
        24.5,
        0.0001,
        8.5,
        200.0,
        0.0001,
        0.0001,
        0.0001,
        0.0001,
        0.0001,
        0.0001,
        1.7,
        0.0001,
        0.25,
        0.0001,
        0.0001,
        0.0001,
        12.7,
        0.0001,
        270.0,
        0.0001,
        0.0001
      ],
      [
        "Groseille",
        85.7,
        0.0001,
        0.0001,
        0.0001,
        1.32,
        49.5,
        0.0001,
        0.0001,
        0.0001,
        67.9,
        225.0,
        0.0001,
        0.0001,
        0.0001,
        0.0001,
        0.67,
        0.0001,
        4.6,
        0.0001,
        0.95,
        0.38,
        0.0001,
        27.1,
        7.14,
        0.0001,
        0.0001,
        0.0001,
        0.0001
      ],
      [
        "Haricot vert",
        89.3,
        0.0001,
        0.0001,
        0.0001,
        2.0,
        0.0001,
        22.3,
        0.0001,
        0.0001,
        5.0,
        0.0001,
        0.08,
        0.0001,
        0.19,
        0.0001,
        0.0001,
        0.0001,
        4.0,
        33.0,
        0.17,
        0.0001,
        0.0001,
        0.0001,
        3.0,
        0.0001,
        0.0001,
        0.6,
        0.0001
      ],
      [
        "Kaki",
        80.7,
        0.0001,
        0.0001,
        0.0001,
        0.7,
        0.0001,
        0.0001,
        20.0,
        0.0001,
        7.0,
        171.0,
        0.0001,
        0.0001,
        0.0001,
        0.0001,
        0.5,
        0.0001,
        2.5,
        22.0,
        0.3,
        0.0001,
        0.0001,
        21.0,
        15.3,
        0.0001,
        0.0001,
        0.0001,
        0.0001
      ],
      [
        "Kiwi",
        0.0001,
        0.0001,
        0.0001,
        0.0001,
        1.0,
        0.0001,
        0.0001,
        0.0001,
        56.0,
        0.0001,
        0.0001,
        0.0001,
        0.0001,
        0.0001,
        0.0001,
        0.0001,
        0.0001,
        0.0001,
        0.0001,
        0.5,
        0.0001,
        0.0001,
        0.0001,
        13.3,
        0.0001,
        0.0001,
        0.0001,
        2.7
      ],
      [
        "Kumquat",
        81.9,
        0.0001,
        0.0001,
        0.0001,
        1.57,
        0.0001,
        0.0001,
        0.0001,
        0.0001,
        45.0,
        0.0001,
        0.0001,
        0.0001,
        0.0001,
        0.0001,
        0.0001,
        0.0001,
        5.45,
        17.0,
        1.18,
        0.0001,
        0.0001,
        0.0001,
        9.6,
        0.0001,
        231.16,
        0.0001,
        0.0001
      ],
      [
        "Laitue",
        0.0001,
        0.0001,
        0.0001,
        0.0001,
        0.8,
        0.0001,
        0.0001,
        0.0001,
        9.0,
        0.0001,
        0.0001,
        0.0001,
        0.0001,
        0.0001,
        0.0001,
        0.0001,
        0.0001,
        0.0001,
        0.0001,
        0.1,
        0.0001,
        0.0001,
        0.0001,
        1.7,
        0.0001,
        0.0001,
        0.0001,
        0.8
      ],
      [
        "Litchi",
        82.0,
        0.0001,
        0.0001,
        0.15,
        0.8,
        0.0001,
        10.0,
        0.0001,
        66.0,
        71.5,
        171.0,
        0.0001,
        0.0001,
        0.0001,
        0.0001,
        0.0001,
        0.0001,
        0.0001,
        0.0001,
        0.4,
        0.0001,
        0.0001,
        0.0001,
        16.5,
        0.0001,
        0.0001,
        0.0001,
        1.3
      ],
      [
        "Mangue",
        0.0001,
        0.0001,
        0.0001,
        0.0001,
        1.2,
        0.0001,
        0.0001,
        0.0001,
        12.0,
        0.0001,
        0.0001,
        0.0001,
        0.0001,
        0.0001,
        0.0001,
        0.0001,
        0.0001,
        0.0001,
        0.0001,
        0.2,
        0.0001,
        0.0001,
        0.0001,
        2.1,
        0.0001,
        0.0001,
        0.0001,
        1.6
      ],
      [
        "Melon",
        0.0001,
        0.0001,
        0.0001,
        0.0001,
        0.5,
        0.0001,
        0.0001,
        0.0001,
        67.0,
        0.0001,
        0.0001,
        0.0001,
        0.0001,
        0.0001,
        0.0001,
        0.0001,
        0.0001,
        0.0001,
        0.0001,
        0.3,
        0.0001,
        0.0001,
        0.0001,
        17.6,
        0.0001,
        0.0001,
        0.0001,
        1.9
      ],
      [
        "Mirabelle",
        90.9,
        0.0001,
        0.0001,
        0.0001,
        0.73,
        0.0001,
        18.9,
        23.6,
        0.0001,
        28.8,
        335.0,
        0.0001,
        0.0001,
        0.0001,
        0.0001,
        0.0001,
        336.67,
        0.93,
        0.0001,
        0.2,
        0.0001,
        0.068,
        0.0001,
        6.57,
        0.0001,
        0.0001,
        0.0001,
        0.0001
      ],
      [
        "Myrtille",
        82.7,
        0.0001,
        0.0001,
        0.0001,
        0.72,
        200.0,
        0.0001,
        0.0001,
        0.0001,
        0.0001,
        0.0001,
        0.0001,
        0.0001,
        0.09,
        0.1,
        0.0001,
        0.0001,
        2.3,
        0.0001,
        0.2,
        0.0001,
        0.0001,
        0.0001,
        12.4,
        0.0001,
        258.3,
        0.0001,
        0.0001
      ],
      [
        "M\u00e2che",
        0.0001,
        0.0001,
        0.0001,
        0.0001,
        0.6,
        0.0001,
        0.0001,
        0.0001,
        44.0,
        0.0001,
        0.0001,
        0.0001,
        0.0001,
        0.0001,
        0.0001,
        0.0001,
        0.0001,
        0.0001,
        0.0001,
        0.3,
        0.0001,
        0.0001,
        0.0001,
        11.1,
        0.0001,
        0.0001,
        0.0001,
        2.0
      ],
      [
        "Noix de coco",
        2.63,
        0.0001,
        0.0001,
        0.0001,
        6.62,
        0.0001,
        0.0001,
        0.0001,
        0.0001,
        1.5,
        0.0001,
        0.0001,
        0.0001,
        2.75,
        0.0001,
        0.0001,
        0.0001,
        14.0,
        16.5,
        66.3,
        0.6,
        0.17,
        0.0001,
        8.56,
        0.0001,
        0.0001,
        3.46,
        0.0001
      ],
      [
        "Pamplemousse",
        0.0001,
        0.0001,
        0.0001,
        0.0001,
        0.8,
        0.0001,
        0.0001,
        0.0001,
        41.0,
        0.0001,
        0.0001,
        0.0001,
        0.0001,
        0.0001,
        0.0001,
        0.0001,
        0.0001,
        0.0001,
        0.0001,
        0.1,
        0.0001,
        0.0001,
        0.0001,
        10.3,
        0.0001,
        0.0001,
        0.0001,
        2.3
      ],
      [
        "Past\u00e8que",
        0.0001,
        0.0001,
        0.0001,
        0.0001,
        0.6,
        0.0001,
        0.0001,
        0.0001,
        96.0,
        0.0001,
        0.0001,
        0.0001,
        0.0001,
        0.0001,
        0.0001,
        0.0001,
        0.0001,
        0.0001,
        0.0001,
        0.2,
        0.0001,
        0.0001,
        0.0001,
        25.7,
        0.0001,
        0.0001,
        0.0001,
        5.0
      ],
      [
        "Patate douce",
        0.0001,
        0.0001,
        0.0001,
        0.0001,
        0.5,
        0.0001,
        0.0001,
        0.0001,
        24.0,
        0.0001,
        0.0001,
        0.0001,
        0.0001,
        0.0001,
        0.0001,
        0.0001,
        0.0001,
        0.0001,
        0.0001,
        0.1,
        0.0001,
        0.0001,
        0.0001,
        6.1,
        0.0001,
        0.0001,
        0.0001,
        0.3
      ],
      [
        "Poire",
        91.5,
        0.0001,
        0.0001,
        0.0001,
        1.2,
        400.0,
        0.0001,
        0.0001,
        0.0001,
        7.0,
        0.0001,
        0.0001,
        0.0001,
        0.0001,
        0.0001,
        0.0001,
        0.0001,
        3.4,
        69.0,
        0.1,
        0.0001,
        0.13,
        19.0,
        3.8,
        0.0001,
        0.0001,
        0.5,
        0.0001
      ],
      [
        "Poireau",
        78.0,
        0.0001,
        0.0001,
        0.13,
        1.69,
        0.0001,
        0.0001,
        0.0001,
        0.0001,
        16.2,
        0.0001,
        0.0001,
        0.0001,
        0.38,
        0.0001,
        0.0001,
        1750.0,
        2.9,
        6.0,
        0.15,
        0.0001,
        0.23,
        0.0001,
        12.2,
        0.0001,
        0.0001,
        0.0001,
        0.0001
      ],
      [
        "Poivron",
        91.5,
        0.0001,
        0.0001,
        0.0001,
        1.0,
        0.0001,
        0.0001,
        0.0001,
        0.0001,
        100.0,
        160.0,
        0.02,
        0.0001,
        0.0001,
        0.0001,
        0.0001,
        1250.0,
        1.5,
        0.0001,
        0.3,
        0.0001,
        0.25,
        8.0,
        4.8,
        0.0001,
        0.0001,
        0.0001,
        0.0001
      ],
      [
        "Pomelo",
        88.6,
        0.0001,
        0.0001,
        0.075,
        1.08,
        162.0,
        0.0001,
        0.0001,
        0.0001,
        6.6,
        215.0,
        0.0001,
        0.0001,
        0.0001,
        0.0001,
        1.27,
        0.0001,
        1.6,
        0.0001,
        0.33,
        0.0001,
        0.0001,
        0.0001,
        9.0,
        0.0001,
        0.0001,
        0.15,
        0.0001
      ],
      [
        "Pomme de terre",
        90.1,
        0.0001,
        0.0001,
        0.0001,
        0.63,
        552.0,
        0.0001,
        0.0001,
        0.0001,
        40.9,
        144.0,
        0.0001,
        0.0001,
        0.0001,
        0.0001,
        0.0001,
        0.0001,
        1.33,
        24.5,
        0.2,
        0.0001,
        0.0001,
        23.3,
        5.92,
        0.0001,
        149.0,
        0.0001,
        0.0001
      ],
      [
        "Prune et pruneau",
        78.3,
        0.0001,
        0.0001,
        0.076,
        1.5,
        0.0001,
        0.0001,
        0.0001,
        0.0001,
        0.0001,
        330.0,
        0.0001,
        0.09,
        0.07400000000000001,
        0.0001,
        0.0001,
        0.0001,
        1.9,
        0.0001,
        0.1,
        0.0001,
        0.19,
        0.0001,
        18.0,
        0.0001,
        0.0001,
        0.3,
        0.0001
      ],
      [
        "P\u00eache",
        87.0,
        0.0001,
        0.0001,
        0.06,
        0.66,
        0.0001,
        6.0,
        0.0001,
        0.0001,
        7.25,
        149.0,
        0.0001,
        0.0001,
        0.076,
        0.0001,
        0.0001,
        0.0001,
        1.5,
        0.0001,
        0.29,
        0.0001,
        0.03700000000000001,
        0.0001,
        8.83,
        0.0001,
        0.0001,
        0.0001,
        0.0001
      ],
      [
        "Quetsche",
        85.9,
        0.0001,
        0.0001,
        0.0001,
        0.66,
        190.0,
        0.0001,
        17.8,
        0.0001,
        7.25,
        149.0,
        0.0001,
        0.0001,
        0.0001,
        0.0001,
        0.0001,
        0.0001,
        0.0001,
        0.0001,
        0.29,
        0.0001,
        0.0001,
        0.0001,
        9.41,
        0.0001,
        193.0,
        0.0001,
        0.0001
      ],
      [
        "Radis",
        0.0001,
        0.0001,
        0.0001,
        0.0001,
        0.4,
        0.0001,
        0.0001,
        0.0001,
        10.0,
        0.0001,
        0.0001,
        0.0001,
        0.0001,
        0.0001,
        0.0001,
        0.0001,
        0.0001,
        0.0001,
        0.0001,
        0.1,
        0.0001,
        0.0001,
        0.0001,
        2.1,
        0.0001,
        0.0001,
        0.0001,
        1.0
      ],
      [
        "Raisin",
        79.3,
        0.0001,
        0.0001,
        0.0001,
        0.6,
        0.0001,
        0.0001,
        0.0001,
        0.0001,
        4.0,
        250.0,
        0.02,
        0.04,
        0.0001,
        0.0001,
        0.0001,
        0.0001,
        1.4,
        0.0001,
        0.1,
        0.0001,
        0.1,
        0.0001,
        16.1,
        0.0001,
        0.0001,
        0.3,
        0.0001
      ],
      [
        "Rhubarbe",
        81.4,
        0.0001,
        0.0001,
        0.0001,
        0.5,
        77.0,
        11.0,
        17.0,
        0.0001,
        10.0,
        251.0,
        0.0001,
        0.0001,
        0.0001,
        0.0001,
        0.0001,
        0.0001,
        2.2,
        0.0001,
        0.1,
        0.0001,
        0.0001,
        75.0,
        13.9,
        0.0001,
        0.0001,
        0.0001,
        0.0001
      ],
      [
        "Roquette",
        0.0001,
        0.0001,
        0.0001,
        0.0001,
        0.6,
        0.0001,
        0.0001,
        0.0001,
        5.0,
        0.0001,
        0.0001,
        0.0001,
        0.0001,
        0.0001,
        0.0001,
        0.0001,
        0.0001,
        0.0001,
        0.0001,
        0.1,
        0.0001,
        0.0001,
        0.0001,
        0.8,
        0.0001,
        0.0001,
        0.0001,
        0.3
      ],
      [
        "Tomate",
        94.1,
        0.0001,
        0.0001,
        0.0001,
        0.86,
        449.0,
        10.1,
        0.0001,
        0.0001,
        15.5,
        256.0,
        0.0001,
        0.0001,
        0.0001,
        0.0001,
        0.66,
        0.0001,
        1.2,
        0.0001,
        0.26,
        0.0001,
        0.0001,
        8.14,
        2.26,
        0.0001,
        0.0001,
        0.0001,
        0.0001
      ],
      [
        "Topinambour",
        78.01,
        0.0001,
        0.0001,
        0.0001,
        2.0,
        0.0001,
        0.0001,
        78.0,
        0.0001,
        4.0,
        429.0,
        0.0001,
        0.2,
        0.0001,
        0.0001,
        0.0001,
        0.0001,
        1.6,
        0.0001,
        0.01,
        0.0001,
        0.0001,
        0.0001,
        15.84,
        0.4,
        0.0001,
        3.4,
        0.0001
      ],
      [
        "Yuzu",
        88.9,
        0.0001,
        0.0001,
        0.0001,
        1.0,
        0.0001,
        0.0001,
        0.0001,
        0.0001,
        240.0,
        0.0001,
        0.0001,
        0.0001,
        0.0001,
        0.0001,
        0.0001,
        243.88,
        2.0,
        0.0001,
        0.15,
        0.0001,
        0.0001,
        15.0,
        9.0,
        0.0001,
        104.5,
        0.0001,
        0.0001
      ]
    ]
  }
]