[
  {
    "label": "Abricot",
    "table": "sliced1",
    "data": []
  },
  {
    "label": "Ac\u00e9rola",
    "table": "sliced2",
    "data": [
      {
        "valeur": "Vitamine A mg",
        "valeur_chiffre": 2.05556
      },
      {
        "valeur": "Vitamine C mg",
        "valeur_chiffre": 1.677
      }
    ]
  },
  {
    "label": "Airelles",
    "table": "sliced3",
    "data": [
      {
        "valeur": "Potassium mg",
        "valeur_chiffre": 0.32
      },
      {
        "valeur": "Calcium mg",
        "valeur_chiffre": 0.056
      },
      {
        "valeur": "Magn\u00e9sium mg",
        "valeur_chiffre": 0.02
      },
      {
        "valeur": "Vitamine C mg",
        "valeur_chiffre": 0.008
      }
    ]
  },
  {
    "label": "Ananas",
    "table": "sliced4",
    "data": [
      {
        "valeur": "Potassium mg",
        "valeur_chiffre": 0.146
      },
      {
        "valeur": "Vitamine C mg",
        "valeur_chiffre": 0.018
      },
      {
        "valeur": "Magn\u00e9sium mg",
        "valeur_chiffre": 0.015
      },
      {
        "valeur": "Phosphore mg",
        "valeur_chiffre": 0.011
      },
      {
        "valeur": "Vitamine B6 mg",
        "valeur_chiffre": 8.999999999999999e-05
      },
      {
        "valeur": "Vitamine B1 mg",
        "valeur_chiffre": 8e-05
      }
    ]
  },
  {
    "label": "Argousier",
    "table": "sliced5",
    "data": [
      {
        "valeur": "Vitamine C mg",
        "valeur_chiffre": 0.4
      }
    ]
  },
  {
    "label": "Artichaut",
    "table": "sliced6",
    "data": []
  },
  {
    "label": "Asperge",
    "table": "sliced7",
    "data": []
  },
  {
    "label": "Aubergine",
    "table": "sliced8",
    "data": [
      {
        "valeur": "Potassium mg",
        "valeur_chiffre": 0.123
      },
      {
        "valeur": "Magn\u00e9sium mg",
        "valeur_chiffre": 0.015
      },
      {
        "valeur": "Phosphore mg",
        "valeur_chiffre": 0.015
      },
      {
        "valeur": "Vitamine C mg",
        "valeur_chiffre": 0.0013
      },
      {
        "valeur": "Vitamine B6 mg",
        "valeur_chiffre": 8.599999999999999e-05
      },
      {
        "valeur": "Vitamine B1 mg",
        "valeur_chiffre": 7.6e-05
      }
    ]
  },
  {
    "label": "Avocat",
    "table": "sliced9",
    "data": [
      {
        "valeur": "Phosphore mg",
        "valeur_chiffre": 0.044
      },
      {
        "valeur": "Magn\u00e9sium mg",
        "valeur_chiffre": 0.033
      },
      {
        "valeur": "Fer mg",
        "valeur_chiffre": 0.001
      },
      {
        "valeur": "Vitamine B6 mg",
        "valeur_chiffre": 0.00028000000000000003
      },
      {
        "valeur": "B\u00eata-carot\u00e8ne \u00b5g",
        "valeur_chiffre": 0.000185
      },
      {
        "valeur": "Vitamine B9 \u00b5g",
        "valeur_chiffre": 5.4e-05
      }
    ]
  },
  {
    "label": "Baie de goji",
    "table": "sliced10",
    "data": [
      {
        "valeur": "Vitamine A mg",
        "valeur_chiffre": 2.255
      },
      {
        "valeur": "Calcium mg",
        "valeur_chiffre": 0.053
      },
      {
        "valeur": "Vitamine C mg",
        "valeur_chiffre": 0.0136
      },
      {
        "valeur": "Fer mg",
        "valeur_chiffre": 0.0019
      }
    ]
  },
  {
    "label": "Banane",
    "table": "sliced11",
    "data": []
  },
  {
    "label": "Bette \u00e0 carde",
    "table": "sliced12",
    "data": []
  },
  {
    "label": "Betterave",
    "table": "sliced13",
    "data": []
  },
  {
    "label": "Brocoli",
    "table": "sliced14",
    "data": []
  },
  {
    "label": "Brugnon",
    "table": "sliced15",
    "data": [
      {
        "valeur": "Vitamine C mg",
        "valeur_chiffre": 0.0054
      },
      {
        "valeur": "B\u00eata-carot\u00e8ne \u00b5g",
        "valeur_chiffre": 0.00015
      }
    ]
  },
  {
    "label": "Canneberge",
    "table": "sliced16",
    "data": []
  },
  {
    "label": "Carambole",
    "table": "sliced17",
    "data": [
      {
        "valeur": "Vitamine C mg",
        "valeur_chiffre": 0.0458
      },
      {
        "valeur": "Fer mg",
        "valeur_chiffre": 0.00031
      },
      {
        "valeur": "Mangan\u00e8se mg",
        "valeur_chiffre": 0.00023999999999999998
      },
      {
        "valeur": "Vitamine B6 mg",
        "valeur_chiffre": 0.00016
      },
      {
        "valeur": "Vitamine B9 \u00b5g",
        "valeur_chiffre": 7.7e-05
      },
      {
        "valeur": "Vitamine B1 mg",
        "valeur_chiffre": 4.9000000000000005e-05
      }
    ]
  },
  {
    "label": "Carotte",
    "table": "sliced18",
    "data": [
      {
        "valeur": "Potassium mg",
        "valeur_chiffre": 0.133
      },
      {
        "valeur": "Vitamine C mg",
        "valeur_chiffre": 0.0344
      },
      {
        "valeur": "Phosphore mg",
        "valeur_chiffre": 0.012
      },
      {
        "valeur": "Magn\u00e9sium mg",
        "valeur_chiffre": 0.01
      },
      {
        "valeur": "Vitamine B5 mg",
        "valeur_chiffre": 0.00039
      },
      {
        "valeur": "B\u00eata-carot\u00e8ne \u00b5g",
        "valeur_chiffre": 2.5e-05
      }
    ]
  },
  {
    "label": "Cassis",
    "table": "sliced19",
    "data": [
      {
        "valeur": "Potassium mg",
        "valeur_chiffre": 0.144
      },
      {
        "valeur": "Vitamine A mg",
        "valeur_chiffre": 0.071
      },
      {
        "valeur": "Calcium mg",
        "valeur_chiffre": 0.04
      },
      {
        "valeur": "Vitamine C mg",
        "valeur_chiffre": 0.026
      },
      {
        "valeur": "Fer mg",
        "valeur_chiffre": 0.0006
      },
      {
        "valeur": "Vitamine K \u00b5g",
        "valeur_chiffre": 8e-05
      }
    ]
  },
  {
    "label": "Chou chinois",
    "table": "sliced20",
    "data": []
  },
  {
    "label": "Chou fris\u00e9",
    "table": "sliced21",
    "data": [
      {
        "valeur": "Potassium mg",
        "valeur_chiffre": 0.489
      },
      {
        "valeur": "Calcium mg",
        "valeur_chiffre": 0.185
      },
      {
        "valeur": "Vitamine C mg",
        "valeur_chiffre": 0.145
      },
      {
        "valeur": "B\u00eata-carot\u00e8ne \u00b5g",
        "valeur_chiffre": 0.00593
      },
      {
        "valeur": "Vitamine E mg",
        "valeur_chiffre": 0.00347
      },
      {
        "valeur": "Fer mg",
        "valeur_chiffre": 0.0012900000000000001
      },
      {
        "valeur": "Vitamine K \u00b5g",
        "valeur_chiffre": 0.000591
      },
      {
        "valeur": "Vitamine B9 \u00b5g",
        "valeur_chiffre": 0.000101
      }
    ]
  },
  {
    "label": "Chou-rave",
    "table": "sliced22",
    "data": [
      {
        "valeur": "Potassium mg",
        "valeur_chiffre": 0.322
      },
      {
        "valeur": "Vitamine C mg",
        "valeur_chiffre": 0.181
      }
    ]
  },
  {
    "label": "Chou",
    "table": "sliced23",
    "data": [
      {
        "valeur": "Potassium mg",
        "valeur_chiffre": 0.35
      },
      {
        "valeur": "Vitamine C mg",
        "valeur_chiffre": 0.062
      },
      {
        "valeur": "Phosphore mg",
        "valeur_chiffre": 0.046
      },
      {
        "valeur": "Calcium mg",
        "valeur_chiffre": 0.024
      },
      {
        "valeur": "B\u00eata-carot\u00e8ne \u00b5g",
        "valeur_chiffre": 2.2e-05
      },
      {
        "valeur": "Vitamine B9 \u00b5g",
        "valeur_chiffre": 1.6e-05
      }
    ]
  },
  {
    "label": "Choux de Bruxelles",
    "table": "sliced24",
    "data": []
  },
  {
    "label": "Citrouille",
    "table": "sliced25",
    "data": [
      {
        "valeur": "Potassium mg",
        "valeur_chiffre": 0.298
      },
      {
        "valeur": "Vitamine C mg",
        "valeur_chiffre": 0.06
      },
      {
        "valeur": "Calcium mg",
        "valeur_chiffre": 0.027
      },
      {
        "valeur": "Magn\u00e9sium mg",
        "valeur_chiffre": 0.018
      },
      {
        "valeur": "Vitamine B6 mg",
        "valeur_chiffre": 0.00014000000000000001
      },
      {
        "valeur": "Vitamine B9 \u00b5g",
        "valeur_chiffre": 8.7e-05
      }
    ]
  },
  {
    "label": "Cl\u00e9mentine",
    "table": "sliced26",
    "data": [
      {
        "valeur": "Vitamine A mg",
        "valeur_chiffre": 0.128
      },
      {
        "valeur": "Phosphore mg",
        "valeur_chiffre": 0.044
      },
      {
        "valeur": "Vitamine C mg",
        "valeur_chiffre": 0.012
      },
      {
        "valeur": "Magn\u00e9sium mg",
        "valeur_chiffre": 0.008
      },
      {
        "valeur": "Vitamine E mg",
        "valeur_chiffre": 0.0011
      },
      {
        "valeur": "Vitamine B1 mg",
        "valeur_chiffre": 5e-05
      }
    ]
  },
  {
    "label": "Coing",
    "table": "sliced27",
    "data": [
      {
        "valeur": "Potassium mg",
        "valeur_chiffre": 0.147
      },
      {
        "valeur": "Vitamine C mg",
        "valeur_chiffre": 0.018699999999999998
      },
      {
        "valeur": "Vitamine B3 mg",
        "valeur_chiffre": 0.00015
      },
      {
        "valeur": "Vitamine B1 mg",
        "valeur_chiffre": 8.999999999999999e-05
      },
      {
        "valeur": "Vitamine B6 mg",
        "valeur_chiffre": 5e-05
      },
      {
        "valeur": "Cuivre mg",
        "valeur_chiffre": 3.5000000000000004e-05
      }
    ]
  },
  {
    "label": "Combava",
    "table": "sliced28",
    "data": [
      {
        "valeur": "Potassium mg",
        "valeur_chiffre": 0.197
      },
      {
        "valeur": "Vitamine C mg",
        "valeur_chiffre": 0.015
      },
      {
        "valeur": "Calcium mg",
        "valeur_chiffre": 0.011
      },
      {
        "valeur": "Magn\u00e9sium mg",
        "valeur_chiffre": 0.008
      },
      {
        "valeur": "Cuivre mg",
        "valeur_chiffre": 0.00013000000000000002
      },
      {
        "valeur": "Vitamine B9 \u00b5g",
        "valeur_chiffre": 3e-06
      }
    ]
  },
  {
    "label": "Concombre et Cornichon",
    "table": "sliced29",
    "data": [
      {
        "valeur": "Potassium mg",
        "valeur_chiffre": 0.152
      },
      {
        "valeur": "Vitamine C mg",
        "valeur_chiffre": 0.043
      },
      {
        "valeur": "Calcium mg",
        "valeur_chiffre": 0.023
      },
      {
        "valeur": "Magn\u00e9sium mg",
        "valeur_chiffre": 0.0115
      },
      {
        "valeur": "Fer mg",
        "valeur_chiffre": 0.0006
      },
      {
        "valeur": "B\u00eata-carot\u00e8ne \u00b5g",
        "valeur_chiffre": 2.05e-05
      }
    ]
  },
  {
    "label": "Courges",
    "table": "sliced30",
    "data": [
      {
        "valeur": "Potassium mg",
        "valeur_chiffre": 0.157
      },
      {
        "valeur": "Phosphore mg",
        "valeur_chiffre": 0.0247
      },
      {
        "valeur": "Calcium mg",
        "valeur_chiffre": 0.0192
      },
      {
        "valeur": "Vitamine C mg",
        "valeur_chiffre": 0.00825
      },
      {
        "valeur": "Sodium mg",
        "valeur_chiffre": 0.0048
      },
      {
        "valeur": "B\u00eata-carot\u00e8ne \u00b5g",
        "valeur_chiffre": 4.5e-05
      }
    ]
  },
  {
    "label": "Courgette",
    "table": "sliced31",
    "data": [
      {
        "valeur": "Vitamine A mg",
        "valeur_chiffre": 4.226
      },
      {
        "valeur": "Vitamine C mg",
        "valeur_chiffre": 0.021
      },
      {
        "valeur": "Fer mg",
        "valeur_chiffre": 0.0007
      },
      {
        "valeur": "Vitamine B6 mg",
        "valeur_chiffre": 0.00015
      },
      {
        "valeur": "Cuivre mg",
        "valeur_chiffre": 7.000000000000001e-05
      },
      {
        "valeur": "Vitamine B2 mg",
        "valeur_chiffre": 2e-05
      }
    ]
  },
  {
    "label": "C\u00e9leri",
    "table": "sliced32",
    "data": [
      {
        "valeur": "Potassium mg",
        "valeur_chiffre": 0.17
      },
      {
        "valeur": "Vitamine C mg",
        "valeur_chiffre": 0.006
      },
      {
        "valeur": "Fer mg",
        "valeur_chiffre": 0.0003
      },
      {
        "valeur": "B\u00eata-carot\u00e8ne \u00b5g",
        "valeur_chiffre": 0.00021
      },
      {
        "valeur": "Vitamine B6 mg",
        "valeur_chiffre": 7.000000000000001e-05
      },
      {
        "valeur": "Vitamine B2 mg",
        "valeur_chiffre": 4e-05
      }
    ]
  },
  {
    "label": "Datte",
    "table": "sliced33",
    "data": []
  },
  {
    "label": "Endive",
    "table": "sliced34",
    "data": []
  },
  {
    "label": "Epinards",
    "table": "sliced35",
    "data": []
  },
  {
    "label": "Fenouil",
    "table": "sliced36",
    "data": [
      {
        "valeur": "Potassium mg",
        "valeur_chiffre": 0.44
      },
      {
        "valeur": "Phosphore mg",
        "valeur_chiffre": 0.026
      },
      {
        "valeur": "Calcium mg",
        "valeur_chiffre": 0.024
      },
      {
        "valeur": "Vitamine C mg",
        "valeur_chiffre": 0.005
      },
      {
        "valeur": "Vitamine B9 \u00b5g",
        "valeur_chiffre": 4.75e-05
      },
      {
        "valeur": "B\u00eata-carot\u00e8ne \u00b5g",
        "valeur_chiffre": 1.2e-05
      }
    ]
  },
  {
    "label": "Figue",
    "table": "sliced37",
    "data": []
  },
  {
    "label": "Fraise",
    "table": "sliced38",
    "data": [
      {
        "valeur": "Potassium mg",
        "valeur_chiffre": 0.152
      },
      {
        "valeur": "Vitamine C mg",
        "valeur_chiffre": 0.06
      },
      {
        "valeur": "Calcium mg",
        "valeur_chiffre": 0.02
      },
      {
        "valeur": "Magn\u00e9sium mg",
        "valeur_chiffre": 0.012
      },
      {
        "valeur": "Mangan\u00e8se mg",
        "valeur_chiffre": 0.0003
      },
      {
        "valeur": "Vitamine B9 \u00b5g",
        "valeur_chiffre": 6.2e-05
      }
    ]
  },
  {
    "label": "Framboise",
    "table": "sliced39",
    "data": []
  },
  {
    "label": "Fruit de la passion",
    "table": "sliced40",
    "data": []
  },
  {
    "label": "Goyave",
    "table": "sliced41",
    "data": [
      {
        "valeur": "Potassium mg",
        "valeur_chiffre": 0.417
      },
      {
        "valeur": "Vitamine C mg",
        "valeur_chiffre": 0.228
      },
      {
        "valeur": "Vitamine A mg",
        "valeur_chiffre": 0.031
      }
    ]
  },
  {
    "label": "Grenade",
    "table": "sliced42",
    "data": []
  },
  {
    "label": "Griottes",
    "table": "sliced43",
    "data": [
      {
        "valeur": "Potassium mg",
        "valeur_chiffre": 0.2
      },
      {
        "valeur": "Phosphore mg",
        "valeur_chiffre": 0.0245
      },
      {
        "valeur": "Magn\u00e9sium mg",
        "valeur_chiffre": 0.0112
      },
      {
        "valeur": "Vitamine C mg",
        "valeur_chiffre": 0.0085
      }
    ]
  },
  {
    "label": "Groseille",
    "table": "sliced44",
    "data": [
      {
        "valeur": "Potassium mg",
        "valeur_chiffre": 0.225
      },
      {
        "valeur": "Vitamine C mg",
        "valeur_chiffre": 0.0679
      },
      {
        "valeur": "Calcium mg",
        "valeur_chiffre": 0.027100000000000003
      },
      {
        "valeur": "Vitamine E mg",
        "valeur_chiffre": 0.00067
      },
      {
        "valeur": "Vitamine B3 mg",
        "valeur_chiffre": 0.00038
      },
      {
        "valeur": "B\u00eata-carot\u00e8ne \u00b5g",
        "valeur_chiffre": 4.95e-05
      }
    ]
  },
  {
    "label": "Haricot vert",
    "table": "sliced45",
    "data": [
      {
        "valeur": "Magn\u00e9sium mg",
        "valeur_chiffre": 0.0223
      },
      {
        "valeur": "Vitamine C mg",
        "valeur_chiffre": 0.005
      },
      {
        "valeur": "Fer mg",
        "valeur_chiffre": 0.0006
      },
      {
        "valeur": "Mangan\u00e8se mg",
        "valeur_chiffre": 0.00019
      },
      {
        "valeur": "Vitamine B2 mg",
        "valeur_chiffre": 8e-05
      },
      {
        "valeur": "Vitamine B9 \u00b5g",
        "valeur_chiffre": 3.3e-05
      }
    ]
  },
  {
    "label": "Kaki",
    "table": "sliced46",
    "data": [
      {
        "valeur": "Potassium mg",
        "valeur_chiffre": 0.171
      },
      {
        "valeur": "Calcium mg",
        "valeur_chiffre": 0.021
      },
      {
        "valeur": "Phosphore mg",
        "valeur_chiffre": 0.02
      },
      {
        "valeur": "Vitamine C mg",
        "valeur_chiffre": 0.007
      },
      {
        "valeur": "Vitamine E mg",
        "valeur_chiffre": 0.0005
      },
      {
        "valeur": "Vitamine B9 \u00b5g",
        "valeur_chiffre": 2.2e-05
      }
    ]
  },
  {
    "label": "Kiwi",
    "table": "sliced47",
    "data": []
  },
  {
    "label": "Kumquat",
    "table": "sliced48",
    "data": [
      {
        "valeur": "Vitamine C mg",
        "valeur_chiffre": 0.045
      },
      {
        "valeur": "Vitamine B9 \u00b5g",
        "valeur_chiffre": 1.7e-05
      }
    ]
  },
  {
    "label": "Laitue",
    "table": "sliced49",
    "data": []
  },
  {
    "label": "Litchi",
    "table": "sliced50",
    "data": [
      {
        "valeur": "Potassium mg",
        "valeur_chiffre": 0.171
      },
      {
        "valeur": "Vitamine C mg",
        "valeur_chiffre": 0.0715
      },
      {
        "valeur": "Magn\u00e9sium mg",
        "valeur_chiffre": 0.01
      },
      {
        "valeur": "Cuivre mg",
        "valeur_chiffre": 0.00015
      }
    ]
  },
  {
    "label": "Mangue",
    "table": "sliced51",
    "data": []
  },
  {
    "label": "Melon",
    "table": "sliced52",
    "data": []
  },
  {
    "label": "Mirabelle",
    "table": "sliced53",
    "data": [
      {
        "valeur": "Vitamine A mg",
        "valeur_chiffre": 0.33667
      },
      {
        "valeur": "Potassium mg",
        "valeur_chiffre": 0.335
      },
      {
        "valeur": "Vitamine C mg",
        "valeur_chiffre": 0.0288
      },
      {
        "valeur": "Phosphore mg",
        "valeur_chiffre": 0.023600000000000003
      },
      {
        "valeur": "Magn\u00e9sium mg",
        "valeur_chiffre": 0.0189
      },
      {
        "valeur": "Vitamine B6 mg",
        "valeur_chiffre": 6.8e-05
      }
    ]
  },
  {
    "label": "Myrtille",
    "table": "sliced54",
    "data": [
      {
        "valeur": "B\u00eata-carot\u00e8ne \u00b5g",
        "valeur_chiffre": 0.0002
      },
      {
        "valeur": "Mangan\u00e8se mg",
        "valeur_chiffre": 8.999999999999999e-05
      }
    ]
  },
  {
    "label": "M\u00e2che",
    "table": "sliced55",
    "data": []
  },
  {
    "label": "Noix de coco",
    "table": "sliced56",
    "data": [
      {
        "valeur": "Fer mg",
        "valeur_chiffre": 0.00346
      },
      {
        "valeur": "Mangan\u00e8se mg",
        "valeur_chiffre": 0.00275
      },
      {
        "valeur": "Vitamine C mg",
        "valeur_chiffre": 0.0015
      },
      {
        "valeur": "Vitamine B3 mg",
        "valeur_chiffre": 0.0006
      },
      {
        "valeur": "Vitamine B6 mg",
        "valeur_chiffre": 0.00017
      },
      {
        "valeur": "Vitamine B9 \u00b5g",
        "valeur_chiffre": 1.65e-05
      }
    ]
  },
  {
    "label": "Pamplemousse",
    "table": "sliced57",
    "data": []
  },
  {
    "label": "Past\u00e8que",
    "table": "sliced58",
    "data": []
  },
  {
    "label": "Patate douce",
    "table": "sliced59",
    "data": []
  },
  {
    "label": "Poire",
    "table": "sliced60",
    "data": [
      {
        "valeur": "Calcium mg",
        "valeur_chiffre": 0.019
      },
      {
        "valeur": "Vitamine C mg",
        "valeur_chiffre": 0.007
      },
      {
        "valeur": "Fer mg",
        "valeur_chiffre": 0.0005
      },
      {
        "valeur": "B\u00eata-carot\u00e8ne \u00b5g",
        "valeur_chiffre": 0.0004
      },
      {
        "valeur": "Vitamine B6 mg",
        "valeur_chiffre": 0.00013000000000000002
      },
      {
        "valeur": "Vitamine B9 \u00b5g",
        "valeur_chiffre": 6.9e-05
      }
    ]
  },
  {
    "label": "Poireau",
    "table": "sliced61",
    "data": [
      {
        "valeur": "Vitamine A mg",
        "valeur_chiffre": 1.75
      },
      {
        "valeur": "Vitamine C mg",
        "valeur_chiffre": 0.0162
      },
      {
        "valeur": "Mangan\u00e8se mg",
        "valeur_chiffre": 0.00038
      },
      {
        "valeur": "Vitamine B6 mg",
        "valeur_chiffre": 0.00023
      },
      {
        "valeur": "Cuivre mg",
        "valeur_chiffre": 0.00013000000000000002
      },
      {
        "valeur": "Vitamine B9 \u00b5g",
        "valeur_chiffre": 6e-06
      }
    ]
  },
  {
    "label": "Poivron",
    "table": "sliced62",
    "data": [
      {
        "valeur": "Vitamine A mg",
        "valeur_chiffre": 1.25
      },
      {
        "valeur": "Potassium mg",
        "valeur_chiffre": 0.16
      },
      {
        "valeur": "Vitamine C mg",
        "valeur_chiffre": 0.1
      },
      {
        "valeur": "Calcium mg",
        "valeur_chiffre": 0.008
      },
      {
        "valeur": "Vitamine B6 mg",
        "valeur_chiffre": 0.00025
      },
      {
        "valeur": "Vitamine B2 mg",
        "valeur_chiffre": 2e-05
      }
    ]
  },
  {
    "label": "Pomelo",
    "table": "sliced63",
    "data": [
      {
        "valeur": "Potassium mg",
        "valeur_chiffre": 0.215
      },
      {
        "valeur": "Vitamine C mg",
        "valeur_chiffre": 0.0066
      },
      {
        "valeur": "Vitamine E mg",
        "valeur_chiffre": 0.00127
      },
      {
        "valeur": "B\u00eata-carot\u00e8ne \u00b5g",
        "valeur_chiffre": 0.000162
      },
      {
        "valeur": "Fer mg",
        "valeur_chiffre": 0.00015
      },
      {
        "valeur": "Cuivre mg",
        "valeur_chiffre": 7.5e-05
      }
    ]
  },
  {
    "label": "Pomme de terre",
    "table": "sliced64",
    "data": [
      {
        "valeur": "Potassium mg",
        "valeur_chiffre": 0.144
      },
      {
        "valeur": "Vitamine C mg",
        "valeur_chiffre": 0.0409
      },
      {
        "valeur": "Calcium mg",
        "valeur_chiffre": 0.0233
      },
      {
        "valeur": "B\u00eata-carot\u00e8ne \u00b5g",
        "valeur_chiffre": 0.000552
      },
      {
        "valeur": "Vitamine B9 \u00b5g",
        "valeur_chiffre": 2.45e-05
      }
    ]
  },
  {
    "label": "Prune et pruneau",
    "table": "sliced65",
    "data": [
      {
        "valeur": "Potassium mg",
        "valeur_chiffre": 0.33
      },
      {
        "valeur": "Fer mg",
        "valeur_chiffre": 0.0003
      },
      {
        "valeur": "Vitamine B6 mg",
        "valeur_chiffre": 0.00019
      },
      {
        "valeur": "Vitamine B1 mg",
        "valeur_chiffre": 8.999999999999999e-05
      },
      {
        "valeur": "Cuivre mg",
        "valeur_chiffre": 7.6e-05
      },
      {
        "valeur": "Mangan\u00e8se mg",
        "valeur_chiffre": 7.400000000000001e-05
      }
    ]
  },
  {
    "label": "P\u00eache",
    "table": "sliced66",
    "data": [
      {
        "valeur": "Potassium mg",
        "valeur_chiffre": 0.149
      },
      {
        "valeur": "Vitamine C mg",
        "valeur_chiffre": 0.00725
      },
      {
        "valeur": "Magn\u00e9sium mg",
        "valeur_chiffre": 0.006
      },
      {
        "valeur": "Mangan\u00e8se mg",
        "valeur_chiffre": 7.6e-05
      },
      {
        "valeur": "Cuivre mg",
        "valeur_chiffre": 5.9999999999999995e-05
      },
      {
        "valeur": "Vitamine B6 mg",
        "valeur_chiffre": 3.700000000000001e-05
      }
    ]
  },
  {
    "label": "Quetsche",
    "table": "sliced67",
    "data": [
      {
        "valeur": "Potassium mg",
        "valeur_chiffre": 0.149
      },
      {
        "valeur": "Phosphore mg",
        "valeur_chiffre": 0.0178
      },
      {
        "valeur": "Vitamine C mg",
        "valeur_chiffre": 0.00725
      },
      {
        "valeur": "B\u00eata-carot\u00e8ne \u00b5g",
        "valeur_chiffre": 0.00019
      }
    ]
  },
  {
    "label": "Radis",
    "table": "sliced68",
    "data": []
  },
  {
    "label": "Raisin",
    "table": "sliced69",
    "data": [
      {
        "valeur": "Potassium mg",
        "valeur_chiffre": 0.25
      },
      {
        "valeur": "Vitamine C mg",
        "valeur_chiffre": 0.004
      },
      {
        "valeur": "Fer mg",
        "valeur_chiffre": 0.0003
      },
      {
        "valeur": "Vitamine B1 mg",
        "valeur_chiffre": 4e-05
      },
      {
        "valeur": "Vitamine B2 mg",
        "valeur_chiffre": 2e-05
      }
    ]
  },
  {
    "label": "Rhubarbe",
    "table": "sliced70",
    "data": [
      {
        "valeur": "Potassium mg",
        "valeur_chiffre": 0.251
      },
      {
        "valeur": "Calcium mg",
        "valeur_chiffre": 0.075
      },
      {
        "valeur": "Phosphore mg",
        "valeur_chiffre": 0.017
      },
      {
        "valeur": "Magn\u00e9sium mg",
        "valeur_chiffre": 0.011
      },
      {
        "valeur": "Vitamine C mg",
        "valeur_chiffre": 0.01
      },
      {
        "valeur": "B\u00eata-carot\u00e8ne \u00b5g",
        "valeur_chiffre": 7.7e-05
      }
    ]
  },
  {
    "label": "Roquette",
    "table": "sliced71",
    "data": []
  },
  {
    "label": "Tomate",
    "table": "sliced72",
    "data": [
      {
        "valeur": "Potassium mg",
        "valeur_chiffre": 0.256
      },
      {
        "valeur": "Vitamine C mg",
        "valeur_chiffre": 0.0155
      },
      {
        "valeur": "Magn\u00e9sium mg",
        "valeur_chiffre": 0.0101
      },
      {
        "valeur": "Calcium mg",
        "valeur_chiffre": 0.008140000000000001
      },
      {
        "valeur": "Vitamine E mg",
        "valeur_chiffre": 0.00066
      },
      {
        "valeur": "B\u00eata-carot\u00e8ne \u00b5g",
        "valeur_chiffre": 0.000449
      }
    ]
  },
  {
    "label": "Topinambour",
    "table": "sliced73",
    "data": [
      {
        "valeur": "Potassium mg",
        "valeur_chiffre": 0.429
      },
      {
        "valeur": "Phosphore mg",
        "valeur_chiffre": 0.078
      },
      {
        "valeur": "Vitamine C mg",
        "valeur_chiffre": 0.004
      },
      {
        "valeur": "Fer mg",
        "valeur_chiffre": 0.0034
      },
      {
        "valeur": "Vitamine B5 mg",
        "valeur_chiffre": 0.0004
      },
      {
        "valeur": "Vitamine B1 mg",
        "valeur_chiffre": 0.0002
      }
    ]
  },
  {
    "label": "Yuzu",
    "table": "sliced74",
    "data": [
      {
        "valeur": "Vitamine A mg",
        "valeur_chiffre": 0.24387999999999999
      },
      {
        "valeur": "Vitamine C mg",
        "valeur_chiffre": 0.24
      },
      {
        "valeur": "Calcium mg",
        "valeur_chiffre": 0.015
      }
    ]
  }
]