[
  {
    "table": "sliced1",
    "label": "Abricot",
    "data": [
      {
        "name": "Eau",
        "value": 90
      },
      {
        "name": "Fer",
        "value": 2
      },
      {
        "name": "Beta carotene",
        "value": 4
      },
      {
        "name": "Magnesium",
        "value": 10
      }
    ]
  },
  {
    "table": "sliced2",
    "data": [
      {
        "name": "B",
        "value": 40
      },
      {
        "name": "A",
        "value": 60
      },
      {
        "name": "lol",
        "value": 100
      }
    ]
  }
][
  {
    "table": "sliced1",
    "label": "Abricot",
    "data": [
      {
        "name": "Eau",
        "value": 90
      },
      {
        "name": "Fer",
        "value": 2
      },
      {
        "name": "Beta carotene",
        "value": 4
      },
      {
        "name": "Magnesium",
        "value": 10
      }
    ]
  },
  {
    "table": "sliced2",
    "data": [
      {
        "name": "B",
        "value": 40
      },
      {
        "name": "A",
        "value": 60
      },
      {
        "name": "lol",
        "value": 100
      }
    ]
  }
]