{
  "storage-driver": "vfs",
  "data-root": "/volume1/docker",
  "bridge": "none",
  "iptables": false,
  "seccomp-profile" : "",
  "debug": false,
  "log-driver": "json-file",
  "log-opts": {"max-size": "1m", "max-file": "3"},
  "dns-search": ["ziegler-eu.de"]
}
