{
  "ComponentName": "acquire_rr_psap3w",
  "Interfaces": [
    "Acquisition",
    "AcquisitionAutoprobe",
    "Externalconverter"
  ],

  "Title": "Acquire Radiance Research three wavelength PSAP data",
  "Description": "This component provides a parser and control to acquire Radiance Research three wavelength PSAP.  This includes both offline parsing and online control."
}
