{
  "ComponentName": "acquire_gmd_cpcpulse",
  "Interfaces": [
    "Acquisition",
    "AcquisitionAutoprobe",
    "Externalconverter"
  ],

  "Title": "Acquire GMD pulse counter CPC data",
  "Description": "This component provides a parser and control to acquire data from a GMD pulse counter box.  This is normally paired with a TSI 3760 CPC to generate actual number concentrations.  This includes both offline parsing and online control."
}
