{
  "ComponentName": "smooth_1plp",
  "Interfaces": [
    "ProcessingStage"
  ],

  "Title": "Apply a single pole low pass digital filter",
  "Description": "This applies a single pole low pass digital filter to all data.  This time constant is compensated for variable intervals between values.  Note that some types of averaging require inputs beyond the values being averaged.  For example, to average raw absorptions, transmittance and path length are required because the average is performed with a difference measurement."
}
