{
  "ComponentName": "corr_dilution",
  "Interfaces": [
    "ProcessingStage"
  ],

  "Title": "Correct data for dilution",
  "Description": "This component provides a mechanism to correct data that has been diluted.  This results in larger output values, since the dilution air is assumed to be filtered."
}
