{
  "ComponentName": "control_accumulate",
  "Interfaces": [
    "Acquisition"
  ],

  "List": {
    "Exclude": [
      "CLI",
      "GUI"
    ]
  },
  "Title": "Acquisition accumulation controller",
  "Description": "This component provides accumulation of values into a sequence of variables.  This is most commonly used to control a filter carousel."
}
