{
  "ComponentName": "output_netcdf",
  "Interfaces": [
    "ActionTime"
  ],

  "Title": "Generate NetCDF data files",
  "Description": "This generates files formatted with NetCDF4.  The specific output definitions are determined by the active configuration.  Normally this is used to generate files suitable for submission to NCEI.  The output is one or more specially named files in an output directory."
}
