{
  "ComponentName": "corr_wavelength",
  "Interfaces": [
    "ProcessingStage"
  ],

  "Title": "Adjust data wavelengths",
  "Description": "This component provides a mechanism to adjust input data to different wavelengths via interpolation."
}
