{
  "ComponentName": "acquire_generic_passive",
  "Interfaces": [
    "Acquisition",
    "AcquisitionAutoprobe",
    "Externalconverter"
  ],

  "List": {
    "Exclude": [
      "CLI",
      "GUI"
    ]
  },
  "Title": "Acquire data from a generic passive instrument",
  "Description": "This component provides a generic interface to acquire simple data from a purely passive instrument.  It provides simple parsing in the form of regular expression captures or CSV fields with its output variables being simple real numbers from fields extracted that way."
}
