{
  "ComponentName": "output_sqldb",
  "Interfaces": [
    "ActionTime"
  ],

  "Title": "Write data to an external SQL database",
  "Description": "This writes data to an external SQL based database.  The specific data written as well as the database target are controlled by the profile selected."
}
