{
  "ComponentName": "update_passed",
  "Interfaces": [
    "ActionTime"
  ],

  "Title": "Update passed data",
  "Description": "This component sends updates the archive with data that has been passed by the station mentor.  It updated any data that has been flagged as passed QA/QC but has not yet been inserted into the archive."
}
