{
  "ComponentName": "time_shift",
  "Interfaces": [
    "ProcessingStage"
  ],

  "Title": "Shift data time",
  "Description": "This component provides a mechanism to apply an offset to the times in data."
}
