{
  "ComponentName": "calc_lwcprobe",
  "Interfaces": [
    "ProcessingStage"
  ],

  "Title": "Liquid water content probe calculation",
  "Description": "This component calculates the liquid water concentration based on a heating element probe.  It takes the heating power, air and sensor temperatures, air speed, and pressure to produces a concentration of liquid water."
}
