{
  "ComponentName": "generate_fromebas",
  "Interfaces": [
    "Externalsource"
  ],

  "Title": "Generate data from the EBAS/WDCA archive",
  "Description": "This component generates data by downloading available data from the NILU/EBAS/WDCA archive.  Because the download size can be large there can be a long waiting time for data to begin."
}
