module github.com/deposition-cloud/pulumi-pvecluster/sdk

go 1.21

require (
	github.com/blang/semver v3.5.1+incompatible
	github.com/pulumi/pulumi/sdk/v3 v3.24.1
)

require (
	github.com/cheggaaa/pb v1.0.18 // indirect
	github.com/djherbis/times v1.2.0 // indirect
	github.com/emirpasic/gods v1.12.0 // indirect
	github.com/gofrs/uuid v3.3.0+incompatible // indirect
	github.com/gogo/protobuf v1.3.2 // indirect
	github.com/golang/glog v1.1.0 // indirect
	github.com/golang/protobuf v1.5.3 // indirect
	github.com/grpc-ecosystem/grpc-opentracing v0.0.0-20180507213350-8e809c8a8645 // indirect
	github.com/hashicorp/errwrap v1.0.0 // indirect
	github.com/hashicorp/go-multierror v1.0.0 // indirect
	github.com/inconshreveable/mousetrap v1.0.0 // indirect
	github.com/jbenet/go-context v0.0.0-20150711004518-d14ea06fba99 // indirect
	github.com/kevinburke/ssh_config v0.0.0-20190725054713-01f96b0aa0cd // indirect
	github.com/mattn/go-isatty v0.0.14 // indirect
	github.com/mattn/go-runewidth v0.0.8 // indirect
	github.com/mitchellh/go-homedir v1.1.0 // indirect
	github.com/mitchellh/go-ps v1.0.0 // indirect
	github.com/opentracing/basictracer-go v1.0.0 // indirect
	github.com/opentracing/opentracing-go v1.1.0 // indirect
	github.com/pkg/errors v0.9.1 // indirect
	github.com/rivo/uniseg v0.2.0 // indirect
	github.com/rogpeppe/go-internal v1.8.1 // indirect
	github.com/sabhiram/go-gitignore v0.0.0-20180611051255-d3107576ba94 // indirect
	github.com/sergi/go-diff v1.1.0 // indirect
	github.com/spf13/cobra v1.0.0 // indirect
	github.com/spf13/pflag v1.0.3 // indirect
	github.com/src-d/gcfg v1.4.0 // indirect
	github.com/texttheater/golang-levenshtein v0.0.0-20191208221605-eb6844b05fc6 // indirect
	github.com/tweekmonster/luser v0.0.0-20161003172636-3fa38070dbd7 // indirect
	github.com/uber/jaeger-client-go v2.22.1+incompatible // indirect
	github.com/uber/jaeger-lib v2.2.0+incompatible // indirect
	github.com/xanzy/ssh-agent v0.2.1 // indirect
	go.uber.org/atomic v1.6.0 // indirect
	golang.org/x/crypto v0.17.0 // indirect
	golang.org/x/net v0.17.0 // indirect
	golang.org/x/sys v0.15.0 // indirect
	golang.org/x/term v0.15.0 // indirect
	golang.org/x/text v0.14.0 // indirect
	google.golang.org/genproto v0.0.0-20230410155749-daa745c078e1 // indirect
	google.golang.org/grpc v1.56.3 // indirect
	google.golang.org/protobuf v1.33.0 // indirect
	gopkg.in/src-d/go-billy.v4 v4.3.2 // indirect
	gopkg.in/src-d/go-git.v4 v4.13.1 // indirect
	gopkg.in/warnings.v0 v0.1.2 // indirect
	gopkg.in/yaml.v2 v2.2.8 // indirect
	sourcegraph.com/sourcegraph/appdash v0.0.0-20190731080439-ebfcffb1b5c0 // indirect
)
