nro,categoria_x,nombre,direccion,address_components,formatted_address,geometry.bounds.northeast.lat,geometry.bounds.northeast.lng,geometry.bounds.southwest.lat,geometry.bounds.southwest.lng,geometry.location.lat,geometry.location.lng,geometry.location_type,geometry.viewport.northeast.lat,geometry.viewport.northeast.lng,geometry.viewport.southwest.lat,geometry.viewport.southwest.lng,partial_match,place_id,types,ADDRESS_COMPONENTS,FORMATTED_ADDRESS,GEOMETRY.BOUNDS.NORTHEAST.LAT,GEOMETRY.BOUNDS.NORTHEAST.LNG,GEOMETRY.BOUNDS.SOUTHWEST.LAT,GEOMETRY.BOUNDS.SOUTHWEST.LNG,GEOMETRY.LOCATION.LAT,GEOMETRY.LOCATION.LNG,GEOMETRY.LOCATION_TYPE,GEOMETRY.VIEWPORT.NORTHEAST.LAT,GEOMETRY.VIEWPORT.NORTHEAST.LNG,GEOMETRY.VIEWPORT.SOUTHWEST.LAT,GEOMETRY.VIEWPORT.SOUTHWEST.LNG,PARTIAL_MATCH,PLACE_ID,TYPES,PLUS_CODE.COMPOUND_CODE,PLUS_CODE.GLOBAL_CODE,plus_code.compound_code,plus_code.global_code,COD. INMUEBLE,COD. DISTRITO,OBSERVACION,COD. CATEGORÍA,X,Y,ZONA,LATITUD,LONGITUD,FACHADA,TIPO DE NORMA,NÚM. DE NORMA,ARCHIVO DE NORMA,NOMBRE,categoria_y,delimited_by
7.0,Monumento,ANTIGUA FOTOGRAFIA COURRET,De la Unión 459-463,"[{'long_name': '459', 'short_name': '459', 'types': ['street_number']}, {'long_name': 'Jirón de la Unión', 'short_name': 'Jirón de la Unión', 'types': ['route']}, {'long_name': 'Urb Cercado de Lima', 'short_name': 'Urb Cercado de Lima', 'types': ['political', 'sublocality', 'sublocality_level_1']}, {'long_name': 'Cercado de Lima', 'short_name': 'Cercado de Lima', 'types': ['locality', 'political']}, {'long_name': 'Provincia de Lima', 'short_name': 'Provincia de Lima', 'types': ['administrative_area_level_2', 'political']}, {'long_name': 'Municipalidad Metropolitana de Lima', 'short_name': 'Municipalidad Metropolitana de Lima', 'types': ['administrative_area_level_1', 'political']}, {'long_name': 'Peru', 'short_name': 'PE', 'types': ['country', 'political']}, {'long_name': '15001', 'short_name': '15001', 'types': ['postal_code']}]","Jirón de la Unión 459, Cercado de Lima 15001, Peru",,,,,-12.0468593,-77.0317267,ROOFTOP,-12.0455103197085,-77.0303777197085,-12.048208280291501,-77.0330756802915,,ChIJ79Vkc7bIBZER-gUscWfLQJg,"['establishment', 'point_of_interest']","[{'long_name': '459', 'short_name': '459', 'types': ['street_number']}, {'long_name': 'Jirón de la Unión', 'short_name': 'Jirón de la Unión', 'types': ['route']}, {'long_name': 'Urb Cercado de Lima', 'short_name': 'Urb Cercado de Lima', 'types': ['political', 'sublocality', 'sublocality_level_1']}, {'long_name': 'Cercado de Lima', 'short_name': 'Cercado de Lima', 'types': ['locality', 'political']}, {'long_name': 'Provincia de Lima', 'short_name': 'Provincia de Lima', 'types': ['administrative_area_level_2', 'political']}, {'long_name': 'Municipalidad Metropolitana de Lima', 'short_name': 'Municipalidad Metropolitana de Lima', 'types': ['administrative_area_level_1', 'political']}, {'long_name': 'Peru', 'short_name': 'PE', 'types': ['country', 'political']}, {'long_name': '15001', 'short_name': '15001', 'types': ['postal_code']}]","Jirón de la Unión 459, Cercado de Lima 15001, Peru",,,,,-12.0468593,-77.0317267,ROOFTOP,-12.0455103197085,-77.0303777197085,-12.048208280291501,-77.0330756802915,,ChIJc5S5c7bIBZERkZzQFFb5jJE,['street_address'],"XX39+78 Lima, Peru",57V4XX39+78,"XX39+78 Lima, Peru",57V4XX39+78,3894,150101,"El edificio fue mandado a construir por el Sr. Eugene Courret, fotógrafo frances en 1906. Los niveles segundo y tercero están deteriorados y no son usados. Se modificaron los vanos del primer piso. Exite un proyecto de intervención realizado en 1987.",3,,,,,,,Resolucion Suprema,2900,bim726526594.pdf,Monumento,Monumento,geometry.location
28.0,Monumento,BASILICA CATEDRAL E IGLESIA DEL SAGRARIO,Plaza de Armas,"[{'long_name': 'Jirón Carabaya', 'short_name': 'Jirón Carabaya', 'types': ['route']}, {'long_name': 'Urb Cercado de Lima', 'short_name': 'Urb Cercado de Lima', 'types': ['political', 'sublocality', 'sublocality_level_1']}, {'long_name': 'Cercado de Lima', 'short_name': 'Cercado de Lima', 'types': ['locality', 'political']}, {'long_name': 'Provincia de Lima', 'short_name': 'Provincia de Lima', 'types': ['administrative_area_level_2', 'political']}, {'long_name': 'Municipalidad Metropolitana de Lima', 'short_name': 'Municipalidad Metropolitana de Lima', 'types': ['administrative_area_level_1', 'political']}, {'long_name': 'Peru', 'short_name': 'PE', 'types': ['country', 'political']}, {'long_name': '15001', 'short_name': '15001', 'types': ['postal_code']}]","Jirón Carabaya, Cercado de Lima 15001, Peru",,,,,-12.0467484,-77.0297099,GEOMETRIC_CENTER,-12.0453994197085,-77.0283609197085,-12.0480973802915,-77.03105888029152,,ChIJj3gYm7bIBZER20Ckbpo_SgI,"['church', 'establishment', 'place_of_worship', 'point_of_interest']","[{'long_name': 'Cercado de Lima', 'short_name': 'Cercado de Lima', 'types': ['locality', 'political']}, {'long_name': 'Peru', 'short_name': 'PE', 'types': ['country', 'political']}, {'long_name': '15001', 'short_name': '15001', 'types': ['postal_code']}]","Plaza central Lima, Cercado de Lima 15001, Peru",,,,,-12.0460038,-77.0305458,GEOMETRIC_CENTER,-12.0446548197085,-77.0291968197085,-12.0473527802915,-77.03189478029152,,ChIJsX6q1bXIBZERqiIeSAseBhY,"['establishment', 'point_of_interest']","XX39+HQ Lima District, Peru",57V4XX39+HQ,"XX3C+84 Lima, Peru",57V4XX3C+84,3992,150101,"En 3.3.: J. Bernales B. cita 1596 como fecha de inicio de la construccion, otros autores (E. Hart-Terré, Marco Dorta y Ella Dumbar) 1598. Es la tercera Catedral, fundada el 22-08-1622 aún sin concluir. En 2.1.: No se incluye el área correspondiente al Museo de Arte Religioso, ni el patio de los naranjos. La Iglesia del Sagrario: En 3.3.: El 06-05-1663 se puso la primera piedra y el 11-12-1684 se inauguró. En 3.5.: La intervención de 1758 fue ejecutada por Alonso de Rivera, Pedro Matamoros y Francisco Céspedes y costeada por el Oidor Bravo de Lagunas. A fines del siglo pasado, se demolió el sector delantero, que se adelantaba hacia el atrio, reconstruyendo la fachada y alineándola con la Catedral.",3,,,,,,,Resolucion Suprema,2900,bim726526594.pdf,Monumento,Monumento,geometry.location
46.0,Monumento,CASA ALIAGA,De la Unión 218,"[{'long_name': '224', 'short_name': '224', 'types': ['street_number']}, {'long_name': 'Jirón de la Unión', 'short_name': 'Jirón de la Unión', 'types': ['route']}, {'long_name': 'Urb Cercado de Lima', 'short_name': 'Urb Cercado de Lima', 'types': ['political', 'sublocality', 'sublocality_level_1']}, {'long_name': 'Cercado de Lima', 'short_name': 'Cercado de Lima', 'types': ['locality', 'political']}, {'long_name': 'Provincia de Lima', 'short_name': 'Provincia de Lima', 'types': ['administrative_area_level_2', 'political']}, {'long_name': 'Municipalidad Metropolitana de Lima', 'short_name': 'Municipalidad Metropolitana de Lima', 'types': ['administrative_area_level_1', 'political']}, {'long_name': 'Peru', 'short_name': 'PE', 'types': ['country', 'political']}, {'long_name': '15001', 'short_name': '15001', 'types': ['postal_code']}]","Jirón de la Unión 224, Cercado de Lima 15001, Peru",,,,,-12.0441292,-77.03043829999999,ROOFTOP,-12.0427802197085,-77.02908931970848,-12.0454781802915,-77.03178728029152,,ChIJu-mVUrTIBZERN5yBElGYhVw,"['establishment', 'point_of_interest']","[{'long_name': '218', 'short_name': '218', 'types': ['street_number']}, {'long_name': 'De La Union', 'short_name': 'De La Union', 'types': ['route']}, {'long_name': '27 De Abril', 'short_name': '27 De Abril', 'types': ['political', 'sublocality', 'sublocality_level_1']}, {'long_name': 'Cercado de Lima', 'short_name': 'Cercado de Lima', 'types': ['locality', 'political']}, {'long_name': 'Provincia de Lima', 'short_name': 'Provincia de Lima', 'types': ['administrative_area_level_2', 'political']}, {'long_name': 'Municipalidad Metropolitana de Lima', 'short_name': 'Municipalidad Metropolitana de Lima', 'types': ['administrative_area_level_1', 'political']}, {'long_name': 'Peru', 'short_name': 'PE', 'types': ['country', 'political']}, {'long_name': '15012', 'short_name': '15012', 'types': ['postal_code']}]","De La Union 218, Cercado de Lima 15012, Peru",,,,,-12.0543396,-76.9594218,RANGE_INTERPOLATED,-12.052990619708499,-76.9580728197085,-12.0556885802915,-76.96077078029153,,EixEZSBMYSBVbmlvbiAyMTgsIENlcmNhZG8gZGUgTGltYSAxNTAxMiwgUGVydSIbEhkKFAoSCffG-e-LxgWREQxQ6dPFAhWrENoB,['street_address'],,,"XX49+8R Lima, Peru",57V4XX49+8R,3434,150101,"Esta casa está construida sobre un antiguo adoratorio pre-hispánico. Tiene gran valor histórico, pues aún la habitan los descendientes del conquistador Aliaga (caso único en América). En ella han sucedido hechos importantes. Posee dos habitaciones originales de 1535. En 4.6.: El uso actual es vivienda y comercio.",3,,,,,,,Resolucion Suprema,2900,bim726526594.pdf,Monumento,Monumento,geometry.location
229.0,Monumento,MUNICIPALIDAD DE LIMA,De la Unión cuadra 3,"[{'long_name': 'Lima', 'short_name': 'Lima', 'types': ['colloquial_area', 'locality', 'political']}, {'long_name': 'Callao Region', 'short_name': 'Callao Region', 'types': ['administrative_area_level_1', 'political']}, {'long_name': 'Peru', 'short_name': 'PE', 'types': ['country', 'political']}]","Lima, Peru",-11.7999875,-76.78833970000002,-12.2532891,-77.1872186,-12.045303,-77.030963,APPROXIMATE,-11.7999875,-76.78833970000002,-12.045303,-77.030963,,ChIJxz7uGfbFBZERSi5FzLlsIBQ,"['colloquial_area', 'locality', 'political']","[{'long_name': 'Jirón de la Unión', 'short_name': 'Jirón de la Unión', 'types': ['route']}, {'long_name': 'Urb Cercado de Lima', 'short_name': 'Urb Cercado de Lima', 'types': ['political', 'sublocality', 'sublocality_level_1']}, {'long_name': 'Cercado de Lima', 'short_name': 'Cercado de Lima', 'types': ['locality', 'political']}, {'long_name': 'Provincia de Lima', 'short_name': 'Provincia de Lima', 'types': ['administrative_area_level_2', 'political']}, {'long_name': 'Municipalidad Metropolitana de Lima', 'short_name': 'Municipalidad Metropolitana de Lima', 'types': ['administrative_area_level_1', 'political']}, {'long_name': 'Peru', 'short_name': 'PE', 'types': ['country', 'political']}, {'long_name': '15001', 'short_name': '15001', 'types': ['postal_code']}]","Jirón de la Unión, Cercado de Lima 15001, Peru",-12.0438479,-77.02981919999998,-12.0557247,-77.03701629999998,-12.0497409,-77.03390069999998,GEOMETRIC_CENTER,-12.0438479,-77.02981919999998,-12.0557247,-77.03701629999998,True,ChIJd2_MF7bIBZERo2PDwjzF63M,['route'],,,,,3947,150101,Uso actual: Similar al original (Municipio). El edificio fue terminado en 1944. Los datos referidos en el punto 4.2 (Materiales predominantes) son de los ambientes públicos principales. La Plaza de Armas y los edificios que la enmarcan conforman un ambiente declarado monumental. .Fue diseñado por el Arq. Hart-Terre.,3,,,,,,,Resolucion Jefatural,159,bim-19554780.pdf,Monumento,Monumento,geometry.location
237.0,Monumento,PALACIO ARZOBISPAL,Plaza de Armas,"[{'long_name': 'Jirón Carabaya', 'short_name': 'Jirón Carabaya', 'types': ['route']}, {'long_name': 'Urb Cercado de Lima', 'short_name': 'Urb Cercado de Lima', 'types': ['political', 'sublocality', 'sublocality_level_1']}, {'long_name': 'Cercado de Lima', 'short_name': 'Cercado de Lima', 'types': ['locality', 'political']}, {'long_name': 'Provincia de Lima', 'short_name': 'Provincia de Lima', 'types': ['administrative_area_level_2', 'political']}, {'long_name': 'Municipalidad Metropolitana de Lima', 'short_name': 'Municipalidad Metropolitana de Lima', 'types': ['administrative_area_level_1', 'political']}, {'long_name': 'Peru', 'short_name': 'PE', 'types': ['country', 'political']}, {'long_name': '15001', 'short_name': '15001', 'types': ['postal_code']}]","Jirón Carabaya, Cercado de Lima 15001, Peru",,,,,-12.0460759,-77.0296576,GEOMETRIC_CENTER,-12.0447269197085,-77.0283086197085,-12.0474248802915,-77.0310065802915,,ChIJ1dDHJ7TIBZERfexJe1lS_ao,"['establishment', 'museum', 'point_of_interest']","[{'long_name': 'Cercado de Lima', 'short_name': 'Cercado de Lima', 'types': ['locality', 'political']}, {'long_name': 'Peru', 'short_name': 'PE', 'types': ['country', 'political']}, {'long_name': '15001', 'short_name': '15001', 'types': ['postal_code']}]","Plaza central Lima, Cercado de Lima 15001, Peru",,,,,-12.0460038,-77.0305458,GEOMETRIC_CENTER,-12.0446548197085,-77.0291968197085,-12.0473527802915,-77.03189478029152,,ChIJsX6q1bXIBZERqiIeSAseBhY,"['establishment', 'point_of_interest']","XX39+HQ Lima District, Peru",57V4XX39+HQ,"XX3C+H4 Lima, Peru",57V4XX3C+H4,4016,150101,Diseño original del Arq. Malachowsky en 1929. Su estado de conservación es bueno.,3,,,,,,,Resolucion Suprema,2900,bim726526594.pdf,Monumento,Monumento,geometry.location
238.0,Monumento,PALACIO DE GOBIERNO,Plaza Mayor de Lima,"[{'long_name': 's/n', 'short_name': 's/n', 'types': ['street_number']}, {'long_name': 'Jirón de la Unión', 'short_name': 'Jirón de la Unión', 'types': ['route']}, {'long_name': 'Urb Cercado de Lima', 'short_name': 'Urb Cercado de Lima', 'types': ['political', 'sublocality', 'sublocality_level_1']}, {'long_name': 'Cercado de Lima', 'short_name': 'Cercado de Lima', 'types': ['locality', 'political']}, {'long_name': 'Provincia de Lima', 'short_name': 'Provincia de Lima', 'types': ['administrative_area_level_2', 'political']}, {'long_name': 'Municipalidad Metropolitana de Lima', 'short_name': 'Municipalidad Metropolitana de Lima', 'types': ['administrative_area_level_1', 'political']}, {'long_name': 'Peru', 'short_name': 'PE', 'types': ['country', 'political']}, {'long_name': '15001', 'short_name': '15001', 'types': ['postal_code']}]","Jirón de la Unión s/n, Cercado de Lima 15001, Peru",,,,,-12.0448456,-77.0297865,ROOFTOP,-12.0434966197085,-77.02843751970848,-12.0461945802915,-77.03113548029152,,ChIJx2JW07XIBZER6zG9zKW98BU,"['establishment', 'point_of_interest', 'premise']","[{'long_name': 'Cercado de Lima', 'short_name': 'Cercado de Lima', 'types': ['locality', 'political']}, {'long_name': 'Peru', 'short_name': 'PE', 'types': ['country', 'political']}, {'long_name': '15001', 'short_name': '15001', 'types': ['postal_code']}]","Plaza central Lima, Cercado de Lima 15001, Peru",,,,,-12.0460038,-77.0305458,GEOMETRIC_CENTER,-12.0446548197085,-77.0291968197085,-12.0473527802915,-77.03189478029152,,ChIJsX6q1bXIBZERqiIeSAseBhY,"['establishment', 'point_of_interest']","XX39+HQ Lima District, Peru",57V4XX39+HQ,"XX4C+33 Lima, Peru",57V4XX4C+33,3931,150101,El diseño data de 1535. En este lugar vivieran Francisco Pizarro y los 40 Virreyes que gobernaron el Perú.,3,,,,,,,Resolucion Ministerial,794-86-ED,bim338003843.pdf,Monumento,Monumento,geometry.location
248.0,Ambiente Urbano Monumental,PLAZA DE ARMAS DE LIMA,,"[{'long_name': 'Cercado de Lima', 'short_name': 'Cercado de Lima', 'types': ['locality', 'political']}, {'long_name': 'Peru', 'short_name': 'PE', 'types': ['country', 'political']}, {'long_name': '15001', 'short_name': '15001', 'types': ['postal_code']}]","Plaza central Lima, Cercado de Lima 15001, Peru",,,,,-12.0460038,-77.0305458,GEOMETRIC_CENTER,-12.0446548197085,-77.0291968197085,-12.0473527802915,-77.03189478029152,,ChIJsX6q1bXIBZERqiIeSAseBhY,"['establishment', 'point_of_interest']","[{'long_name': 'Lima', 'short_name': 'Lima', 'types': ['colloquial_area', 'locality', 'political']}, {'long_name': 'Callao Region', 'short_name': 'Callao Region', 'types': ['administrative_area_level_1', 'political']}, {'long_name': 'Peru', 'short_name': 'PE', 'types': ['country', 'political']}]","Lima, Peru",-11.7999875,-76.78833970000002,-12.2532891,-77.1872186,-12.0463731,-77.042754,APPROXIMATE,-11.7999875,-76.78833970000002,-12.2532891,-77.1872186,True,ChIJxz7uGfbFBZERSi5FzLlsIBQ,"['colloquial_area', 'locality', 'political']",,,"XX39+HQ Lima District, Peru",57V4XX39+HQ,4027,150101,"Nº 2, Jr. Junín cdra. Nº 1. En 2.7.: Otros: Pila. En 3.5.: Inicialmente la Plaza era una gran explanada con pila (Colocada en 1657) como único elemento ornamental. En 1870 se hizo el primer tratamiento con mobiliario urbano y poco después se alineó la fachada de la Iglesia el Sagrario con la de la Catedral. En 1902 se cambió el tratamiento al estilo parque ingles. En 1924 se inauguró el actual Palacio Arzobispal y por estos años se construía el Palacio de Gobierno con amplio Atrio delantero. En 1940 se construyeron los edificios neo-coloniales con nuevos portales.",2,,,,,,,Resolucion Suprema,2900,bim726526594.pdf,Ambiente Urbano Monumental,Ambiente Urbano Monumental,geometry.location
