nro,categoria,nombre,direccion
1,Inmueble Identificado para su Declaración,ACADEMIA SAN FERNANDO,Arequipa N° 990. N° 15 según leyenda de plano N° AUM-001-2006-INC/DPHCR
2,Monumento,ACTUAL HOSPICIO SAGRADO CORAZON DE JESUS,Ancash 860
3,Monumento,ANTIGUA CAJA DE DEPOSITOS Y CONSIGNACIONES,Huallaga 402 esquina Azángaro
4,Monumento,ANTIGUA COFRADIA DEL ROSARIO,De la Unión 426-428-432-442
5,Monumento,ANTIGUA ESCUELA DE MEDICINA DE SAN FERNANDO,Grau cdras. 8 y 9
6,Monumento,ANTIGUA ESTACION DE FERROCARRIL,Plaza Monserrate s/n
7,Monumento,ANTIGUA FOTOGRAFIA COURRET,De la Unión 459-463
8,Monumento,ANTIGUA QUINTA DEL RINCON DEL PRADO,"Huamalies 225, esquina Jr Manuel Pardo"
9,Ambiente Urbano Monumental,ANTIGUO CAMINO AL PUEBLO DEL CERCADO,Junín de la cuadra 2 a la cuadra 14
10,Monumento,ANTIGUO COLEGIO DE TEOLOGÍA DE SANTO TOMÁS (HOY MERCEDES CABELLO DE CARBONERA),Andahuaylas cdra 5 esquina Jr Junín cuadra 7
11,Monumento,ANTIGUO EDIFICIO LA PRENSA,De la Unión 745- 765
12,Monumento,ANTIGUO HOSPITAL DE SAN BARTOLOME (ACTUAL MATERNIDAD DE LIMA),Antonio Miró quesada 940
13,Monumento,ANTIGUO INSTITUTO NACIONAL DEL CANCER (HOSPITAL NACIONAL MADRE NIÑO SAN BARTOLOME),Alfonso Ugarte esquina Jr. Chancay y Peñaloza
14,Monumento,ANTIGUO MOLINO DE SANTA CLARA,Ancash 980-988
15,Monumento,ANTIGUO PABELLÓN DEL PERÚ EN LA EXPOSICION UNIVERSAL DE PARIS DE 1900 HOY INSTITUTO DE ESTUDIOS HISTÓRICOS MILITARES,Paseo Colón
16,Monumento,ANTIGUO PALACIO DE LA EXPOSICIÓN (MALI),
17,Monumento,ANTIGUO REAL HOSPITAL DE SAN ANDRES,Huallaga cdra. 8
18,Monumento,ANTIGUO TRIBUNAL DE LA SANTA INQUISICION,Junín 548
19,Monumento,ANTIGUOS ALMACENES SANTA CATALINA,Ucayali 168-174 y A.N. Wiesse 400-408
20,Ambiente Urbano Monumental,AREQUIPA,Arequipa comprendida entre las cuadras 1 al 10
21,Monumento,ASOC.CULTURAL BRISAS DEL TITICACA,Wakulski 168-174 (alt.primera cuadra Av. Brasil)
22,Monumento,BALCONES,De la Unión 559-565-569-573-575-579
23,Monumento,BANCO AGRARIO,Lampa 239-245-247-251
24,Monumento,BANCO CENTRAL DE RESERVA,Ucayali 299 esquina Lampa
25,Monumento,BANCO DE CREDITO - LOCAL CENTRAL. (ANTIGUO BANCO ITALIANO),Lampa 499 esquina Jr Ucayali
26,Monumento,BANCO INTERNACIONAL,De la Unión 600 esquina Jr Huancavelica
27,Monumento,BANCO POPULAR - LOCAL CENTRAL,Huallaga 380 esquina Azángaro
28,Monumento,BASILICA CATEDRAL E IGLESIA DEL SAGRARIO,Plaza de Armas
29,Monumento,BENEFICENCIA PUBLICA DE LIMA,A.N.Wiese 628-634-636-638-640-642-648(Carabaya)
30,Monumento,BOLSA DE VALORES DE LIMA (EX CASA GRACE),Lampa 594
31,Monumento,BOMBA COSMOPOLITA No. 11,Junín 574
32,Monumento,BOMBA ROMA No. 1,Junín 560-564-568
33,Ambiente Urbano Monumental,CALLES QUE CONFORMAN EL CASCO URBANO DEL ANTIGUO BARRIO DE INDIOS DEL CERCADO DE LIMA,"José de la Rivera y Dávalos cuadras 4, 5, 6, 7, 8 y 9"
34,Ambiente Urbano Monumental,CALLES QUE CONFORMAN EL CASCO URBANO DEL ANTIGUO BARRIO DE INDIOS DEL CERCADO DE LIMA,Desaguadero cuadras 3 y 4
35,Ambiente Urbano Monumental,CALLES QUE CONFORMAN EL CASCO URBANO DEL ANTIGUO BARRIO DE INDIOS DEL CERCADO DE LIMA,Oropesa cuadra 1
36,Ambiente Urbano Monumental,CALLES QUE CONFORMAN EL CASCO URBANO DEL ANTIGUO BARRIO DE INDIOS DEL CERCADO DE LIMA,Teniente César Rodríguez cuadra 4
37,Ambiente Urbano Monumental,CALLES QUE CONFORMAN EL CASCO URBANO DEL ANTIGUO BARRIO DE INDIOS DEL CERCADO DE LIMA,Matías Maestro cuadra 1
38,Ambiente Urbano Monumental,CALLES QUE CONFORMAN EL CASCO URBANO DEL ANTIGUO BARRIO DE INDIOS DEL CERCADO DE LIMA,"Conchucos cuadras 1, 2, 3, 4, 5, 6, 7 y 8"
39,Ambiente Urbano Monumental,CALLES QUE CONFORMAN EL CASCO URBANO DEL ANTIGUO BARRIO DE INDIOS DEL CERCADO DE LIMA,Coata cuadras 1 y 2
40,Monumento,CAPILLA DE LA VIRGEN DEL MILAGRO,Plazuela de San Francisco
41,Monumento,CAPILLA NUESTRA SEÑORA DE LA SOLEDAD (IGLESIA DE LA SOLEDAD),Lampa esquina Jr Ancash
42,Monumento,Capilla San Antonio de Padua de la QUINTA LA CONFIANZA,"Puno 908-940 ,int.bajo Nº70"
43,Inmueble Identificado para su Declaración,CAPILLA SANTA TERESITA,José Díaz esq. Madre de Dios. N° 38 según leyenda de plano N° AUM-001-2006-INC/DPHCR
44,Monumento,CASA DONDE NACIERON JUANA ALARCO Y ANTONIO ALARCO,Callao 482
45,Monumento,CASA GARCIA LASTRES,Nicolás de Piérola 412
46,Monumento,CASA ALIAGA,De la Unión 218
47,Monumento,CASA ARENAS,Junín 270
48,Monumento,CASA ASPILLAGA,Ucayali 391 esquina Jr Azángaro
49,Monumento,CASA ASTETE,Miró Quesada 355
50,Monumento,CASA BAQUIJANO,De la Unión 733(Baquíjano)
51,Monumento,"CASA BARRAGAN, ANTIGUO HOTEL ""RICHMOND""(PALAIS CONCERT)",De la Unión 706 esquina Emancipación (De la Unión 700-708 esquina Emancipación 115-135)
52,Monumento,CASA BERCKEMEYER,Ucayali 266
53,Monumento,"CASA, BODEGA Y CUADRA",Ancash 209-211-213-217
54,Monumento,CASA CANDAMO,A. N. Wiesse 411 (Carabaya)esquina Jr Ucayali
55,Monumento,CASA CANEVARO,Camaná 502 esquina Jr Huancavelica
56,Monumento,CASA CANEVARO,Ancash 769
57,Monumento,CASA CARRILLO-MAÚRTUA,Junín N° 1049-1049-A-1051
58,Monumento,CASA COCA,A. N. Wiese 460-474 (Carabaya)
59,Monumento,CASA COLVILLE,Ucayali 156
60,Monumento,CASA CONDE DE VILLAR DE FUENTE,"Callao 382 (Calle Piedra) Callao Nº 380,382,384,386,398 esq.Jr Rufino Torrico Nº 259,265,271,279,281"
61,Inmueble Identificado para su Declaración,CASA CUNEO HARRISON,9 de Diciembre 203B-203C-205. N° 78 según leyenda de plano N° AUM-001-2006-INC/DPHCR
62,Monumento,CASA DE CORREOS Y TELEGRAFOS,Conde de Superunda No. 166-170-178-184-188-196 esquina Jr Camaná No. 121-123-125-147-157-165-169-189
63,Monumento,CASA DE EJERCICIOS DE LA ORDEN TERCIARIA FRANCISCANA,Abancay Cdra.1
64,Monumento,CASA DE EJERCICIOS DE SAN PEDRO,Ucayali cuadra 3
65,Monumento,CASA DE EJERCICIOS DE SANTA ROSA,Antonio Miroquesada 448
66,Monumento,CASA DE ESPAÑA,Natalio Sánchez 181
67,Monumento,CASA DE JOSE CARLOS MARIATEGUI,Washington 1938-1946
68,Monumento,CASA DE LA COLUMNA - ANTIGUO NOVICIADO SANTO DOMINGO,Conde de Superunda 316
69,Monumento,CASA DE LA MONEDA,Junín 791 esquina Jr Paruro
70,Monumento,CASA DE LA PIEDRA,Junín 429
71,Monumento,CASA DE LA RIVA (SOCIEDAD ENTRE NOUS),Ica 426
72,Monumento,CASA DE LAS TRECE MONEDAS (RESTAURANT TRECE MONEDAS),Ancash 536
73,Monumento,CASA DE LAS 13 PUERTAS,Lampa 154-170 esquina Jr Ancash 273-299- Plaza San Francisco
74,Monumento,CASA DE NICOLÁS DE RIVERA EL VIEJO,Conde de Superunda 261 (fachada)-265 y Jr Cailloma Nº 121-123
75,Monumento,CASA DE OBREROS Nº 1,Cusco 1047
76,Monumento,CASA DE OBREROS No. 4,Junín 1274
77,Monumento,CASA DE OQUENDO (CASA OSAMBELA),Conde de Superunda 298
78,Monumento,CASA DE PILATOS,Ancash 390
79,Monumento,CASA DE RICARDO PALMA,Ayacucho 358
80,Monumento,CASA DEL OIDOR,"A. N. Wiesse 187-189-193 (Carabaya) antes Pescadería, esquina Jr Junín (Antes Arzobispo) Nº 201-203-"
81,Monumento,CASA DIBOS (HOSTAL EL DORADO),"Nicolás de Piérola 312 esquina Jr. Cañete cuadra 7 (Casa Dibós, actual Hostal El Dorado)"
82,Monumento,CASA DONDE HABITÓ EL ARQUITECTO HECTOR VELARDE,Hernán Velarde 14
83,Monumento,CASA DONDE NACIO DON FRANCISCO BOLOGNESI,Cailloma 125
84,Monumento,CASA DONDE NACIO DON JOSE DE LA RIVA AGÜERO,Camaná 459
85,Monumento,CASA DONDE NACIO EL BEATO FRAY MARTIN DE PORRES,Callao 529-535-543 (Calle del Espíritu Santo)
86,Monumento,CASA DONDE NACIO EL GENERAL FELIPE SANTIAGO SALAVERRY,Puno 400-406 esquina Jr Azángaro 701-707
87,Monumento,CASA DONDE SE HOSPEDO EL LIBERTADOR SIMON BOLIVAR,Junín 387 esquina Jr Azángaro
88,Monumento,CASA DONDE VIVIO FELIPE PINGLO ALVA,Junín 1454 - Barrios Altos
89,Monumento,CASA DUBOIS,Moquegua 112 esquina Jr De la Unión
90,Monumento,CASA FELIPE PARDO Y ALIAGA,Lampa 764-768
91,Monumento,CASA FERNANDINI,Jr Ica 400-416 esquina Jr Rufino Torrico 386
92,Monumento,CASA HARTH S.A,"Azángaro 217,227,229 esquina Junín 404,406,418,424"
93,Monumento,CASA HIPOLITO UNANUE,Huallaga 734-738
94,Monumento,CASA JIMENEZ,De la Unión 701 esquina Jr Cusco 106-130
95,Monumento,CASA KIEFER MARCHAND,Huallaga 661-669 esquina Jr Andahuaylas
96,Monumento,CASA MENCHACA,9 de Diciembre 209(Paseo Colón)
97,Monumento,CASA NEGREIROS,Azángaro 532
98,Monumento,CASA NICOLAS DE PIEROLA,Ancash 451
99,Monumento,CASA OHIGGINS,De la Unión 554-558-560
100,Monumento,CASA RADA O GOYENECHE,Ucayali 358
101,Monumento,CASA RAMON CASTILLA,A. N. Wiesse 607 (Carabaya) esquina Jr Cusco
102,Monumento,CASA SAL Y ROSAS,9 de Diciembre 301-311(Paseo Colón) esquina Jr.Washington
103,Monumento,CASA SANTO TOMAS,Huallaga 731-735-737-739-741-745
104,Monumento,CASA TORRE TAGLE,
105,Monumento,CASA WELSH,De la Unión 498 esquina Jr Ica 112
106,Monumento,CASONA LA CASTELLANA,Pichis 121 esquina Guzmán Blanco 200-216-224
107,Monumento,CEMENTERIO GENERAL PRESBÍTERO MAESTRO,Ancash(Cementerio )cuadra 16
108,Monumento,CENTRO CONFRATERNIDAD TÁPUC,Ancash 972-974-976
109,Inmueble Identificado para su Declaración,C.I.M.A.S,Arequipa N° 1010.N° 14 según leyenda de plano N° AUM-001-2006-INC/DPHCR
110,Ambiente Urbano Monumental,CINCO ESQUINAS,Junín esquina Jr Miró Quesada esquina Jr Huari
111,Inmueble Identificado para su Declaración,CLUB DEPARTAMENTAL DE AREQUIPA,República de Chile N° 190-198. N° 30 según leyenda de plano N° AUM-001-2006-INC/DPHCR
112,Monumento,COLEGIO DE NUESTRA SEÑORA DE GUADALUPE.,Alfonso Ugarte cuadra 12
113,Monumento,"COLEGIO NACIONAL MIXTO 1049 ""JUANA ALARCO DE DAMMERT""",Cusco 426
114,Monumento,COLEGIO RAIMONDI,"Arequipa 1021, (antiguo colegio Raimondi)"
115,Monumento,COMISARÍA DE LA POLICÍA NACIONAL DEL PERÚ,Du Petit Thouars N° 455
116,Inmueble Identificado para su Declaración,CONADIS,Arequipa N° 375. N° 8 según leyenda de plano N° AUM-001-2006-INC/DPHCR
117,Monumento,CONJUNTO DE VIVIENDAS,"Angaraes Nº 400-406-408-s/n-414-s/n, 418-420-424-s/n-428-430-434-438-440-444-450-454-458-462-466-468"
118,Monumento,CONSEJO DE OFICIALES GENERALES,Plaza Italia
119,Monumento,CONVENTO DE LA MERCED,De la Union 621
120,Monumento,CONVENTO DE MERCEDARIAS,Ancash 1180
121,Monumento,CONVENTO DE SAN AGUSTIN,Ica 225
122,Monumento,CONVENTO DE SANTO DOMINGO EN LIMA,Conde de Superunda (antes calle Veracruz y Matavilela) 366-370
123,Monumento,CONVENTO DE SANTO DOMINGO Y CAPILLA DE LA VERA CRUZ,Camaná esquina Jr Conde de Superunda
124,Monumento,CUARTEL DE SANTA ANA,Huallaga 876-890 esquina Huanta 824
125,Monumento,CUARTEL DE SANTA CATALINA,"Inambari cdra. 7, esquina Jr Andahuaylas cdra.12, esquina Av.Nicolas de Pierola s/n & 1577"
126,Monumento,"Delimitación del área intangible (Portada, zaguán y patio)",Andahuaylas 500-512-516-520-524-528-532 esquina Jr Junín 672-676-680-684-690-692-694
127,Monumento,EDF PLZ SAN MARTIN EDIFICIO SUDAMERICANA,Carabaya Nº 927-929-933-937-939 y Jr.Contumaza Nº940-950-960
128,Monumento,EDIF DE PLAZA SAN MARTIN: CINE METRO,Carabaya (Augusto N. Wiesse) Calle Pacae N° 915-917-923-925 y frente al Jr. Contumaza N° 922-932
129,Monumento,EDIF PLAZA SAN MARTIN: CLUB NACIONAL,De la Unión 1010-1016-1022 (Plaza San Martín)
130,Monumento,EDIF PLAZA SAN MARTIN: EDIF SAN MARTIN,Ocoña Nº 146-144-140-134-128-126-118-110-106-102 esq. Jr. de la Unión Nº 892-890
131,Monumento,EDIF. PLAZA SAN MARTIN: EDIFICIO BOZA,"Carabaya 821, 831, 846"
132,Monumento,EDIF PLAZA SAN MARTIN EDIFICIO FENIX,Nicolás de Piérola N°1002-1006-1010-1014-1018-1022-1026-1036-1040-1044-1048 esq.Jr.Contumaza N° 902-
133,Monumento,EDIF PLAZA SAN MARTIN HOTEL BOLIVAR,Nicolás de Piérola Nº 805-819-s/n-851-859-865 esq.Jr. de la Unión Nº 990-986-958-926-908 esq. Jr. De
134,Monumento,EDIF PLAZA SAN MARTIN PORTAL DE ZELA,De la Unión N° 1001-1011-1015-1017-1021 esq. Av. Nicolás de Piérola N° 902-906-910-914
135,Monumento,EDIF PLAZA SAN MARTIN PORTAL DE ZELA,Nicolás de Piérola N° 918-922-926-930-934-938-942-946-950-954
136,Monumento,EDIF PLAZA SAN MARTIN PORTAL DE ZELA,Nicolás de Piérola N° 956-958-962-966-970-974
137,Monumento,EDIF PLAZA SAN MARTIN PORTAL DE ZELA,Nicolás de Piérola N° 978-982-986-990-994-998 esq. Jr. Carabaya Nº s/n (cuadra 9)
138,Monumento,EDIF PLAZA SAN MARTIN: PORTAL PUMACAHUA,"Nicolás de Piérola N°961, 965, 971, 977, 987, 991, 995, 999 esq.Jr.Carabaya s/n -794-790"
139,Monumento,EDIF PLAZA SAN MARTIN: PORTAL PUMACAHUA,"Nicolás de Piérola N° 947, 953, 953-A"
140,Monumento,EDIF PLAZA SAN MARTIN: PORTAL PUMACAHUA,"Nicolás de Piérola N° 955, 955-A, 957, 959"
141,Monumento,EDIF PLAZA SAN MARTIN PORTAL PUMACAHUA,"De la Unión N° 893-897 esq. con Av Nicolás de Piérola N° 901, 905, 909, 913, 917, 923, 929, 933, 937"
142,Monumento,EDIF PLAZA SAN MARTIN: TEATRO COLON,Quilca Nº103-117-151-154-163-175 esq.Jr de la Unión Nº1000-1002-1004-1006-1010-1016-1022-1024-1026-1
143,Monumento,EDIF PLZ SAN MARTIN EDIFICIO ENCARNACION,"Carabaya N°801-815, Jr. Apurímac N° 224 y frente al Jr. Contumazá N° 826-830"
144,Monumento,EDIFICACION DE LA PLAZA SAN MARTIN,Carabaya cdr 8 esquina con Nicolás de Piérola N° 1027
145,Monumento,EDIFICACION DE LA PLAZA SAN MARTIN,Nicolás de Piérola Nº 864-870-876-882 esq.Jr.de la Unión Nº990-998 esq.Jr.Quilca cuadra 1
146,Monumento,EDIFICACIONES DE LA PLAZA DOS DE MAYO,"Dos de Mayo s/n, 2, 4, 6, 8, 10 esq Av. Nicolás de Piérola N° 103,115,s/n,129,145, s/n,177 esq Jr Mo"
147,Monumento,EDIFICACIONES DE LA PLAZA DOS DE MAYO,"Dos de Mayo 12-A,12,14,16,18,20,20-A Pj Coronel Montes N° 197-189,187,183-175, esq Moquegua 848,852,"
148,Monumento,EDIFICACIONES DE LA PLAZA DOS DE MAYO,"Dos de Mayo N°32,34,36 esq Av Alfonso Ugarte N° 470, 474, 478, 480, 482, 486, 496, 498 esq Coronel M"
149,Monumento,EDIFICACIONES DE LA PLAZA DOS DE MAYO,"Dos de Mayo N°s/n,64,66,68,70,72 esq Alfonso Ugarte N°501,505,507,507-A,509,511,511-A, esq Nicolás d"
150,Monumento,EDIFICACIONES DE LA PLAZA DOS DE MAYO,"Dos de Mayo N° s/n, esq Av Alfonso Ugarte N°: 500, 502, 504, 504-A, 506, 508 esq Coronel Miguel Baq"
151,Monumento,EDIFICACIONES DE LA PLAZA DOS DE MAYO,"Dos de Mayo N° s/n, s/n, s/n, esq Coronel Miguel Baquero esq Av. Colonial N° 101, 101-A, 103, 105, 1"
152,Monumento,EDIFICACIONES DE LA PLAZA DOS DE MAYO,"Dos de Mayo N° s/n, s/n, s/n, 44, 46, 46-A esq Av. Colonial N° 102, 110, 114, 120, 124 esq Coronel"
153,Monumento,EDIFICACIONES DE LA PLAZA DOS DE MAYO,"Dos de Mayo 22, 24, S/N, 30 esq. Alfonso Ugarte 495, 485, 481 esq Coronel Enrique Montes"
154,Monumento,EDIFICIO EN LA PLAZUELA SAN PEDRO,Azángaro 430 esquina Jr Ucayali
155,Monumento,EDIFICIO ALDABAS-MELCHORMALO,Azángaro 282 esquina Jr Huallaga cuadra 3
156,Monumento,EDIFICIO CANEVARO,"Lampa 865,879,883"
157,Inmueble Identificado para su Declaración,EDIFICIO CENTRAL,"Uruguay 114,126,148 esq Jr Tambo 107,115,121,137,137,143 esq Paraguay 193 esq Jr de la Unión 1100"
158,Monumento,"EDIFICIO COMPAÑÍA DE SEGUROS RIMAC (EDIFICIO ""RIMAC"")",Paseo de la República esquina Jr. De la Unión esquina Bolivia
159,Monumento,EDIFICIO DE LA COMPAÑIA PERUANA DE TELEFONOS,Antonio Miroquesada 159
160,Monumento,EDIFICIO FERRAND,Prol.Camaná)Jacinto López esquina Belén y esquina Av. Uruguay
161,Monumento,EDIFICIO GILDEMEISTER Y COMPAÑÍA,Azángaro 235
162,Monumento,EDIFICIO RAFFO,Nicolás de Piérola 705-715 esquina Cailloma (Edificio)
163,Monumento,EDIFICIO RAMO DE LOTERIAS DE LIMA Y CALLAO,Puno 228
164,Monumento,EDIFICIO REISER Y CURIONI,Junín 330
165,Monumento,EL BUQUE,Junín 975-993 esquina Jr Cangallo 270-298
166,Inmueble Identificado para su Declaración,EMBAJADA DE LA REPUBLICA DE ARGENTINA,Arequipa N° 121 esq. Av 28 de Julio N° 828. N° 2 según la leyenda del plano N° AUM-001-2006-INC/DPHC
167,Inmueble Identificado para su Declaración,EMBAJADA DE LA REPUBLICA DE VENEZUELA,Arequipa N° 298 esq. Calle Corpancho N° 193. N° 25 según leyenda de plano N° AUM-001-2006-INC/DPHCR
168,Monumento,ESCUELA DE LA BENEMÉRITA GUARDIA CIVIL DEL PERU (ANTIGUO MANICOMIO DEL CERCADO),"Sebastián Lorente y Jirones Oropesa, Desaguadero y Conchucos"
169,Monumento,ESCUELA NACIONAL DE BELLAS ARTES (ANTIGUO COLEGIO DE SAN IDELFONSO / HOSPITAL DE SAN PEDRO),Ancash 681 esquina Jr Andahuaylas
170,Monumento,ESCUELA NACIONAL DE MUSICA,Emancipación 180
171,Monumento,ESTACION DEL FERROCARRIL CENTRAL DE DESAMPARADOS,Ancash cuadra 1
172,Monumento,EX COLEGIO SAN JOSE DE CLUNY,"Inca Garcilazo de la Vega, esquina Av Bolivia esquina Jr. Washington"
173,Monumento,EX-COLEGIO MODELO,Puno 559
174,Ambiente Urbano Monumental,FACHADAS DEL PARQUE DE LA RESERVA,Área comprendida entre las fachadas que circundan el Parque de la Reserva
175,Monumento,GRAN HOTEL,Abancay 560-564
176,Monumento,HOSPICIO MANRIQUE,Camaná 1190
177,Monumento,HOSPICIO RUIZ DAVILA,Ancash 569
178,Monumento,HOSPITAL ARZOBISPO LOAYZA,Alfonso Ugarte 848 esquina Jr. Zorritos
179,Monumento,HOSPITAL DOS DE MAYO,Huánuco esquina Av.Grau
180,Monumento,HOSTAL LA CASONA,Moquegua 289 esquina Jr Cailloma
181,Inmueble Identificado para su Declaración,HOSTAL LA POSADA DEL PARQUE,Parque Hernán Velarde N° 56-58-60-62. N° 61 según leyenda de plano N° AUM-001-2006-INC/DPHCR
182,Inmueble Identificado para su Declaración,HOTEL CLIFFORD,Parque Hernán Velarde N° 27. N° 74 según leyenda de plano N° AUM-001-2006-INC/DPHCR
183,Monumento,HOTEL COMERCIO,A.N.Wiese 103-105-107-109-113-117-123(Carabaya) esquina Jr Ancash 200-202 Rectificado:Jr Carabaya
184,Monumento,"IGLESIA DE JESUS, MARIA Y JOSE",Camaná esquina Jr Moquegua
185,Monumento,IGLESIA DE LA MERCED,
186,Monumento,IGLESIA DE NUESTRA SEÑORA DE COCHARCAS,Huánuco
187,Monumento,IGLESIA DE NUESTRA SEÑORA DE LA CONCEPCION (IGLESIA DE LA LIMPIA CONCEPCION DE NESTRA SEÑORA),Huallaga esquina Av.Abancay
188,Monumento,IGLESIA DE NUESTRA SEÑORA DE MONSERRATE,Callao esquina Jr Tayacaja
189,Monumento,IGLESIA DE SAN AGUSTIN,
190,Monumento,IGLESIA DE SAN MARCELO,Rufino Torrico esquina Av.Emancipación (Riva Agüero)
191,Monumento,IGLESIA DE SAN PEDRO (IGLESIA DE SAN PABLO),Azángaro esquina Jr Ucayali
192,Monumento,IGLESIA DE SAN PEDRO NOLASCO (IGLESIA JESUS REDENTOR),Andahuaylas
193,Monumento,IGLESIA DE SAN SEBASTIAN (incluye Casa Parroquial de San Sebastián),Ica esquina Jr Chancay
194,Monumento,IGLESIA DE SANTA ANA,Huanta esquina Plaza Raimondi
195,Monumento,IGLESIA DE SANTIAGO DEL CERCADO,Conchucos esquina Plaza del Cercado
196,Monumento,IGLESIA DE SANTO CRISTO DE LAS MARAVILLAS,Sebastián Lorente esquina Jr.Ancash(Cementerio)
197,Monumento,IGLESIA DE SANTO DOMINGO.(NUESTRA SEÑORA DEL ROSARIO),
198,Monumento,IGLESIA DEL SAGRADO CORAZON DE JESUS (LOS HUERFANOS),Apurimac esquina Azángaro
199,Monumento,IGLESIA (SUPRESA) DE SAN CARLOS (ACTUAL PANTEON DE LOS PROCERES),Parque Universitario esquina Jr.Azángaro
200,Monumento,IGLESIA Y CONVENTO DE LA BUENA MUERTE,Paruro esquina Jr Ancash
201,Monumento,IGLESIA Y CONVENTO DE SAN FRANCISCO,Ancash esquina Lampa
202,Monumento,IGLESIA Y CONVENTO DE SANTA CLARA,Ancash esquina Jr Jauja
203,Monumento,IGLESIA Y MONASTERIO CONCEPCIONISTAS DESCALZAS DE SAN JOSÉ,Junín 981 esquina Jr Huanta
204,Monumento,IGLESIA Y MONASTERIO DE LA SANTISIMA TRINIDAD,Cusco cuadra 3
205,Monumento,IGLESIA Y MONASTERIO DE LAS NAZARENAS (IGLESIA DEL SANTO CRISTO DE LOS MILAGROS / MONASTERIO DE LAS DESCALZAS NAZARENAS DE SAN JOAQUIN),Huancavelica N°507-515-517-521-537-549-561-573-575 esquina AvTacna 454
206,Monumento,IGLESIA Y MONASTERIO DE LAS TRINITARIAS,Ancash 760 esq. Jr Paruro 524
207,Monumento,IGLESIA Y MONASTERIO DE NUESTRA SEÑORA DEL CARMEN,Huánuco esquina Jr Junín
208,Monumento,IGLESIA Y MONASTERIO DE NUESTRA SEÑORA DEL PRADO,Junín (cuadra 14)
209,Monumento,IGLESIA Y MONASTERIO DE SANTA CATALINA DE SIENA,Andahuaylas cuadra 11
210,Monumento,IGLESIA Y MONASTERIO DE SANTA ROSA DE LAS MONJAS (MONASTERIO ROSAS DE SANTA MARIA),Antonio Miroquesada esquina Jr Ayacucho
211,Inmueble Identificado para su Declaración,INSTITUTO DE INGLES DE LA UNIVERSIDAD TECNOLOGICA DEL PERU,Arequipa N°153-155-174-199. N° 3 según leyenda de plano N° AUM-001-2006-INC/DPHCR
212,Inmueble Identificado para su Declaración,INSTITUTO I.S.E.L,Arequipa N° 290. N° 26 según leyenda de plano N° AUM-001-2006-INC/DPHCR
213,Inmueble Identificado para su Declaración,INSTITUTO SUPERIOR CARRION,Petit Thouars N° 397 esq. Calle Saco Oliveros N° 311. N° 34 según leyenda de plano N° AUM-001-2006-I
214,Inmueble Identificado para su Declaración,INSTITUTO SUPERIOR LATINO,"Arequipa N° 907-915 y Calle Emilio Fernandez N° 210, Urb. Santa Beatriz"
215,Inmueble Identificado para su Declaración,INSTITUTO SUPERIOR METROPOLITANO,Arequipa N° 694 esq. Calle Ramón Dagnino N° 104-106. N° 21 según leyenda de plano N° AUM-001-2006-IN
216,Ambiente Urbano Monumental,JARDIN BOTANICO,"Ubicado en la manzana delimitada por Jr Puno cuadra 10, Jr Huanta cuadras 11,12,13, Av Grau cuadra 8"
217,Ambiente Urbano Monumental,JIRON DE LA UNION,"De la Unión cuadras 2, 3, 4, 5 y 10"
218,Monumento,LOCAL DE LA ASOCIACION DE ARTISTAS AFICIONADOS,Ica 323
219,Monumento,LOCAL DE LA BIBLIOTECA NACIONAL DEL PERU,Miró Quesada s/n cuadra 4 esquina Av. Abancay s/n cuadra 4 esquina Jr Ucayali s/n cuadra 4
220,Monumento,LOCAL DE LA SOCIEDAD DE INGENIEROS DEL PERU,Nicolás de Piérola 788
221,Monumento,LOCAL DEL CONGRESO,Plaza Bolívar
222,Monumento,LOCAL DEL DIARIO EL COMERCIO,Miró Quesada 300
223,Monumento,LOCAL DEL ESTADO MAYOR GENERAL.(ANTIGUO COLEGIO REAL DE SAN FELIPE),Ancash cuadra 6 esquina Jr Andahuaylas(Pasco)
224,Monumento,LOCAL DEL MERCADO MODELO,"28 de Julio cuadra 4, calle Gálvez Chipoco, calle Acobamba y Pasaje Palca"
225,Monumento,MERCADO LA AURORA,Huancavelica 657-661-669 esq. Av. Emancipación 664-670- esq. Jr Cañete 431-473-481
226,Inmueble Identificado para su Declaración,MINISTERIO DE DEFENSA,Arequipa N° 291 esq. Calle Corpancho s/n. N° 6 según leyenda de plano N° AUM-001-2006-INC/DPHCR
227,Monumento,MINISTERIO DE TRANSPORTES,28 de Julio 800 esquina AvGarcilaso de la Vega cuadra 19
228,Monumento,MONASTERIO DE LA CONCEPCION Y SUS DEPENDENCIAS,
229,Monumento,MUNICIPALIDAD DE LIMA,De la Unión cuadra 3
230,Monumento,MUSEO DE ARTE ITALIANO,Paseo de la República
231,Monumento,MUSEO DE ARTE TAURINO,Conde de Superunda 341
232,Monumento,MUSEO DE LA CULTURA PERUANA (antes sección de Arqueología del Museo Nacional),Alfonso Ugarte 650 esq con el jr Sánchez Pinillos y jr. Cornelio Borda
233,Monumento,PABELLON BIZANTINO DE LA EXPOSICIÓN,Parque de la Exposición
234,Monumento,PABELLON DEL PRESIDENTE DE LA EXPOSICIÓN,Parque de la Exposición
235,Monumento,PABELLON MORISCO DE LA EXPOSICION,En el Parque de la Exposición frente a la Av. Garcilazo de la Vega(Ex. Wilson)
236,Monumento,PABELLON SISMOGRAFICO,Parque de la Exposición s/n
237,Monumento,PALACIO ARZOBISPAL,Plaza de Armas
238,Monumento,PALACIO DE GOBIERNO,Plaza Mayor de Lima
239,Monumento,PALACIO DE JUSTICIA,Paseo de la República esquina Jr. M. Aljovín esquina Jr. Azángaro esquina Jr. M. Cuadros
240,Monumento,PALACIO DE TORRE TAGLE,Ucayali 363-371
241,Ambiente Urbano Monumental,PARQUE DE LA EXPOSICIÓN DE LIMA,"Comprendido entre el límite del Parque Neptuno, av. Garcilazo de la Vega, av. 28 de Julio, Paseo de"
242,Monumento,PARQUE DE LA RESERVA,Arequipa
243,Ambiente Urbano Monumental,PARQUE HERNAN VELARDE,Urbanización Santa Beatriz
244,Ambiente Urbano Monumental,PASAJE VELARDE EN SU TOTALIDAD,Velarde en su totalidad (Urbanización Santa Beatriz)
245,Ambiente Urbano Monumental,PASEO COLON,
246,Ambiente Urbano Monumental,PLAZA BOLIVAR Y PLAZUELA DE AYACUCHO,"Area comprendida entre el Jr. Junín, Jr. Andahuaylas, calle Simón Rodriguez y Av. Abancay (Plaza Bo"
247,Ambiente Urbano Monumental,PLAZA BOLOGNESI,
248,Ambiente Urbano Monumental,PLAZA DE ARMAS DE LIMA,
249,Ambiente Urbano Monumental,PLAZA DE MONSERRATE,
250,Ambiente Urbano Monumental,PLAZA DEL CERCADO,
251,Ambiente Urbano Monumental,PLAZA DOS DE MAYO,
252,Ambiente Urbano Monumental,PLAZA FRANCIA,
253,Ambiente Urbano Monumental,PLAZA SAN MARTÍN,
254,Ambiente Urbano Monumental,PLAZA SANTA ANA (PLAZA ITALIA),
255,Ambiente Urbano Monumental,PLAZA WASHINGTON,
256,Ambiente Urbano Monumental,PLAZUELA BUENOS AIRES Y CALLE COCHARCAS,
257,Ambiente Urbano Monumental,PLAZUELA DE LA BUENA MUERTE Y DE TRINITARIAS,
258,Ambiente Urbano Monumental,PLAZUELA DE LA MERCED,
259,Ambiente Urbano Monumental,PLAZUELA DE LAS NAZARENAS,
260,Ambiente Urbano Monumental,PLAZUELA DE SAN AGUSTIN,
261,Ambiente Urbano Monumental,PLAZUELA DE SAN FRANCISCO,
262,Ambiente Urbano Monumental,PLAZUELA DE SAN PEDRO,
263,Ambiente Urbano Monumental,PLAZUELA DE SAN SEBASTIAN,
264,Ambiente Urbano Monumental,PLAZUELA DE SANTA CATALINA,
265,Ambiente Urbano Monumental,PLAZUELA DE SANTO DOMINGO,
266,Ambiente Urbano Monumental,PLAZUELA SAN MARCELO,Rufino Torrico esquina Av. Emancipación
267,Ambiente Urbano Monumental,PLAZUELA Y JARDINES DE LA QUINTA HEEREN,
268,Monumento,PUENTE BALTA,Prolongación Andahuaylas
269,Monumento,PUENTE DE PIEDRA,De la Unión yTrujillo
270,Monumento,QUINTA ALANIA,9 de Diciembre 393 (Paseo Colón)esquina Jr. Chota cuadra 15
271,Monumento,QUINTA DE LA NAZARENAS,Chancay 550-552-554-560-568
272,Monumento,QUINTA HEEREN,Junín 1201
273,Monumento,QUINTA LOS HUERFANOS,Azángaro 755
274,Monumento,RADIO NACIONAL,Du Petit Thouars N° 447
275,Inmueble Identificado para su Declaración,RESIDENCIA DEL EMBAJADOR DE ESTADOS UNIDOS DE NORTEAMERICA,Arequipa esq. Rocío Muelle esq. B. Caravedo esq. Av Du Petit ThouaRS N° 9 según leyenda de plano N°
276,Monumento,SANTUARIO DE SANTA ROSA,Tacna esquina Jr.Conde de Superunda
277,Monumento,SEDE DE LA ASOCIACION NACIONAL DE CESANTES Y JUBILADOS DE EDUCACIÓN (CASA WIESE).,9 de Diciembre 215-217(Paseo Colón)
278,Monumento,TAMBO DE ORO,De la Unión 1066
279,Monumento,TEATRO LEGUIA,Arequipa cuadra 8. (Av Arequipa Nº 834-838-842)
280,Monumento,TEATRO MANUEL ASCENCIO SEGURA,Huancavelica cuadra 2
281,Monumento,TEATRO MUNICIPAL,Ica cuadra 3
282,Monumento,"TEATRO SEBASTIAN SALAZAR BONDY (ANTIGUO RESTAURANTE ""LA CABAÑA"")",Paseo de la República s/n
283,Monumento,"TEMPLO Y PARROQUIA DE LOS SAGRADOS CORAZONES, RECOLETA",Plaza Francia
284,Inmueble Identificado para su Declaración,TRIBUNAL DE JUSTICIA MILITAR,Arequipa Nº 310 según leyenda del plano Nº AUM-
285,Inmueble Identificado para su Declaración,"UNIVERSDIDAD TECNOLOGICA DEL PERU, INSTITUTO IDAT",Arequipa N° 772-790 esq. Calle Bermúdez N° 128. N° 18 según leyenda de plano N° AUM-001-2006-INC/DPH
286,Monumento,UNIVERSIDAD NACIONAL MAYOR DE SAN MARCOS ORIGINALMENTE SEDE DEL NOVICIADO JESUITA DE SAN ANTONIO ABAD Y LUEGO DEL REAL COLEGIO DE SAN CARLOS.,Parque Universitario esquina Azángaro (Casona de San Marcos)
287,Inmueble Identificado para su Declaración,UNIVERSIDAD TECNOLOGICA DEL PERU,Arequipa N° 980. N° 16 según leyenda de plano N° AUM-001-2006-INC/DPHCR
288,Monumento,VESTIGIOS DE ESTRUCT. DE ANTIGUA VIV. DEL PERIODO VIRREINAL,"Amazonas ,en las inmediaciones de la Muralla Ribereña *Ver plano A-01-2004-INC"
289,Monumento,VESTIGIOS DE LA MURALLA RIBEREÑA DE LIMA,"Abancay, Jr. Amazonas hasta la Estacion de Desamparados y la linea ferrea *Conforme a las secciones"
290,Inmueble Identificado para su Declaración,VILLA NARCISA,Arequipa N° 270-274-280-288. N° 27 según leyenda de plano N° AUM-001-2006-INC/DPHCR
291,Zona Monumental,ZONA MONUMENTAL DE LIMA,Area comprendida dentro del perímetro formado por: el cauce del río Rímac entre el Puente del Ejérci
292,Ambiente Urbano Monumental,,Huallaga cuadra 8
293,Ambiente Urbano Monumental,,Conde de Superunda cuadras 2 y 3
294,Ambiente Urbano Monumental,,Contumaza cuadra 10
295,Ambiente Urbano Monumental,,"Ayacucho Cuadra 5, antes Urubamba antigua calle Pileta de Santa Rosa de las Monjas"
296,Ambiente Urbano Monumental,,Azángaro cuadras 6 y 7
297,Ambiente Urbano Monumental,,Cailloma cuadra 1
298,Ambiente Urbano Monumental,,Contumazá cuadras 8 y 9
299,Ambiente Urbano Monumental,,Huallaga cuadra 4
300,Ambiente Urbano Monumental,,Huancavelica cuadra 1
301,Ambiente Urbano Monumental,,Lino Cornejo cuadras 1 y 2
302,Ambiente Urbano Monumental,,Moquegua cuadras 3 y 4
303,Ambiente Urbano Monumental,,"Nicolás de Piérola cuadras 1, 2, 3 y 4"
304,Ambiente Urbano Monumental,,Puno cuadra 4
305,Ambiente Urbano Monumental,,A. N. Wiese (Carabaya) cuadra 1
306,Ambiente Urbano Monumental,,Ancash cuadra 2 - Calle Rastro
307,Ambiente Urbano Monumental,,Ancash cuadras 3 y 4
308,Ambiente Urbano Monumental,,"Ancash cuadras 7, 8 y 9"
309,Ambiente Urbano Monumental,,"Azángaro cuadras 1, 2 y 3"
310,Ambiente Urbano Monumental,,Camaná cuadras 1 y 4
311,Ambiente Urbano Monumental,,Junín cuadra 4
312,Ambiente Urbano Monumental,,Ocoña cuadra 1
313,Ambiente Urbano Monumental,,Ucayali cuadra 3
314,Ambiente Urbano Monumental,,9 de Diciembre (Paseo Colón)
315,Ambiente Urbano Monumental,,Garcilaso de la Vega cuadra 16
316,Monumento,,Conde de Superunda 381-383-387-391-399 esquina Jr Rufino Torrico 201-205
317,Monumento,,Conde de Superunda 401-407-409 esquina Jr Rufino Torrico 202-204
318,Monumento,,Conde de Superunda 439-443
319,Monumento,,Conde de Superunda 445
320,Monumento,,Conde de Superunda 453-459
321,Monumento,,Conde de Superunda 475-477 A-479
322,Monumento,,Conde de Superunda 489-491-493-495 esquina Av. Tacna 101-107-111-115
323,Monumento,,De la Unión 200-202-204-206 esquina Jr Santa 101-105-109-113-115
324,Monumento,,De la Unión 210-212-214
325,Monumento,,De la Unión 419-421-425-429-431
326,Monumento,,De la Unión 435-439-441
327,Monumento,,De la Unión 465-471-477
328,Monumento,,De la Unión 466-468-474
329,Monumento,,De la Unión 484
330,Monumento,,De la Unión 489-493-499 esquina Jr Ucayali 109-119
331,Monumento,,De la Unión 541-543-549
332,Monumento,,De la Unión 621-639-645-653-657-671
333,Monumento,,De la Unión 632-646-654
334,Monumento,,De la Unión 660-668-676
335,Monumento,,De la Unión 712-716-718-722-726
336,Monumento,,De la Unión 777
337,Monumento,,De la Unión 791-795-797-799 esquina Jr Puno 101-105-111
338,Monumento,,Callao 891
339,Monumento,,De la Unión 814-816-818-830-836-838-840
340,Monumento,,De la Unión 854-860
341,Monumento,,De la Unión 869-873-879
342,Monumento,,De la Unión 1031-1035-1037 A
343,Monumento,,De la Unión 1043-1045
344,Monumento,,De la Unión 1045 A-1047-1049
345,Monumento,,De la Unión 1050-1052-1054-1056
346,Monumento,,De la Unión 1072-1072 A-1074
347,Monumento,,De la Unión 1076-1078-1080
348,Monumento,,De la Unión 1101-1105-1113-1117-1121-1123 esquina Jr Pachitea 100-108
349,Monumento,,De la Unión 1125-1127
350,Monumento,,De la Unión 1135-1143-1151
351,Monumento,,Lampa 200-206 esquina Jr Ancash 294-296-298
352,Monumento,,Lampa 201-217 esquina Jr Ancash
353,Monumento,,Lampa 214-216-218-224-230-234-236-240-250-254-258-266-268
354,Monumento,,Lampa 223-225-229-2313
355,Monumento,,Lampa 323-327-329-337-339
356,Monumento,,Lampa 1040-1042-1044-1046
357,Monumento,,Lampa 1056-1058-1060
358,Monumento,,De la Unión 800-806 esquina Jr Moquegua
359,Monumento,,A.N.Wiese 779-783-793-799 (Carabaya) esquina Jr Apurímac 201-205-209-213
360,Monumento,,A.N.Wiese 1057-1065-1071 (Carabaya)
361,Monumento,,Ancash 1624 al 1638 (Cementerio)
362,Monumento,,Conchucos 278
363,Monumento,,Conchucos 320
364,Monumento,,Conchucos 489-501
365,Monumento,,Conchucos 637
366,Monumento,,Conde de Superunda 354-358-360 esq.Pasaje Rinconada de Santo Domingo N°254
367,Monumento,,Conde de Superunda 366-370
368,Monumento,,Conde de Superunda 380-394-398 esquina Jr Rufino Torrico 199
369,Monumento,,A.N.Wiese 500(Carabaya) esquina Jr Antonio Miroquesada 162-166-170-172-176-188-190-198
370,Monumento,,A.N.Wiese 612-616-618-622-626(Carabaya)
371,Monumento,,Velarde 144-148
372,Monumento,,Sandia N°229-235-239-241-249-253-257-263-267 esq.Jr Leticia N°501-505-509-515-519
373,Monumento,,"Jose Diaz 400-416, esquina Saco Oliveros *Conservar las fachadas, inmedaciones Parque de la Reserva"
374,Monumento,,Antonio Miroquesada 862-864
375,Monumento,,"Miró Quesada 758, 760, 762, 764, s/n, 768, 770, 772, 774, 776, 778, 780, 782, 784, 786, 788"
376,Monumento,,"Ayacucho 500-506-510-514-516-518-522-530-536-540, esq. Jr Ucayali 564-572-580-586-594-598. Precisió"
377,Monumento,,Carabaya Nos. 141-145-149. Precisión de numeración: Jr Carabaya (antes Jr Augusto N. Wiese).- calle
378,Monumento,,Cailloma 154-162-170
379,Monumento,,Oroya 142-146-150-154-162-170-174-184-186-198 esquina Jr Huancavelica 1002-1006-1010-1014-1022
380,Monumento,,Montevideo 752
381,Monumento,,A.N.Wiese(Carabaya) 715-717-719-721-735
382,Monumento,,A.N.Wiese 744(Carabaya)
383,Monumento,,Junín 340-350-358
384,Monumento,,Junín 479
385,Monumento,,Ocoña 265-279
386,Monumento,,Puno 536
387,Monumento,,Ucayali 145-149
388,Monumento,,Ucayali 153-157-165
389,Monumento,,Ucayali 177-183-191
390,Monumento,,Ucayali 221-235-239
391,Monumento,,Conde de Superunda 217-219-221-223
392,Monumento,,A.N.Wiese 623-625(Carabaya)
393,Monumento,,A.N.Wiese 633-645(Carabaya)
394,Monumento,,A.N.Wiese 709 (Carabaya) esquina Jr Puno 204-206-210-214
395,Monumento,,Azángaro 556
396,Monumento,,Huallaga 438-466
397,Monumento,,Ancash 1586 esquina Jr Conchucos 109
398,Monumento,,Cailloma 105 esquina Jr Conde de Superunda
399,Monumento,,Cailloma 113-115
400,Monumento,,Cailloma 136-138-140-144-146-148-150-152
401,Monumento,,Cailloma 174-176-180-188-198 esquina Jr Callao 300
402,Monumento,,Cailloma 221-223-225 A
403,Monumento,,Cailloma 233-235
404,Monumento,,Cailloma 246-250-250 A
405,Monumento,,Cailloma 273-285-291-299 esquina Jr Ica 284-288-294
406,Monumento,,Cailloma 276-280-286-290-294 esquina Jr Ica 300-302-304
407,Monumento,,Cailloma 320-326-328
408,Monumento,,Cailloma 330-336-346-348
409,Monumento,,Cailloma 350-352-354
410,Monumento,,Cailloma 471-477
411,Monumento,,Cailloma 600 esquina Jr Moquegua 305
412,Monumento,,Cailloma 624-630
413,Monumento,,Cailloma 660 A-660-662-664
414,Monumento,,Cailloma 843
415,Monumento,,Rinconada de Santo Domingo 202
416,Monumento,,Rinconada de Santo Domingo 214
417,Monumento,,Rinconada de Santo Domingo 250
418,Monumento,,Santa (Calle Polvos Azules) 117-121-127-129
419,Monumento,,Santa (Calle Polvos Azules) 131-133-137-141
420,Monumento,,Santa (Calle Polvos Azules) 145-149
421,Monumento,,Ayacucho 342-346-350
422,Monumento,,Arequipa 410
423,Monumento,,Callao 454-456
424,Monumento,,Callao 490-492-498 esquina Av. Tacna 143-145-147-151-155-157
425,Monumento,,Cailloma 254-256-260
426,Monumento,,Cailloma 694 y Jr Ocoña 314
427,Monumento,,Callao 557
428,Monumento,,"Lino Cornejo 106-112-120-124, esq. Jr Carabaya 965-969-973-977-981-985"
429,Monumento,,"Lino Cornejo 128-132-140, esq. Jr Contumazá 1000-1006-1012-1014-1018-1018A-1024"
430,Monumento,,Ayacucho 125-129
431,Monumento,,Ayacucho 185
432,Monumento,,Ayacuho 217-219-221
433,Monumento,,Cañete 305-311-313-315-321-323-327-331-341-343-345-349-353-359
434,Monumento,,"Antonio Miroquesada 587-599, esq. Jr Ayacucho 576-580-584-586-590-598"
435,Monumento,,"Nicolás de Piérola 454-458-462-466-470, esq. Pasaje Inclán 119-123-125-127-129-135"
436,Monumento,,"Nicolás de Piérola 476-482-486-492, esq. Av Tacna 708-718-722"
437,Monumento,,"Paseo de la República 111, esq. Jr. Lampa 1200 y Av Roossevelt"
438,Monumento,,"Cusco N° 677, 679, 681, 683, 689, 693"
439,Monumento,,Rinconada de Santo Domingo 234
440,Monumento,,Rinconada de Santo Domingo 242
441,Monumento,,Callao 406 al 422
442,Monumento,,Camaná 228-234-236
443,Monumento,,Camaná 240-244-246
444,Monumento,,Camaná 319-323-327-331
445,Monumento,,Camaná 341-345-347
446,Monumento,,Camaná 355-361-363
447,Monumento,,Camaná 451
448,Monumento,,Camaná 503-505-507
449,Monumento,,Camaná 508-514-518-522-528
450,Monumento,,Camaná 789
451,Monumento,,Camaná 860-862
452,Monumento,,Camaná 882-886-890-894 esquina Jr Quilca 200-204-206-208-210-212-214-216
453,Monumento,,Camaná 900-904-908-912-916-918-920-924-928-932 esquina Jr Quilca 2da cuadra
454,Monumento,,Camaná 939-941-945
455,Monumento,,Camaná 949
456,Monumento,,Camaná 955-963-965-969
457,Monumento,,Camaná 973-975-977
458,Monumento,,Camaná 980-982
459,Monumento,,"Camaná (calle Amargura) 984-998, Esq. Jr Rufino Torrico (antes Arica), Esq. Ca. Callejón Largo de l"
460,Monumento,,Camaná 989
461,Monumento,,Camaná 998 esquina Jr Rufino Torrico
462,Monumento,,A.N.Wiese 141-145-149(Carabaya)
463,Monumento,,A.N.Wiese 153-157-161-173-177-181-185(Carabaya)
464,Monumento,,A.N.Wiese 346-350-354-358-364(Carabaya)
465,Monumento,,Ancash 741-755-757
466,Monumento,,Moquegua 410-416-426
467,Monumento,,Ayacucho 544-546-558-560-568-570 Rectificado: Jr Ayacucho Nº 546-554-560-564-568
468,Monumento,,Huanta 281-285-295
469,Monumento,,Huallaga 458-460-462-464-466
470,Monumento,,Apurímac N° 269-271-273
471,Monumento,,9 de Diciembre 422 -434(Paseo Colón)
472,Monumento,,"Andahuaylas 700, 704, 708, 712, 716, 720, 724, 728"
473,Monumento,,"Andahuaylas 742, 744, 746, 748, 750, 754, 758, 762, 766, 770, 776"
474,Monumento,,"Andahuaylas 765, 761, 757, 755, 753, 751, 749, 747, 745, 741, 741B, 739, 737, 735, 733, 729, 727, 72"
475,Monumento,,"Miró Quesada 685-673-661, esq. Jr Andahuaylas 778-782, s/n, 790-794-798"
476,Monumento,,Miró Quesada 747
477,Monumento,,"Ucayali 680, 686, 690"
478,Monumento,,"Miró Quesada 674,680, 684, 698, esquina Jr Andahuaylas 804, 808, 830"
479,Monumento,,"Coronel Inclán 137, 143,147, 151"
480,Monumento,,Cusco 418
481,Monumento,,"Cusco 777, 775, 773, 771 (ex Conde de la Vega)"
482,Monumento,,Amazonas 132-134-136-138-142-154-156
483,Monumento,,Amazonas 158-160-162-166
484,Monumento,,Moquegua 361-363-367
485,Monumento,,Nicolás de Piérola 661
486,Monumento,,"Puno 425, 427, 429 (antes calle Padre Jerónimo)"
487,Monumento,,Puno 434-442
488,Monumento,,Puno 573
489,Monumento,,Rufino Torrico 544-550
490,Monumento,,Ucayali 206 esquina Jr A. N. Wiese 401-415
491,Monumento,,Ucayali 218-220-224
492,Monumento,,Ucayali 230-236-240
493,Monumento,,Emancipación 249-251-253
494,Monumento,,Puno 556
495,Monumento,,9 de Diciembre 365 - 369 - 369 A(Paseo Colón)
496,Monumento,,Junín 337- 343- 349- 355
497,Monumento,,Miró Quesada 360
498,Monumento,,De la Unión 723
499,Monumento,,Callao 177 al 199 (Mantas) esquina Jr Camaná 301-315 (Plumereros)
500,Monumento,,Conde de Superunda 309-319
501,Monumento,,Tayacaja 225-233-241-247-253-259
502,Monumento,,Tayacaja 269-277-287-299 esquina Jr Callao 896-896 A-898-898 A
503,Monumento,,Tayacaja 349-353-357
504,Monumento,,Tayacaja 371-381-385-389
505,Monumento,,Tayacaja 408-410
506,Monumento,,Tayacaja 412-414-416-418-422
507,Monumento,,Cailloma 300-302-304-308-310-312-318 esquina Jr Ica
508,Monumento,,Tayacaja 500-502-506-512-518-520-526 esquina Jr Huancavelica 901-907-911-915-917-923 (En la publica
509,Monumento,,Tayacaja 530-532-534-538-540-542
510,Monumento,,Callao 651-657-669-675
511,Monumento,,Junín 536-544 esquina Av. Abancay (Portada)
512,Monumento,,Huancavelica 893-895-897 esquina Jr Tayacaja 521
513,Monumento,,Ancash 921-925-929
514,Monumento,,Apurímac 363-375
515,Monumento,,Camaná 200-204-206-210 esquina Jr Conde de Superunda 205-207-211
516,Monumento,,Conde de Superunda 225
517,Monumento,,Conde de Superunda 465-471
518,Monumento,,Miró Quesada 609-611-613 (calle Santa Rosa de las Monjas)
519,Monumento,,Conde de Superunda 449
520,Monumento,,Cusco 484
521,Monumento,,9 de Diciembre 414 (Paseo Colón)
522,Monumento,,Ica 350-372
523,Monumento,,Callao 358
524,Monumento,,Ucayali 544- 548- 554- 558
525,Monumento,,Cailloma 227-229-231-231 A
526,Monumento,,Huancavelica 650-668
527,Monumento,,9 de Diciembre 295-297A-299 (Paseo Colón) esq.Jr. Washington 1503-1505-1517-1519
528,Monumento,,Ancash 960-962-968
529,Monumento,,Carabaya 416 al 424
530,Monumento,,Emancipación cdra. 8 esquina Jr. Angaráes cdra. 4
531,Monumento,,Huallaga 298 esquina Jr Lampa 400-440
532,Monumento,,Puno 401 al 405 esquina Jr Azángaro 665-699
533,Monumento,,Puno 407 al 413
534,Monumento,,Tayacaja 571-575-579
535,Monumento,,Conde de Superunda 454-454-A
536,Monumento,,Huallaga 345-347-349
537,Monumento,,Huallaga 355-359-363
538,Monumento,,Huallaga 433-445-449-451
539,Monumento,,Huallaga 455-457
540,Monumento,,Huallaga 461-465-467
541,Monumento,,Huallaga 477-485
542,Monumento,,Huancavelica 353-355-357
543,Monumento,,Huanta 587
544,Monumento,,"Lampa 1094-1096-1098 esquina Jr Pachitea 295. Jr Lampa -calle cádices- Nº 1094, 1096 y 1098, esqui"
545,Monumento,,Lampa 1140-1146-1150
546,Monumento,,Rufino Torrico 129-131
547,Monumento,,Rufino Torrico 157-161-173-179-183-189-195-197
548,Monumento,,Rufino Torrico 210-214-216-220
549,Monumento,,Rufino Torrico 217-221-225
550,Monumento,,Rufino Torrico 222-224-230
551,Monumento,,Rufino Torrico 235-239
552,Monumento,,Rufino Torrico 245-251-255
553,Monumento,,Rufino Torrico 260-262
554,Monumento,,Rufino Torrico 264-266
555,Monumento,,Rufino Torrico 355-363
556,Monumento,,Rufino Torrico 424-428-432
557,Monumento,,Rufino Torrico 450-458
558,Monumento,,Rufino Torrico 767-773
559,Monumento,,Rufino Torrico 777
560,Monumento,,Rufino Torrico 814-822-826-830-840
561,Monumento,,Junín 237-239-245-247-249-251
562,Monumento,,Abancay 212-214-216-218-220
563,Monumento,,Abancay 222-224
564,Monumento,,Abancay 226-228
565,Monumento,,Andahuaylas 401-405-409-413-417-421-425-429
566,Monumento,,Angaraes 103-105-107
567,Monumento,,Angaraes 247-249-251-253-255-257-259-261-263
568,Monumento,,Ayacucho 225-227-229-235-237 esquina Jr Simón Rodríguez 603
569,Monumento,,Ayacucho 302-304 esquina Jr Junín 582-590-592-596-598
570,Monumento,,Ayacucho 308-310-312
571,Monumento,,Ayacucho 326-330-338-340
572,Monumento,,Tayacaja 549-551-553
573,Monumento,,Callao 574
574,Monumento,,Callao 584-586-588
575,Monumento,,Callao 593-597
576,Monumento,,Callao 607 esquina Jr Chancay 300-306
577,Monumento,,Callao 613-615-619
578,Monumento,,Callao 621-623
579,Monumento,,Callao 629-631
580,Monumento,,Callao 650-656
581,Monumento,,Callao 667
582,Monumento,,Callao 700-706-706 A esquina Jr Cañete 162-188-198
583,Monumento,,Callao 701-709-713-717-727-739 esquina Jr Cañete 200-206-208-210-214-218-224-230-234-240
584,Monumento,,Callao 712-718
585,Monumento,,Callao 736
586,Monumento,,Callao 764-766-768-770-780-790 esquina Jr Angaraes 109
587,Monumento,,Callao 793-795-799 esquina Jr Angaraes
588,Monumento,,Callao 800-802 esquina Jr Angaraes 120-144-168
589,Monumento,,Conde de Superunda 322-334
590,Monumento,,De la Unión 580 esquina Huancavelica
591,Monumento,,De la Unión 1039
592,Monumento,,De la Unión 1058
593,Monumento,,Plaza Bolognesi esquina Paseo Colón 444-454
594,Monumento,,Moquegua 323 - 327
595,Monumento,,Moquegua 329 (329-333-339)
596,Monumento,,9 de Diciembre 201 (Paseo Colón)esquina AvGarcilaso de la Vega
597,Monumento,,A. N. Wiesse 615 (Carabaya)
598,Monumento,,Ancash 206-230
599,Monumento,,Ancash 268-284
600,Monumento,,Callao 229
601,Monumento,,Callao 232- 238
602,Monumento,,Callao 240- 254
603,Monumento,,Callao 316 (312-316-318)
604,Monumento,,Huallaga 470-498
605,Monumento,,Huancavelica 120-150
606,Monumento,,Huancavelica 156-192 esquina Jr Camaná
607,Monumento,,Ica 496 esquina Av. Tacna
608,Monumento,,Callao 488
609,Monumento,,Camaná 865-879-889 esquina Jr Quilca cuadra1
610,Monumento,,Camaná 981-985-987
611,Monumento,,Conde de Superunda 239 -289 esquina Plaza Santo Domingo
612,Monumento,,De la Unión 1030
613,Monumento,,Emancipación 161
614,Monumento,,Huallaga 228
615,Monumento,,Huallaga 234-236
616,Monumento,,Huallaga 709-729
617,Monumento,,Huallaga 815-819
618,Monumento,,Ica 298 esquina Jr Cailloma
619,Monumento,,Ica 398 esquina Jr Rufino Torrico
620,Monumento,,"Miroquesada 579 (antigua) Jr Antonio Miroquesada Nº 559, 569, 575 y Jr Ayacucho Nº 570, 574 (actuali"
621,Monumento,,Moquegua 351
622,Monumento,,Ica 559
623,Monumento,,Ica 565
624,Monumento,,Ica 625-627-629-631
625,Monumento,,Ica 684
626,Monumento,,Ica 696-698 esquina Jr Cañete 291-299
627,Monumento,,Ica 700-712-716 esquina Jr Cañete 284-288-290
628,Monumento,,Ica 734-736-748
629,Monumento,,Ica 756-758-762
630,Monumento,,Ica 765
631,Monumento,,Ica 766-768
632,Monumento,,Ica 839-841
633,Monumento,,Ica 843-847-851-855-869-873
634,Monumento,,Ica 882-893-896 esquina Jr Tayacaja 395-399
635,Monumento,,Ica 941-949
636,Monumento,,Ica 971-973-975-977-979-981
637,Monumento,,Junín 273-279-285-291
638,Monumento,,Junín 489-495 esquina Av. Abancay 230-232-234 A-234-236-238-240-246-248-250
639,Monumento,,Junín 630-634-638-640-642-646
640,Monumento,,Junín 650-656-664-670
641,Monumento,,Huancavelica -calle Nueva o Panizo- 947-949-951-953-955-957-959-971 (antes le correspondieron los Nº
642,Monumento,,Callao 326
643,Monumento,,Callao 901-909 esquina Jr Tayacaja 302-308-310-314-318-320-324-326-328-332-336-340
644,Monumento,,Ucayali 150-156-160
645,Monumento,,Cañete 157-175-197-199 esquina Jr Callao 684-688-694-696-698
646,Monumento,,Cañete 246-250-254-260-266-274-278
647,Monumento,,Cañete 255-259-263-265
648,Monumento,,Cañete 363-367-371-375-377-381-385-389-393
649,Monumento,,Cañete 395-399 esquina Jr Huancavelica 670-672-676-680-686-692-698
650,Monumento,,Chancay 103
651,Monumento,,Chancay 433
652,Monumento,,Chancay 467-471-479-483-489
653,Monumento,,Chancay 578-580
654,Monumento,,Conde de Superunda 622-630-638-640
655,Monumento,,Conde de Superunda 646-650-654-660
656,Monumento,,Conde de Superunda 671-685-691
657,Monumento,,Emancipación 529-531-535-543
658,Monumento,,Emancipación 693-695-699 esquina Jr. Cañete 501-505-507-511-513
659,Monumento,,Huancavelica 175-179
660,Monumento,,Huancavelica 486-488-492
661,Monumento,,Huancavelica 564-566-568-574-576
662,Monumento,,Huancavelica 600-606-610-620-622 esquina Jr Chancay. ( Jr Chancay Nº 492-496-498 esq. Jr Huancave
663,Monumento,,Huancavelica 652-654-656-658-660-662-664-668
664,Monumento,,Huancavelica 849-853-855-857
665,Monumento,,Callao 850
666,Monumento,,Callao 856-862-866-868-872
667,Monumento,,Amazonas 562-564-568-574
668,Monumento,,De la Unión 364 esquina Jr Callao 120 esquina Pasaje Santa Rosa s/n-119-123
669,Monumento,,Junín 376 esquina Jr Azángaro
670,Monumento,,Junín 434
671,Monumento,,Junín 465
672,Monumento,,Junín 606 esquina Jr Ayacucho 301-303-309-311-313-317
673,Monumento,,Junín 758
674,Monumento,,Junín 901-907-911-917-923
675,Monumento,,Huallaga 861
676,Monumento,,Miró Quesada 410 esquina Azángaro
677,Monumento,,Moquegua 324
678,Monumento,,Puno 450
679,Monumento,,A. N. Wiesse 330(Carabaya)
680,Monumento,,A. N. Wiesse 354(Carabaya)
681,Monumento,,Emancipación 305 esquina Jr.Cailloma
682,Monumento,,Emancipación 367-399 (Plazuela San Marcelo)
683,Monumento,,Ica 258
684,Monumento,,Moquegua 406 esquina Jr Rufino Torrico 672
685,Monumento,,Paruro 386 esquina Jr Ancash 795
686,Monumento,,Brasil 101-151(Plaza Bolognesi)
687,Monumento,,Guzmán Blanco 128
688,Monumento,,Plaza Bolognesi 421-425
689,Monumento,,Plaza Bolognesi 441-445 esquina Av.Guzmán Blanco 125
690,Monumento,,Plaza Bolognesi 475 esquina Av. Guzmán Blanco 110-114
691,Monumento,,Plaza Bolognesi 477-481
692,Monumento,,Plaza Bolognesi 485-487
693,Monumento,,Plaza Bolognesi 500-510 esquina Av. Central (Paraguay) 487
694,Monumento,,Plaza Bolognesi 520-530 esq. Av. Central (Paraguay) 478-496 y Av. Alfonso Ugarte 1489-1499
695,Monumento,,A. N. Wiese 600-608(Carabaya) esquina Jr Cusco 156-166-170-174-186
696,Monumento,,Ancash 412 esquina Jr Azángaro 105
697,Monumento,,Ancash 460
698,Monumento,,Ancash 935
699,Monumento,,Camaná 201-255 (Plaza de Santo Domingo) esquina Jr Conde de Superunda 187-191
700,Monumento,,Camaná 773
701,Monumento,,Conde de Superunda 289 esquina Plaza Santo Domingo
702,Monumento,,Leticia N°525-527-531-533-535-537-539-543-547
703,Valor Urbanistico De Entorno,,Puno 650
704,Inmueble Identificado para su Declaración,,Huallaga 601 al 627esq.Jr Ayacucho Nº373 al 399
705,Inmueble Identificado para su Declaración,,"Cailloma 149, 153, 157, 167, 187"
706,Inmueble Identificado para su Declaración,,"Callao Nº 280, 282, 284, 288"
707,Inmueble Identificado para su Declaración,,Paruro Nº 660
708,Inmueble Identificado para su Declaración,,"Tacna 649, 651,653, 655"
709,Inmueble Identificado para su Declaración,,"Azángaro 117, 119, 121"
710,Inmueble Identificado para su Declaración,,"Huallaga 829, 831, 833"
711,Inmueble Identificado para su Declaración,,Arequipa N° 265. N° 5 según la leyenda de plano N° AUM-001-2006-INC/DPHCR
712,Inmueble Identificado para su Declaración,,Arequipa N° 210-214. N° 29 según leyenda de plano N° AUM-001-2006-INC/DPHCR
713,Inmueble Identificado para su Declaración,,Arequipa N° 220. N° 28 según leyenda de plano N° AUM-001-2006-INC/DPHCR
714,Inmueble Identificado para su Declaración,,"Huallaga 847-847A, 849"
715,Inmueble Identificado para su Declaración,,Arequipa N° 305-311-313-321-327-329-331-333-339-341-343. N° 7 según leyenda de plano N° AUM-001-2006
716,Inmueble Identificado para su Declaración,,Arequipa N° 398. N° 23 según leyenda de plano N° AUM-001-2006-INC/DPHCR
717,Inmueble Identificado para su Declaración,,Arequipa N° 702 esq. Calle Ramón Dagnino N° 107-111. N° 20 según leyenda de plano N° AUM-001-2006-IN
718,Inmueble Identificado para su Declaración,,Arequipa N° 734. N° 19 según leyenda de plano N° AUM-001-2006-INC/DPHCR
719,Inmueble Identificado para su Declaración,,Arequipa N° 989-s/n-s/n.N° 11 según leyenda de plano N° AUM-001-2006-INC/DPHCR
720,Inmueble Identificado para su Declaración,,Arequipa N° 1032.N° 13 según leyenda de plano N° AUM-001-2006-INC/DPHCR
721,Inmueble Identificado para su Declaración,,Hernán Velarde N° 265-275. N° 4 según leyenda de plano N° AUM-001-2006-INC/DPHCR
722,Inmueble Identificado para su Declaración,,28 de Julio cuadra 775-779-787-795 esq. Av Garcilazo de la Vega (Ex Av Wilson) 1976-1980-1996. N° 32
723,Inmueble Identificado para su Declaración,,República de Chile N° 120-136-140-144 esq. Av 28 de Julio. N° 31 según leyenda de plano N° AUM-001-2
724,Inmueble Identificado para su Declaración,,José Díaz y Calle Saco Oliveros. N° 35 según leyenda de plano N° AUM-001-2006-INC/DPHCR
725,Inmueble Identificado para su Declaración,,Emilio Fernández N° 501 esq. Calle Enrique Barrón. N° 39 según leyenda de plano N° AUM-001-2006-INC/
726,Inmueble Identificado para su Declaración,,Emilio Fernández N° 490. N° 40 según leyenda de plano N° AUM-001-2006-INC/DPHCR
727,Inmueble Identificado para su Declaración,,Emilio Fernández N° 220-226. N° 41 según leyenda de plano N° AUM-001-2006-INC/DPHCR
728,Inmueble Identificado para su Declaración,,Hernán Velarde N° 8-10.N° 49 según leyenda de plano N° AUM-001-2006-INC/DPHCR
729,Inmueble Identificado para su Declaración,,Plaza Bolognesi 419 esquina Av.Nueve de Diciembre 417
730,Inmueble Identificado para su Declaración,,Ica 145-149
731,Inmueble Identificado para su Declaración,,Paruro 889-891 esq. Jr Antonio Miroquesada Nº 801 al 807
732,Inmueble Identificado para su Declaración,,Emilio Fernandez 490 (inmediaciones Parque de la Reserva) *Conservar la fachada
733,Inmueble Identificado para su Declaración,,Emilio Fernandez 501 esquina Enrique Barron (inmediaciones Parque de la Reserva) *Conservar la facha
734,Inmueble Identificado para su Declaración,,"Conde de Superunda Nº 600, 604, 608, esquina Jr Chancay Nº 170, 172, 174"
735,Inmueble Identificado para su Declaración,,Hernán Velarde N° 22. N° 51 según leyenda de plano N° AUM-001-2006-INC/DPHCR
736,Inmueble Identificado para su Declaración,,Hernán Velarde N° 24. N° 52 según leyenda de plano N° AUM-001-2006-INC/DPHCR
737,Inmueble Identificado para su Declaración,,Hernán Velarde N° 199 esq. Pasaje Hernán VelaRDE N° 57 según leyenda de plano N° AUM-001-2006-INC/DP
738,Inmueble Identificado para su Declaración,,Hernán Velarde N° 26-28 esq. Parque Hernán VelaRDE N° 54 según leyenda de plano N° AUM-001-2006-INC/
739,Inmueble Identificado para su Declaración,,Parque Hernán Velarde N° 30-32. N° 55 según leyenda de plano N° AUM-001-2006-INC/DPHCR
740,Inmueble Identificado para su Declaración,,Parque Hernán Velarde N° 34. N° 56 según leyenda de plano N° AUM-001-2006-INC/DPHCR
741,Inmueble Identificado para su Declaración,,Parque Hernán Velarde N° 36. N° 57 según leyenda de plano N° AUM-001-2006-INC/DPHCR
742,Inmueble Identificado para su Declaración,,Parque Hernán Velarde N° 40-42. N° 58 según leyenda de plano N° AUM-001-2006-INC/DPHCR
743,Inmueble Identificado para su Declaración,,Parque Hernán Velarde N° 44-46-48. N° 59 según leyenda de plano N° AUM-001-2006-INC/DPHCR
744,Inmueble Identificado para su Declaración,,Parque Hernán Velarde N° 52-54. N° 60 según leyenda de plano N° AUM-001-2006-INC/DPHCR
745,Inmueble Identificado para su Declaración,,Parque Hernán Velarde N° 64. N° 62 según leyenda de plano N° AUM-001-2006-INC/DPHCR
746,Inmueble Identificado para su Declaración,,Parque Hernán Velarde N° 66. N° 63 según leyenda de plano N° AUM-001-2006-INC/DPHCR
747,Inmueble Identificado para su Declaración,,Parque Hernán Velarde N° 68. N° 64 según leyenda de plano N° AUM-001-2006-INC/DPHCR
748,Inmueble Identificado para su Declaración,,Parque Hernán Velarde N° 76-78-80. N° 65 según leyenda de plano N° AUM-001-2006-INC/DPHCR
749,Inmueble Identificado para su Declaración,,Parque Hernán Velarde N° 86-88. N° 66 según leyenda de plano N° AUM-001-2006-INC/DPHCR
750,Inmueble Identificado para su Declaración,,Parque Hernán Velarde N° 92-94-98. N° 67 según leyenda de plano N° AUM-001-2006-INC/DPHCR
751,Inmueble Identificado para su Declaración,,Parque Hernán Velarde N° 95-97. N° 68 según leyenda de plano N° AUM-001-2006-INC/DPHCR
752,Inmueble Identificado para su Declaración,,Parque Hernán Velarde N° 93. N° 69 según leyenda de plano N° AUM-001-2006-INC/DPHCR
753,Inmueble Identificado para su Declaración,,Parque Hernán Velarde N° 85-87. N° 70 según leyenda de plano N° AUM-001-2006-INC/DPHCR
754,Inmueble Identificado para su Declaración,,Parque Hernán Velarde N° 77-79. N° 71 según leyenda de plano N° AUM-001-2006-INC/DPHCR
755,Inmueble Identificado para su Declaración,,Parque Hernán Velarde N° 71-75. N° 72 según leyenda de plano N° AUM-001-2006-INC/DPHCR
756,Inmueble Identificado para su Declaración,,Parque Hernán Velarde N° 61-63. N° 73 según leyenda de plano N° AUM-001-2006-INC/DPHCR
757,Inmueble Identificado para su Declaración,,Parque Hernán Velarde N° 19. N° 75 según leyenda de plano N° AUM-001-2006-INC/DPHCR
758,Inmueble Identificado para su Declaración,,Parque Hernán Velarde N° 17. N° 76 según leyenda de plano N° AUM-001-2006-INC/DPHCR
759,Inmueble Identificado para su Declaración,,Inca Garcilazo de la Vega (Ex Av Wilson) 1592-1584-1580 esq Jr. Tarma N° 118-122-126-130. N° 117 seg
760,Inmueble Identificado para su Declaración,,Inca Garcilazo de la Vega (Ex Av Wilson) 1548-1546-1530. N° 116 según leyenda de plano N° AUM-001-20
761,Inmueble Identificado para su Declaración,,Inca Garcilazo de la Vega (Ex Av Wilson) 1670-1680. N° 118 según leyenda de plano N° AUM-001-2006-IN
762,Inmueble Identificado para su Declaración,,Inca Garcilazo de la Vega (Ex Av Wilson) 1686-1698 esq. Jr. Huancayo N° 124. N° 119 según leyenda de
763,Inmueble Identificado para su Declaración,,Hernán Velarde N° 16-18-20. N° 50 según leyenda de plano N° AUM-001-2006-INC/DPHCR
764,Inmueble Identificado para su Declaración,,Inca Garcilazo de la Vega (Ex Av Wilson) 1710-1714-1734 esq. Jr. Huancayo s/n. N° 120 según leyenda
765,Inmueble Identificado para su Declaración,,9 de Diciembre 323-321-319-313. N° 83 según leyenda de plano N° AUM-001-2006-INC/DPHCR
766,Inmueble Identificado para su Declaración,,9 de Diciembre 300-302-310-318 esq. Jr. Washington N° 1492-1490-1488-1486-1484-1482-1480-1478-1476-1
767,Inmueble Identificado para su Declaración,,9 de Diciembre 340. N° 114 según leyenda de plano N° AUM-001-2006-INC/DPHCR
768,Inmueble Identificado para su Declaración,,9 de Diciembre 346. N° 113 según leyenda de plano N° AUM-001-2006-INC/DPHCR
769,Inmueble Identificado para su Declaración,,9 de Diciembre 350. N° 112 según leyenda de plano N° AUM-001-2006-INC/DPHCR
770,Inmueble Identificado para su Declaración,,9 de Diciembre 370-372-376-378. N° 111 según leyenda de plano N° AUM-001-2006-INC/DPHCR
771,Inmueble Identificado para su Declaración,,9 de Diciembre 388-390-392. N° 110 según leyenda de plano N° AUM-001-2006-INC/DPHCR
772,Inmueble Identificado para su Declaración,,9 de Diciembre 400-402-404 esq. Jr. Chota N° 1486-1490-1492-1494-1496. N° 109 según leyenda de plano
773,Inmueble Identificado para su Declaración,,Washington N° 1980-1984 esq. Av. 28 de Julio N° 987. N° 121 según leyenda de plano N° AUM-001-2006-I
774,Inmueble Identificado para su Declaración,,Washington N° 1585-1573-1565. N° 123 según leyenda de plano N° AUM-001-2006-INC/DPHCR
775,Inmueble Identificado para su Declaración,,Chota N° 1574-1576-1580-1586-1588-1594-1598 esq. Jr Tarma N° 348-350-354. N° 124 según leyenda de p
776,Inmueble Identificado para su Declaración,,Chota N° 1559-1555-1553-1551. N° 125 según leyenda de plano N° AUM-001-2006-INC/DPHCR VERIFICAR NUME
777,Inmueble Identificado para su Declaración,,Chota N° 1595-1591-1589-1587. N° 126 según leyenda de plano N° AUM-001-2006-INC/DPHCR
778,Inmueble De Valor Monumental,,Ica 997-999
779,Inmueble De Valor Monumental,,Tayacaja 426-432
780,Inmueble De Valor Monumental,,"Puno 542, 552, 554"
