categoria,direccion,formatted_address,latitud,longitud,nombre,nro,place_id,types
Monumento,De la Unión 459-463,"Jirón de la Unión 459, Cercado de Lima 15001, Peru",-12.0468593,-77.0317267,ANTIGUA FOTOGRAFIA COURRET,7,ChIJ79Vkc7bIBZER-gUscWfLQJg,"['establishment', 'point_of_interest']"
Monumento,Plaza de Armas,"Jirón Carabaya, Cercado de Lima 15001, Peru",-12.0467484,-77.0297099,BASILICA CATEDRAL E IGLESIA DEL SAGRARIO,28,ChIJj3gYm7bIBZER20Ckbpo_SgI,"['church', 'establishment', 'place_of_worship', 'point_of_interest']"
Monumento,De la Unión 218,"Jirón de la Unión 224, Cercado de Lima 15001, Peru",-12.0441292,-77.03043829999999,CASA ALIAGA,46,ChIJu-mVUrTIBZERN5yBElGYhVw,"['establishment', 'point_of_interest']"
Monumento,Conde de Superunda No. 166-170-178-184-188-196 esquina Jr Camaná No. 121-123-125-147-157-165-169-189,"Correo Central, Conde De Superunda 170, Cercado de Lima 15001, Peru",-12.0443399,-77.03098879999997,CASA DE CORREOS Y TELEGRAFOS,62,ChIJSUoXsrXIBZERJ98fm9oqw6k,['premise']
Monumento,"A. N. Wiesse 187-189-193 (Carabaya) antes Pescadería, esquina Jr Junín (Antes Arzobispo) Nº 201-203-","Augusto Wiese, Cercado de Lima 15001, Peru",-12.0457353,-77.02952690000002,CASA DEL OIDOR,80,ChIJ5VTqJLTIBZERpF6XryU-fQg,"['establishment', 'point_of_interest']"
Monumento,De la Unión 498 esquina Jr Ica 112,"Jirón de la Unión 498, Cercado de Lima 15001, Peru",-12.0469989,-77.03205890000002,CASA WELSH,105,ChIJJ7I9DbbIBZERMIIK93j4Pto,"['cafe', 'establishment', 'food', 'point_of_interest', 'store']"
Monumento,De la Unión cuadra 3,"Lima, Peru",-12.045303,-77.030963,MUNICIPALIDAD DE LIMA,229,ChIJxz7uGfbFBZERSi5FzLlsIBQ,"['colloquial_area', 'locality', 'political']"
Monumento,Plaza de Armas,"Jirón Carabaya, Cercado de Lima 15001, Peru",-12.0460759,-77.0296576,PALACIO ARZOBISPAL,237,ChIJ1dDHJ7TIBZERfexJe1lS_ao,"['establishment', 'museum', 'point_of_interest']"
Monumento,Plaza Mayor de Lima,"Jirón de la Unión s/n, Cercado de Lima 15001, Peru",-12.0448456,-77.0297865,PALACIO DE GOBIERNO,238,ChIJx2JW07XIBZER6zG9zKW98BU,"['establishment', 'point_of_interest', 'premise']"
Ambiente Urbano Monumental,,"Plaza central Lima, Cercado de Lima 15001, Peru",-12.0460038,-77.0305458,PLAZA DE ARMAS DE LIMA,248,ChIJsX6q1bXIBZERqiIeSAseBhY,"['establishment', 'point_of_interest']"
Monumento,De la Unión 465-471-477,"Jirón de la Unión 465, Cercado de Lima 15001, Peru",-12.0467819,-77.03183659999998,,327,EjRKaXLDs24gZGUgbGEgVW5pw7NuIDQ2NSwgQ2VyY2FkbyBkZSBMaW1hIDE1MDAxLCBQZXJ1IhsSGQoUChIJkdBFdLbIBZERmuhsNiVvNFcQ0QM,['street_address']
Monumento,De la Unión 466-468-474,"Jirón de la Unión 466, Cercado de Lima 15001, Peru",-12.0467649,-77.03187,,328,ChIJR7Fmc7bIBZERsVXM-9TH-zE,['street_address']
Monumento,A.N.Wiese 153-157-161-173-177-181-185(Carabaya),"Jirón Carabaya 177, Cercado de Lima 15001, Peru",-12.0456132,-77.0296005,,463,EjBKaXLDs24gQ2FyYWJheWEgMTc3LCBDZXJjYWRvIGRlIExpbWEgMTUwMDEsIFBlcnUiGxIZChQKEgkJ7BU8tMgFkRGqCTFkKjnpMxCxAQ,['street_address']
Monumento,A.N.Wiese 346-350-354-358-364(Carabaya),"Jirón Carabaya 354, Cercado de Lima 15001, Peru",-12.0473013,-77.0308594,,464,EjBKaXLDs24gQ2FyYWJheWEgMzU0LCBDZXJjYWRvIGRlIExpbWEgMTUwMDEsIFBlcnUiGxIZChQKEgmd8ahjtsgFkREOejOT4FYf-BDiAg,['street_address']
Monumento,A. N. Wiesse 330(Carabaya),"Jirón Carabaya 330, Cercado de Lima 15001, Peru",-12.0471154,-77.03073169999998,,679,EjBKaXLDs24gQ2FyYWJheWEgMzMwLCBDZXJjYWRvIGRlIExpbWEgMTUwMDEsIFBlcnUiGxIZChQKEgmd8ahjtsgFkREOejOT4FYf-BDKAg,['street_address']
Monumento,A. N. Wiesse 354(Carabaya),"Jirón Carabaya 354, Cercado de Lima 15001, Peru",-12.0473013,-77.0308594,,680,EjBKaXLDs24gQ2FyYWJheWEgMzU0LCBDZXJjYWRvIGRlIExpbWEgMTUwMDEsIFBlcnUiGxIZChQKEgmd8ahjtsgFkREOejOT4FYf-BDiAg,['street_address']
