{
"type": "FeatureCollection",
"name": "Batas_Administrasi",
"crs": { "type": "name", "properties": { "name": "urn:ogc:def:crs:OGC:1.3:CRS84" } },
"features": [
{ "type": "Feature", "properties": { "OBJECTID_1": 35, "KELURAHAN": "Tinalan", "KECAMATAN": "Pesantren", "KOTA": "Kediri", "SUMBER": "Permendagri No. 73 Tahun 2014, RBI dan Hasil FGD Kelurahan Tahun 2018", "Shape_Leng": 5624.4370272599999, "Shape_Area": 777519.09602900001 }, "geometry": { "type": "MultiPolygon", "coordinates": [ [ [ [ 112.047965151535792, -7.846495439452514 ], [ 112.048058159570914, -7.846636920673435 ], [ 112.048070701749594, -7.846605683488435 ], [ 112.048098442374041, -7.846536600270024 ], [ 112.048100473096682, -7.84653154224364 ], [ 112.0481322129571, -7.8464524950681 ], [ 112.048141457348137, -7.846427753467151 ], [ 112.048153709121195, -7.846391742595607 ], [ 112.048231457540894, -7.846457564930529 ], [ 112.048294576283809, -7.846522518371616 ], [ 112.048295778076309, -7.84652399228809 ], [ 112.048301319716131, -7.846529457431469 ], [ 112.048339202908352, -7.846566822132844 ], [ 112.048394524863696, -7.84661381701056 ], [ 112.048462934655888, -7.846660216724826 ], [ 112.048665784551602, -7.846790491522529 ], [ 112.048790109994258, -7.846854737932297 ], [ 112.048926334990384, -7.846923741707766 ], [ 112.048974518335797, -7.846943966417022 ], [ 112.04899593341743, -7.846949320530741 ], [ 112.049022107468616, -7.846951105715015 ], [ 112.049074455547725, -7.846946346415785 ], [ 112.049143645203259, -7.84693983487209 ], [ 112.049175582793666, -7.84693682855678 ], [ 112.049176443375785, -7.846936777572692 ], [ 112.049246982886586, -7.846932554434548 ], [ 112.049310812743741, -7.846955487701766 ], [ 112.049366967163721, -7.846974523982104 ], [ 112.049408369315671, -7.846989751471977 ], [ 112.049451201138254, -7.847005456540593 ], [ 112.049484036723499, -7.847020208862992 ], [ 112.049516873744253, -7.84703734069468 ], [ 112.049548281964775, -7.847055424818428 ], [ 112.049575408350805, -7.847065894497245 ], [ 112.049611100358263, -7.847078267403425 ], [ 112.049639653451365, -7.847087309969877 ], [ 112.049659164904924, -7.847090165375739 ], [ 112.049679629152976, -7.847096827799468 ], [ 112.049699616577357, -7.847105393396123 ], [ 112.049722459188004, -7.84712157427778 ], [ 112.049752915820534, -7.847136327084836 ], [ 112.049782421473424, -7.847147272866429 ], [ 112.049808118776127, -7.847158217294062 ], [ 112.049826202684613, -7.847170115879627 ], [ 112.049846190941153, -7.847190578139373 ], [ 112.049857612774659, -7.847215324278271 ], [ 112.049869509920072, -7.84724768530816 ], [ 112.049895295199036, -7.847300917234359 ], [ 112.049897215728365, -7.847302193998252 ], [ 112.049899201315995, -7.847303373827414 ], [ 112.049902107414468, -7.84730489141977 ], [ 112.049905086577297, -7.847306249652787 ], [ 112.04990813348077, -7.847307495569308 ], [ 112.049911229153594, -7.847308659062374 ], [ 112.049914359145674, -7.847309764587246 ], [ 112.049932803377928, -7.847306220289122 ], [ 112.049971827287621, -7.847300033490087 ], [ 112.050045113625117, -7.847284805673221 ], [ 112.050148382826578, -7.84725672815861 ], [ 112.050265928157927, -7.84722198834121 ], [ 112.050325889658012, -7.847205807924466 ], [ 112.050360630657778, -7.84719628996948 ], [ 112.050378714639152, -7.847196289144579 ], [ 112.050404412464175, -7.847200571613369 ], [ 112.050437724912413, -7.847213421584764 ], [ 112.050477223598676, -7.847231981958891 ], [ 112.050504825619015, -7.84725054127937 ], [ 112.050543421829019, -7.847284975472254 ], [ 112.050546009979413, -7.847287372944727 ], [ 112.050548550251733, -7.847289846507534 ], [ 112.050556015721156, -7.847297526246278 ], [ 112.050578135748111, -7.847321022880951 ], [ 112.05059539654674, -7.84733921730616 ], [ 112.050632572578465, -7.84737803149695 ], [ 112.050637432540057, -7.847383263158173 ], [ 112.050639804564028, -7.847385914405638 ], [ 112.05064211501012, -7.847388603792258 ], [ 112.050644333989538, -7.847391347672116 ], [ 112.050646429810911, -7.847394166925891 ], [ 112.05064835266181, -7.847397089714807 ], [ 112.050649884058842, -7.847399792803982 ], [ 112.050651275995236, -7.847402580351925 ], [ 112.050652561978552, -7.847405432377864 ], [ 112.050653768269768, -7.847408332536758 ], [ 112.050656023279629, -7.847414228211508 ], [ 112.050658154222262, -7.847420198358031 ], [ 112.050660488522254, -7.847426969308099 ], [ 112.05068554630985, -7.847500703353328 ], [ 112.050687884839078, -7.847507352196574 ], [ 112.050689074570911, -7.847510520103343 ], [ 112.050690352863867, -7.847513921127953 ], [ 112.05069167425944, -7.847517150206142 ], [ 112.050693090738235, -7.847520320259942 ], [ 112.050694635803296, -7.84752340949975 ], [ 112.050696359257955, -7.847526386146671 ], [ 112.050698315519824, -7.847529250064835 ], [ 112.050700450169018, -7.847532000485722 ], [ 112.050702716125372, -7.847534670085813 ], [ 112.050705077162704, -7.84753727975709 ], [ 112.050707503396723, -7.847539847662465 ], [ 112.050712479929913, -7.847544908096968 ], [ 112.050723296790181, -7.847555534185297 ], [ 112.050742977528088, -7.847574866643663 ], [ 112.050770827056169, -7.847602403447357 ], [ 112.050791032117957, -7.847622495206137 ], [ 112.050813690830211, -7.847645236197081 ], [ 112.05081874796052, -7.847650246685893 ], [ 112.05082386555749, -7.847655137640873 ], [ 112.050826468123262, -7.847657495280832 ], [ 112.05082912033339, -7.847659757833251 ], [ 112.050831840224888, -7.847661884554429 ], [ 112.05083465578403, -7.847663823822846 ], [ 112.050837601295882, -7.847665504104127 ], [ 112.050840750126582, -7.847666886325213 ], [ 112.05088425680286, -7.847686909934285 ], [ 112.050909240711249, -7.847696903719576 ], [ 112.050933510883468, -7.847705471215379 ], [ 112.05096991644966, -7.847707612378726 ], [ 112.051018458195571, -7.847707612320614 ], [ 112.051115239272477, -7.847702762568215 ], [ 112.051186210250393, -7.847691194167486 ], [ 112.051232609033235, -7.847684055468938 ], [ 112.051266873493148, -7.847677630820363 ], [ 112.051305421309124, -7.847679772028874 ], [ 112.051348964454277, -7.847690480027226 ], [ 112.051397505590188, -7.847711895555662 ], [ 112.051430341700922, -7.847733310529001 ], [ 112.051446047095411, -7.847752584147429 ], [ 112.051447625894525, -7.847764763568237 ], [ 112.051451043399382, -7.847791131369067 ], [ 112.051460324411877, -7.847822539288933 ], [ 112.051471030595621, -7.847842528128663 ], [ 112.051496016097332, -7.84786108758044 ], [ 112.051520285396023, -7.847868939649944 ], [ 112.051535277552134, -7.84786893926312 ], [ 112.051564544694202, -7.847860373667583 ], [ 112.051589333941408, -7.84784451159393 ], [ 112.051605946552385, -7.847836816919621 ], [ 112.051627361882325, -7.847835388685163 ], [ 112.051650918384112, -7.84784038548373 ], [ 112.051663766908433, -7.847857518248675 ], [ 112.051677288118839, -7.847895465331493 ], [ 112.051685897001832, -7.847919622425405 ], [ 112.051699459351241, -7.847935327143088 ], [ 112.051712308151707, -7.847942465222726 ], [ 112.051738006935608, -7.84794674850417 ], [ 112.051766560097931, -7.847945320507868 ], [ 112.051795016507441, -7.847938958267203 ], [ 112.051854361974648, -7.84793604059367 ], [ 112.051897192526937, -7.847937468307866 ], [ 112.051946446856206, -7.847948890013858 ], [ 112.052001412995196, -7.847970304775748 ], [ 112.052042815527386, -7.84798886384131 ], [ 112.052073872665204, -7.848003603201949 ], [ 112.052066682366203, -7.848020607888692 ], [ 112.051477178677516, -7.84940780526841 ], [ 112.051474073527473, -7.849414786064068 ], [ 112.051464486112948, -7.849413769046961 ], [ 112.051445635478771, -7.849409370967171 ], [ 112.051436682061649, -7.849407281538214 ], [ 112.051384183970811, -7.849395032222041 ], [ 112.051350271524285, -7.849387119241822 ], [ 112.05126861052949, -7.849382730705771 ], [ 112.051274027140906, -7.849405180109062 ], [ 112.051269317694292, -7.849441086275321 ], [ 112.051208034633135, -7.849608905182802 ], [ 112.051176946303016, -7.849694037615413 ], [ 112.051150823919144, -7.849765571525049 ], [ 112.051132874231669, -7.849814724270623 ], [ 112.051060090866983, -7.849981172776493 ], [ 112.05102979886685, -7.850050447021147 ], [ 112.050992037553087, -7.85011198457391 ], [ 112.050969777292622, -7.850148259276613 ], [ 112.050906547512412, -7.850310236892944 ], [ 112.050861815149091, -7.850424829431312 ], [ 112.050828396978943, -7.850510436159534 ], [ 112.050815414689779, -7.850543693162255 ], [ 112.050659261279037, -7.850891394690779 ], [ 112.050637562692074, -7.850939711163825 ], [ 112.050627038993582, -7.850963144603 ], [ 112.050457517104618, -7.85136849611678 ], [ 112.050443961256974, -7.851400910727851 ], [ 112.050365959280299, -7.851695066494204 ], [ 112.050320426121843, -7.85177800830647 ], [ 112.050442867486552, -7.85184720945819 ], [ 112.050578832047478, -7.851924052551333 ], [ 112.050223839034174, -7.852651692386198 ], [ 112.050012346719924, -7.85252539539171 ], [ 112.049629829810002, -7.853389152919903 ], [ 112.049940164569009, -7.853505846175661 ], [ 112.049392367669157, -7.855053882239738 ], [ 112.049391880525235, -7.855055289820593 ], [ 112.049389930220116, -7.855054450870281 ], [ 112.049383981249079, -7.855051893565387 ], [ 112.049370861187896, -7.855046252923484 ], [ 112.049333554819981, -7.855030214907996 ], [ 112.049322280710214, -7.855024670046622 ], [ 112.049317394205062, -7.855022267456786 ], [ 112.049281593125244, -7.855004661945761 ], [ 112.04927280449796, -7.855000339978599 ], [ 112.049228113995781, -7.854978363003799 ], [ 112.049221388579525, -7.854975055161227 ], [ 112.049186995066847, -7.854958141622856 ], [ 112.049176676287502, -7.854953067381657 ], [ 112.048914915537921, -7.854824343152705 ], [ 112.048893589647435, -7.854813855407905 ], [ 112.048524537673131, -7.854632368222786 ], [ 112.048451832661058, -7.854600377703001 ], [ 112.04842656437539, -7.854589260342085 ], [ 112.048286592303157, -7.85452767233926 ], [ 112.048191414537555, -7.854491505142653 ], [ 112.04818633300799, -7.854490173851586 ], [ 112.048111464189816, -7.854470565580889 ], [ 112.048018905957875, -7.854436627524811 ], [ 112.047997249999312, -7.854428686480109 ], [ 112.047948804428387, -7.854408407255633 ], [ 112.047915396978027, -7.854394422351425 ], [ 112.047854482271489, -7.85435064040952 ], [ 112.047829323300263, -7.854329208786032 ], [ 112.047813965241858, -7.854316126713415 ], [ 112.047803086350456, -7.854306859152706 ], [ 112.047749786607483, -7.854247847759579 ], [ 112.047706003511252, -7.854215487462745 ], [ 112.047650800854399, -7.854185030469614 ], [ 112.047573915558132, -7.854154433046185 ], [ 112.047484451506918, -7.854118831163157 ], [ 112.047464250122999, -7.854110791499774 ], [ 112.04724781251663, -7.854039775154018 ], [ 112.047091896761131, -7.853988616342313 ], [ 112.047073083208545, -7.853982442628418 ], [ 112.047046389740999, -7.853995798585852 ], [ 112.047029736789412, -7.854005627641087 ], [ 112.047008194716582, -7.85402793533265 ], [ 112.046990241641439, -7.854045927259785 ], [ 112.046954224928015, -7.854037402393567 ], [ 112.046642830281797, -7.853881679467493 ], [ 112.04653181247977, -7.853821653917388 ], [ 112.046505820188358, -7.853791567210156 ], [ 112.046501361008154, -7.853735583231305 ], [ 112.04651418239041, -7.853680992452318 ], [ 112.0466501680541, -7.853361915328994 ], [ 112.046654426868486, -7.853337496362356 ], [ 112.045608856034775, -7.852934998174725 ], [ 112.046608449749442, -7.850282753679292 ], [ 112.04470418141193, -7.849335482839121 ], [ 112.045058837939322, -7.848453899606257 ], [ 112.045194812842169, -7.848130515246115 ], [ 112.045378837549919, -7.847679607297221 ], [ 112.045467340889289, -7.847462751718508 ], [ 112.046245103861324, -7.845557021289079 ], [ 112.046256721348328, -7.845561453892903 ], [ 112.046279845567867, -7.845570276867258 ], [ 112.04777681996606, -7.846359093861189 ], [ 112.047883477280067, -7.846417094354822 ], [ 112.047906675673232, -7.846431966678964 ], [ 112.047923629846082, -7.846444757211342 ], [ 112.047936597744538, -7.846457843464758 ], [ 112.047948970990092, -7.846470693337227 ], [ 112.047965151535792, -7.846495439452514 ] ] ], [ [ [ 112.028715320029221, -7.826234114829491 ], [ 112.028718865791831, -7.826234724807986 ], [ 112.02871907327031, -7.826233900374011 ], [ 112.028726051785839, -7.826209373532789 ], [ 112.028741909189378, -7.826154920341631 ], [ 112.028751729244618, -7.826121204883546 ], [ 112.028752186110452, -7.826119633693658 ], [ 112.028752279458885, -7.826119237329379 ], [ 112.028754834526836, -7.82611009553665 ], [ 112.028974245965273, -7.82616659418844 ], [ 112.029138429310549, -7.826230126370214 ], [ 112.02937970682585, -7.826356118748366 ], [ 112.029675593232909, -7.826555280131012 ], [ 112.02983192276713, -7.826671992155279 ], [ 112.029990038493764, -7.826784421836451 ], [ 112.030095329349848, -7.826844740167968 ], [ 112.030129594043601, -7.826854378121603 ], [ 112.030133163074098, -7.826851165042155 ], [ 112.030138856379949, -7.826839929081679 ], [ 112.030187846182031, -7.826706732920122 ], [ 112.030234721519292, -7.82657928589845 ], [ 112.030396688391718, -7.826617978509097 ], [ 112.030736950603355, -7.826699832175914 ], [ 112.030956813777152, -7.826768360129265 ], [ 112.031092442850039, -7.826822612262736 ], [ 112.031397489236682, -7.826971566299789 ], [ 112.031545928057056, -7.826851808048453 ], [ 112.031581619915343, -7.826895233358822 ], [ 112.031598275562303, -7.826929140062923 ], [ 112.031614931506581, -7.826977919060209 ], [ 112.031624450408501, -7.827013611357629 ], [ 112.031630398565895, -7.827058821466673 ], [ 112.03162940333408, -7.827078232769849 ], [ 112.031628020430063, -7.827105220449287 ], [ 112.031613805571794, -7.827168784438874 ], [ 112.031565017361885, -7.827411443168015 ], [ 112.031555228389848, -7.827479101499563 ], [ 112.031545103228581, -7.827549087727825 ], [ 112.031523714101851, -7.827696928716431 ], [ 112.031516983024758, -7.827743458632012 ], [ 112.031494296355433, -7.827900266507585 ], [ 112.031493859379964, -7.827903283819401 ], [ 112.031490120187101, -7.82792913135996 ], [ 112.031473701778211, -7.828042615718818 ], [ 112.031455557787439, -7.82816802818062 ], [ 112.03144294634312, -7.828255198151963 ], [ 112.031440899274855, -7.828271005197366 ], [ 112.031439936266196, -7.828278442795347 ], [ 112.031435035779126, -7.828316290317005 ], [ 112.031423442273564, -7.828405822859209 ], [ 112.031421358721204, -7.828421914886339 ], [ 112.031420038807454, -7.828432107318317 ], [ 112.031408516516038, -7.828521096129426 ], [ 112.031387547461762, -7.828683040531375 ], [ 112.031386248019516, -7.828693075544059 ], [ 112.031385424746119, -7.828699434730783 ], [ 112.031374422210547, -7.828784403929309 ], [ 112.031328667628074, -7.829137768997837 ], [ 112.031328146966374, -7.829141792230142 ], [ 112.031314603384942, -7.829246385432845 ], [ 112.031313433888002, -7.829255418029516 ], [ 112.031298411093161, -7.82937144311004 ], [ 112.03128974220671, -7.829438393253369 ], [ 112.031287480181319, -7.829457147427099 ], [ 112.031286547810183, -7.829464874364753 ], [ 112.031286438488848, -7.829465781766091 ], [ 112.031286033196778, -7.829469144489123 ], [ 112.031283974707534, -7.829486210516007 ], [ 112.031283772945045, -7.829487882378935 ], [ 112.03128077674522, -7.829512716959871 ], [ 112.031254010181215, -7.829734637729167 ], [ 112.031247786720712, -7.829786236585441 ], [ 112.031241884112944, -7.829835172042389 ], [ 112.031240809539369, -7.829844081405683 ], [ 112.031240071819198, -7.829850195285132 ], [ 112.031238881706869, -7.829860065425798 ], [ 112.031235049141387, -7.829891838054612 ], [ 112.031231524994581, -7.829921054036213 ], [ 112.031228225723297, -7.829948408169977 ], [ 112.031217803507047, -7.830034817595327 ], [ 112.031216722697906, -7.830043773099318 ], [ 112.031203998448348, -7.83014926600522 ], [ 112.031188875288223, -7.830274647563037 ], [ 112.031183784173308, -7.830316860284832 ], [ 112.031182529172781, -7.830327266905644 ], [ 112.031167338454523, -7.83045320756053 ], [ 112.031162866389124, -7.830491206881049 ], [ 112.031143028122329, -7.830659763448838 ], [ 112.03113941778868, -7.830690445707052 ], [ 112.031138322534787, -7.830705329724254 ], [ 112.031134720998523, -7.830704552590043 ], [ 112.030954845400785, -7.830665640177058 ], [ 112.030881030839097, -7.83065013527856 ], [ 112.030714950585093, -7.830615249879287 ], [ 112.029290488458557, -7.830293502308927 ], [ 112.028229011792661, -7.830050797491817 ], [ 112.027284604048475, -7.829837359368926 ], [ 112.026333057293456, -7.829627491663304 ], [ 112.025646777213765, -7.829472729740445 ], [ 112.025437155434133, -7.829425117902409 ], [ 112.025410116685478, -7.829418677233289 ], [ 112.025391796247249, -7.829414814674213 ], [ 112.025223328085232, -7.829379298794446 ], [ 112.025163295313845, -7.829366642632386 ], [ 112.025130366624765, -7.829359700741231 ], [ 112.025125528362324, -7.829358681460503 ], [ 112.025124188957136, -7.829244085348262 ], [ 112.025051853955873, -7.828877172367897 ], [ 112.025031866772167, -7.828785801016053 ], [ 112.024998553491002, -7.828619238515194 ], [ 112.02497475984822, -7.82846362170923 ], [ 112.024970475853706, -7.828410321838811 ], [ 112.024958579405222, -7.828366063890753 ], [ 112.024923838990716, -7.828252326735164 ], [ 112.024873394889752, -7.82803531915946 ], [ 112.024822949762481, -7.827826402535917 ], [ 112.0248029623354, -7.827732651620888 ], [ 112.024779645610323, -7.827656733152527 ], [ 112.024779698229636, -7.827656740260061 ], [ 112.024779657152877, -7.827656631829141 ], [ 112.024779534990842, -7.827656372556643 ], [ 112.024778298076271, -7.82765234545454 ], [ 112.024765562971027, -7.827613367742017 ], [ 112.024758477310598, -7.827452688953908 ], [ 112.024763581830427, -7.827095660242885 ], [ 112.024766438014424, -7.826751589225399 ], [ 112.024768341407878, -7.826563612110964 ], [ 112.024771672058378, -7.826408947745853 ], [ 112.024781190059741, -7.82611627334875 ], [ 112.024790708817008, -7.825828358923944 ], [ 112.024794990756746, -7.825653231490236 ], [ 112.02479801871641, -7.825490477794839 ], [ 112.025008357723181, -7.825510282906317 ], [ 112.025462358208387, -7.825557395402644 ], [ 112.025690787025923, -7.825588805159745 ], [ 112.025862108368557, -7.825622355131105 ], [ 112.025961331581684, -7.825649481687803 ], [ 112.026104813288313, -7.825690170024057 ], [ 112.026368219674566, -7.825777972787582 ], [ 112.02658337078195, -7.825842932223364 ], [ 112.026583403459853, -7.82584294390134 ], [ 112.026731563635067, -7.825897896927797 ], [ 112.026977123801188, -7.825965712471015 ], [ 112.027092765746431, -7.825987127144688 ], [ 112.027392577434171, -7.826034953770889 ], [ 112.027656696971761, -7.826074215416012 ], [ 112.027958651156922, -7.826119187476016 ], [ 112.028489746876673, -7.826201278072836 ], [ 112.028715320029221, -7.826234114829491 ] ] ] ] } }
]
}
