{
"type": "FeatureCollection",
"name": "Batas_Administrasi",
"crs": { "type": "name", "properties": { "name": "urn:ogc:def:crs:OGC:1.3:CRS84" } },
"features": [
{ "type": "Feature", "properties": { "OBJECTID_1": 38, "KELURAHAN": "Burengan", "KECAMATAN": "Pesantren", "KOTA": "Kediri", "SUMBER": "Permendagri No. 73 Tahun 2014, RBI dan Hasil FGD Kelurahan Tahun 2018", "Shape_Leng": 6342.2064028000004, "Shape_Area": 832394.92803900002 }, "geometry": { "type": "Polygon", "coordinates": [ [ [ 112.037374023307677, -7.820194876006673 ], [ 112.03739790578733, -7.820195935188204 ], [ 112.037487414892141, -7.820191430106979 ], [ 112.03751786788186, -7.82018989734943 ], [ 112.037553723031195, -7.820187873780695 ], [ 112.037559974398576, -7.820187520165291 ], [ 112.037618743483691, -7.820179598635199 ], [ 112.037699690416972, -7.820164444212519 ], [ 112.037736266860392, -7.820157773758081 ], [ 112.037768058745712, -7.820157096890429 ], [ 112.037784854244606, -7.820158369728685 ], [ 112.037798658189985, -7.820159414770598 ], [ 112.03790605824463, -7.82016752659099 ], [ 112.037966578936619, -7.820173332505679 ], [ 112.037997262456784, -7.820176276022608 ], [ 112.038045874787684, -7.820185129249356 ], [ 112.038091504256769, -7.820200571263226 ], [ 112.038135939810104, -7.820218409300674 ], [ 112.03815695715609, -7.820228923951456 ], [ 112.038199005474596, -7.820249961355741 ], [ 112.038240465568748, -7.820277378166012 ], [ 112.038296963671655, -7.820321508737137 ], [ 112.038348286411647, -7.82036798723769 ], [ 112.038358890180689, -7.820377590509511 ], [ 112.038405567247281, -7.820422770828044 ], [ 112.038432251681684, -7.820448600524346 ], [ 112.038517673712803, -7.820544706523586 ], [ 112.038520944234023, -7.820548087336972 ], [ 112.038587947644331, -7.82061734753089 ], [ 112.038604278434974, -7.820634229037235 ], [ 112.038616284023618, -7.820647019642781 ], [ 112.038623885837012, -7.820655119007017 ], [ 112.038641195243542, -7.820668356912791 ], [ 112.038646686082473, -7.820670717504331 ], [ 112.038660292428389, -7.820676565466987 ], [ 112.038705074477761, -7.82068889919208 ], [ 112.038734511120623, -7.820706175332988 ], [ 112.038744072059643, -7.82071435308087 ], [ 112.038769378565547, -7.820736001393873 ], [ 112.038794619200203, -7.820754484400481 ], [ 112.03881983558297, -7.820762798177443 ], [ 112.038841441187017, -7.820766932473353 ], [ 112.038870244331207, -7.820770451235758 ], [ 112.03889004767376, -7.82077339341763 ], [ 112.038906258335402, -7.820778737532279 ], [ 112.038919792551624, -7.820790618137827 ], [ 112.038921889351244, -7.820792458897007 ], [ 112.038935737922657, -7.82081336302099 ], [ 112.038940318094546, -7.820825199638231 ], [ 112.038946606027324, -7.820841452852636 ], [ 112.038955658215755, -7.8208635653256 ], [ 112.038958442950076, -7.820867072140134 ], [ 112.038971304039165, -7.820883268478497 ], [ 112.038990428570699, -7.82090435406559 ], [ 112.038992959413065, -7.82090714520483 ], [ 112.039033758109809, -7.820962629478123 ], [ 112.039046529601279, -7.820979998160861 ], [ 112.039066282833417, -7.821005196397766 ], [ 112.039067592014788, -7.821006867254933 ], [ 112.039069713575714, -7.821008818291315 ], [ 112.039092243576675, -7.821029539149296 ], [ 112.039123498235767, -7.821053990060279 ], [ 112.039131252408225, -7.821059883160224 ], [ 112.039154773740108, -7.821074769880757 ], [ 112.039225805017864, -7.82112501186067 ], [ 112.039237059670555, -7.821127891861536 ], [ 112.039254461876013, -7.821130242113861 ], [ 112.039280277750848, -7.821138553478846 ], [ 112.039285016933846, -7.82114207989834 ], [ 112.039306721229991, -7.821158230033408 ], [ 112.039323534337669, -7.821164769192331 ], [ 112.039334351220575, -7.821172519659307 ], [ 112.039351180620002, -7.821185639328492 ], [ 112.039359017616746, -7.821201174228993 ], [ 112.039356663854662, -7.821219726037129 ], [ 112.039356554423009, -7.821221314466081 ], [ 112.039355987032849, -7.821229509897854 ], [ 112.039355505485702, -7.821236479630733 ], [ 112.039356047433387, -7.821250610745452 ], [ 112.039356136636513, -7.821252940308801 ], [ 112.039357381226651, -7.821266984678171 ], [ 112.0393621959619, -7.821273553375514 ], [ 112.039368807945152, -7.821278921101639 ], [ 112.039389652323081, -7.821281446469487 ], [ 112.039412014195761, -7.821284797451994 ], [ 112.03942342553087, -7.821290153360144 ], [ 112.039441448850667, -7.821300876992758 ], [ 112.039462480200072, -7.821315182856017 ], [ 112.039478156471375, -7.821328852531582 ], [ 112.03948231912058, -7.821332483471718 ], [ 112.039498399838834, -7.821358225237146 ], [ 112.039500649741044, -7.821361828327967 ], [ 112.039523837168261, -7.821383231279128 ], [ 112.039566416047009, -7.821396879923117 ], [ 112.0396272724537, -7.821422822535177 ], [ 112.039700378769211, -7.821453986022139 ], [ 112.039784373070191, -7.8214988951648 ], [ 112.039807300257095, -7.821511153256325 ], [ 112.039833154690683, -7.821535019585338 ], [ 112.039834943087726, -7.821568691210655 ], [ 112.039886537667115, -7.821587853556895 ], [ 112.03989207946907, -7.821589911928294 ], [ 112.040002552199724, -7.821627927431155 ], [ 112.04005664892253, -7.821670867087116 ], [ 112.040060538266772, -7.821672899681634 ], [ 112.040092003549717, -7.821689345882874 ], [ 112.040122721477488, -7.821705401405239 ], [ 112.040125574519877, -7.821707188741837 ], [ 112.040140763493568, -7.821716702880617 ], [ 112.040168383775594, -7.821734004181013 ], [ 112.040192443960095, -7.821760267996239 ], [ 112.040264386938063, -7.821814179461583 ], [ 112.040305432970655, -7.821844938876715 ], [ 112.04035142703512, -7.821886273215651 ], [ 112.040369163138308, -7.821902212387208 ], [ 112.040412422828908, -7.821929624507284 ], [ 112.040444839489624, -7.821939116067631 ], [ 112.040471528312935, -7.821954553825012 ], [ 112.04048809416598, -7.821964136004175 ], [ 112.040516947806765, -7.821987993984822 ], [ 112.040543366185744, -7.821997501227062 ], [ 112.040590776437682, -7.822005360419862 ], [ 112.040633375882265, -7.822008246312724 ], [ 112.040656182881236, -7.822012976268075 ], [ 112.04067540313217, -7.822022500343047 ], [ 112.040695245098789, -7.8220409974285 ], [ 112.040716463782971, -7.822067916680632 ], [ 112.040731953616742, -7.822087568583464 ], [ 112.040772285365094, -7.822134180543356 ], [ 112.04078309046298, -7.82214666833893 ], [ 112.04081784438587, -7.822178887565418 ], [ 112.040846329413938, -7.822199277078923 ], [ 112.040870188415212, -7.822214967786683 ], [ 112.04087949674431, -7.822221090355743 ], [ 112.040927797373868, -7.822248968420485 ], [ 112.040957345629153, -7.822262535988605 ], [ 112.040983305044207, -7.822280418341147 ], [ 112.041005418366311, -7.822302009248448 ], [ 112.041005674735828, -7.822302259140046 ], [ 112.041026117825567, -7.822319948886809 ], [ 112.041044143896343, -7.822331749594919 ], [ 112.041081977544479, -7.822348168246086 ], [ 112.041098458004697, -7.822354390693842 ], [ 112.041116923745406, -7.822361362528936 ], [ 112.041144293950452, -7.822367756181849 ], [ 112.041173097204791, -7.822371274769855 ], [ 112.041223492222898, -7.822372944822879 ], [ 112.041364475638829, -7.822379880297491 ], [ 112.041369402597127, -7.822380122283376 ], [ 112.041427727110332, -7.822382662695761 ], [ 112.041447396577198, -7.822383519487149 ], [ 112.04148760289074, -7.822389403008153 ], [ 112.041525722058026, -7.822400267784289 ], [ 112.04157765374012, -7.822416699533925 ], [ 112.041605510849209, -7.822423777502995 ], [ 112.041638281091167, -7.822432104104283 ], [ 112.041806971437794, -7.822481341230832 ], [ 112.041846597597242, -7.822495003239029 ], [ 112.041932020421569, -7.822534690781404 ], [ 112.041972118725752, -7.822553320483996 ], [ 112.042041400157288, -7.822582353105061 ], [ 112.042351041867278, -7.822712113234375 ], [ 112.042405091405797, -7.82273590974431 ], [ 112.042409105342458, -7.822740629936756 ], [ 112.042437580376301, -7.822774116228193 ], [ 112.042464046376907, -7.822802766130017 ], [ 112.042477333917915, -7.822812028918315 ], [ 112.042508515032949, -7.822833764653036 ], [ 112.042591399663124, -7.82287423973074 ], [ 112.042700700713283, -7.822923025342942 ], [ 112.042799158626153, -7.822953890446872 ], [ 112.042869995260943, -7.822974055778356 ], [ 112.042939650803064, -7.8230014023796 ], [ 112.042984086807223, -7.823019239838208 ], [ 112.0430333064064, -7.823031082746374 ], [ 112.043075328773114, -7.82304294343592 ], [ 112.043212365626687, -7.823084241415506 ], [ 112.043270025764087, -7.82311281505554 ], [ 112.043320040409526, -7.823154806534459 ], [ 112.043345086259876, -7.823191117584658 ], [ 112.043335612155971, -7.823240913823005 ], [ 112.043345305158866, -7.823279177478105 ], [ 112.043369692960624, -7.82333095659849 ], [ 112.043372323295159, -7.823336541205666 ], [ 112.043404450878597, -7.823381451129191 ], [ 112.04335487987305, -7.823526329343825 ], [ 112.043266416084478, -7.823821666757852 ], [ 112.04325483832892, -7.823860317631143 ], [ 112.04327073007434, -7.82386609103713 ], [ 112.04344457345637, -7.823929243602755 ], [ 112.043457506171791, -7.823936570871521 ], [ 112.043478214865999, -7.823948304227878 ], [ 112.043483043989212, -7.823960256827451 ], [ 112.043435398026958, -7.82409916656328 ], [ 112.043702057480957, -7.824222939612592 ], [ 112.043762153205421, -7.824265863858872 ], [ 112.043793394056635, -7.824284929486405 ], [ 112.043810274300853, -7.824318389165292 ], [ 112.043810358531758, -7.824351889485105 ], [ 112.043812852548072, -7.824390171830235 ], [ 112.04381774029865, -7.82442605335656 ], [ 112.043851352910707, -7.824433149476643 ], [ 112.043877735780697, -7.824428297131096 ], [ 112.043899313321489, -7.824421065391692 ], [ 112.043916110246968, -7.824421024743518 ], [ 112.043930513430809, -7.824423381296238 ], [ 112.043952145452437, -7.824437686312096 ], [ 112.043983339607266, -7.82443760823432 ], [ 112.044004935006129, -7.824437555711049 ], [ 112.044048103798232, -7.824427876552859 ], [ 112.044069193347156, -7.824411869545924 ], [ 112.044377571849907, -7.824530366528846 ], [ 112.044551748612719, -7.824591755949081 ], [ 112.04463455329639, -7.824620310530241 ], [ 112.044714503078566, -7.824647435042865 ], [ 112.044817296039994, -7.824680273160294 ], [ 112.044898673404916, -7.824705970547497 ], [ 112.044990045490067, -7.824740234224494 ], [ 112.045075706180228, -7.82476736079901 ], [ 112.045142806606066, -7.824780210072752 ], [ 112.04519563087257, -7.824800197084731 ], [ 112.045264159107575, -7.824843027844565 ], [ 112.045358386489681, -7.824890140648864 ], [ 112.045429770087821, -7.824925832975489 ], [ 112.045583958492287, -7.824990077855714 ], [ 112.046000839567284, -7.825148550299221 ], [ 112.045993602241822, -7.825173245254133 ], [ 112.045798470712498, -7.825728991165231 ], [ 112.04571483235938, -7.825967196681904 ], [ 112.04571221218032, -7.825975531951363 ], [ 112.045827139674088, -7.826017647949984 ], [ 112.045990369677085, -7.826077178995388 ], [ 112.045714223033201, -7.826815054641415 ], [ 112.045672466235402, -7.826800392638106 ], [ 112.045670482874812, -7.826799696631257 ], [ 112.043690032407753, -7.826075521157253 ], [ 112.043225252234137, -7.825910985902428 ], [ 112.043208536338582, -7.825905342065876 ], [ 112.043093932244105, -7.825866643214419 ], [ 112.043043368307607, -7.825851177871233 ], [ 112.043008866123969, -7.825843444475995 ], [ 112.042976149235855, -7.825838090709375 ], [ 112.042918592420591, -7.825830442334886 ], [ 112.042761353715974, -7.825777032601986 ], [ 112.042537138302265, -7.825692348032652 ], [ 112.042065409842195, -7.82552043222204 ], [ 112.041500287991255, -7.825311634483133 ], [ 112.040917915169359, -7.825098078722169 ], [ 112.040484258543117, -7.824935680108634 ], [ 112.039901289848487, -7.824722123370983 ], [ 112.039409337229444, -7.8245436636418 ], [ 112.038922142437826, -7.824364014016371 ], [ 112.03835226179838, -7.824157001449199 ], [ 112.037779405933307, -7.823947013484199 ], [ 112.037161341208531, -7.823725129607039 ], [ 112.036090373373042, -7.823330337474471 ], [ 112.036077739883936, -7.823325878045272 ], [ 112.035562158857246, -7.823143894421448 ], [ 112.035548420699499, -7.823139046071581 ], [ 112.035330544505086, -7.823062142359584 ], [ 112.035188248636615, -7.823011916235294 ], [ 112.035131909959617, -7.822992030556946 ], [ 112.034584538359908, -7.822807760346486 ], [ 112.034583497275207, -7.822810726683132 ], [ 112.034471701962758, -7.823129541998253 ], [ 112.034446602570895, -7.823201118730981 ], [ 112.034234666992475, -7.823841983903029 ], [ 112.033985894274636, -7.823804356422389 ], [ 112.033418736883306, -7.823718571273734 ], [ 112.033417312489661, -7.823718355891972 ], [ 112.033416054078515, -7.823718515438228 ], [ 112.033215812736628, -7.823743974969238 ], [ 112.03224800074581, -7.823660252422386 ], [ 112.032247382094752, -7.823660198765904 ], [ 112.032216044903066, -7.823723460959357 ], [ 112.031974987853843, -7.82421010159552 ], [ 112.031946531178136, -7.824267547638922 ], [ 112.031774554141478, -7.824669113161503 ], [ 112.031476123464941, -7.824589465066333 ], [ 112.030969843420976, -7.82445434456551 ], [ 112.03068683904749, -7.824371839102476 ], [ 112.030623437070957, -7.824581223644936 ], [ 112.03059975982913, -7.824659418937181 ], [ 112.030515992932166, -7.824936056224259 ], [ 112.030514520242122, -7.824940919275732 ], [ 112.030416414098639, -7.825264915411808 ], [ 112.030374944846486, -7.825401867362055 ], [ 112.030371241976539, -7.825414096038982 ], [ 112.030368655507701, -7.825413019763093 ], [ 112.030346875265366, -7.82540396542936 ], [ 112.030072647577995, -7.825300432103546 ], [ 112.029989862140155, -7.825269176618306 ], [ 112.029264866196556, -7.825032819739407 ], [ 112.029236692924812, -7.825022958817912 ], [ 112.029156538257027, -7.824994903815437 ], [ 112.029068105353019, -7.824963951321561 ], [ 112.029065292381759, -7.824962966031427 ], [ 112.028920428369176, -7.825476970158849 ], [ 112.028835244421558, -7.82582199313031 ], [ 112.028762514134456, -7.826082626711115 ], [ 112.028760625244729, -7.826089381015298 ], [ 112.028754834526836, -7.82611009553665 ], [ 112.028752279458885, -7.826119237329379 ], [ 112.028752186110452, -7.826119633693658 ], [ 112.028751729244618, -7.826121204883546 ], [ 112.028741909189378, -7.826154920341631 ], [ 112.028726051785839, -7.826209373532789 ], [ 112.02871907327031, -7.826233900374011 ], [ 112.028718865791831, -7.826234724807986 ], [ 112.028715320029221, -7.826234114829491 ], [ 112.028489746876673, -7.826201278072836 ], [ 112.027958651156922, -7.826119187476016 ], [ 112.027656696971761, -7.826074215416012 ], [ 112.027392577434171, -7.826034953770889 ], [ 112.027092765746431, -7.825987127144688 ], [ 112.026977123801188, -7.825965712471015 ], [ 112.026731563635067, -7.825897896927797 ], [ 112.026583403459853, -7.82584294390134 ], [ 112.02658337078195, -7.825842932223364 ], [ 112.026368219674566, -7.825777972787582 ], [ 112.026104813288313, -7.825690170024057 ], [ 112.025961331581684, -7.825649481687803 ], [ 112.025862108368557, -7.825622355131105 ], [ 112.025690787025923, -7.825588805159745 ], [ 112.025462358208387, -7.825557395402644 ], [ 112.025008357723181, -7.825510282906317 ], [ 112.02479801871641, -7.825490477794839 ], [ 112.024798350584945, -7.825472626398096 ], [ 112.024799199833311, -7.825447896514532 ], [ 112.024802195119179, -7.825360512962892 ], [ 112.024802203302627, -7.825360150269525 ], [ 112.024803388546573, -7.825325571311059 ], [ 112.024804254535667, -7.825300268887177 ], [ 112.024805516719084, -7.825263400647929 ], [ 112.024808197644973, -7.825184697604041 ], [ 112.024833181073959, -7.824706919042174 ], [ 112.024849837676726, -7.824330370123568 ], [ 112.024859950747356, -7.823985347181038 ], [ 112.024873429356447, -7.823750601371509 ], [ 112.025006866339268, -7.823780589025503 ], [ 112.025106357667681, -7.8238029488893 ], [ 112.025395063318641, -7.823867831709154 ], [ 112.025830521591629, -7.823965695532221 ], [ 112.025832385603024, -7.823966183911367 ], [ 112.026222346055931, -7.824068330000651 ], [ 112.02647396136139, -7.824134237403924 ], [ 112.026845967998554, -7.824231680139741 ], [ 112.026849062728928, -7.824223653097768 ], [ 112.026849272708361, -7.824223108124662 ], [ 112.026879491825255, -7.824144722483166 ], [ 112.026919008632248, -7.824042219504285 ], [ 112.027095144759812, -7.823585338045161 ], [ 112.02712654887732, -7.823503878998278 ], [ 112.027126566904968, -7.823503833733306 ], [ 112.027442710888465, -7.822683782611839 ], [ 112.027466511496328, -7.822622046706048 ], [ 112.027475675763881, -7.822598275177998 ], [ 112.027693806091378, -7.822003016997015 ], [ 112.027776929268299, -7.821776183637075 ], [ 112.027925184482555, -7.821371606605102 ], [ 112.027934521988811, -7.82137378884891 ], [ 112.027934823019024, -7.821373021166021 ], [ 112.028446856977141, -7.820091705036281 ], [ 112.02911114878485, -7.820338138521534 ], [ 112.02964077446768, -7.820618923648421 ], [ 112.02991988732343, -7.820766898079645 ], [ 112.030598282502538, -7.821000061069875 ], [ 112.031571988700648, -7.821334719915222 ], [ 112.031871894151379, -7.821435686366286 ], [ 112.031933998408064, -7.821297916061671 ], [ 112.032118232093552, -7.821366309275319 ], [ 112.032279463727093, -7.82095150128408 ], [ 112.032357303630064, -7.820722252806675 ], [ 112.03236777461899, -7.820695602861856 ], [ 112.032379194557024, -7.820661337182011 ], [ 112.032375388075224, -7.82064135155489 ], [ 112.032375603609694, -7.820640856309647 ], [ 112.032398230556765, -7.820589003894607 ], [ 112.032426783625681, -7.820510004363044 ], [ 112.032459145631961, -7.820435764526879 ], [ 112.032487698337533, -7.820375803051982 ], [ 112.032528825236781, -7.820296977166433 ], [ 112.032561831818484, -7.820233716322376 ], [ 112.032670978341926, -7.819969548442652 ], [ 112.03315903402374, -7.81878830257573 ], [ 112.033160737936214, -7.818784178770739 ], [ 112.033165684997144, -7.81877085630809 ], [ 112.033166155289209, -7.818771064983048 ], [ 112.033267833947633, -7.818816275999152 ], [ 112.033268094544866, -7.818816403789231 ], [ 112.03331048557601, -7.818837167757964 ], [ 112.033394869947429, -7.818878502203804 ], [ 112.033460217681153, -7.81890999699946 ], [ 112.033515952578142, -7.818936859354324 ], [ 112.033571060063267, -7.81896341935126 ], [ 112.03358902365828, -7.818972076812257 ], [ 112.033711023405317, -7.819030876629683 ], [ 112.033714598467313, -7.819032361076157 ], [ 112.033806899133268, -7.81907067246931 ], [ 112.033998990170488, -7.819150406142891 ], [ 112.034103622944798, -7.819193837035736 ], [ 112.034245337267109, -7.819252659848267 ], [ 112.034278143792932, -7.819266277843174 ], [ 112.034334580421415, -7.819289702465047 ], [ 112.034479770954391, -7.819355507843817 ], [ 112.034603993942525, -7.81941181024719 ], [ 112.034605550123288, -7.819412515499654 ], [ 112.034847239350626, -7.819514669887566 ], [ 112.034979307821828, -7.819570490780711 ], [ 112.035018332373809, -7.819587873041793 ], [ 112.035207995014503, -7.819672348503933 ], [ 112.03521251457768, -7.819674362419605 ], [ 112.035351164731978, -7.81973612898325 ], [ 112.03537807387724, -7.819747617868435 ], [ 112.035406892264859, -7.819759921474319 ], [ 112.035541383637863, -7.819807450838533 ], [ 112.035566882704174, -7.8198134877075 ], [ 112.035589402644973, -7.819818819198805 ], [ 112.035623010376142, -7.81982447983455 ], [ 112.035670057169384, -7.819831064379446 ], [ 112.035748828102754, -7.819857672735181 ], [ 112.035837561933292, -7.819888519163932 ], [ 112.036012046964487, -7.819949176482823 ], [ 112.036104264536917, -7.819981233460044 ], [ 112.036225711185921, -7.820019637347539 ], [ 112.036293495789749, -7.820041071237631 ], [ 112.036325108354788, -7.820054087834577 ], [ 112.036337691830184, -7.82005926911907 ], [ 112.036349499408374, -7.820068294282681 ], [ 112.036370401415553, -7.820084272007519 ], [ 112.03639275222038, -7.820090882717369 ], [ 112.036419816263717, -7.820098605145448 ], [ 112.036487560383591, -7.820117224546656 ], [ 112.036511495922994, -7.820123980588597 ], [ 112.036558619249249, -7.820128122002791 ], [ 112.036580222768038, -7.820131060783978 ], [ 112.036636053300953, -7.820147674464939 ], [ 112.036675671739317, -7.820158345209101 ], [ 112.036698480094643, -7.82016367321553 ], [ 112.036716388303205, -7.820166018719464 ], [ 112.036730764766432, -7.820167901692219 ], [ 112.036772998984034, -7.820168754859616 ], [ 112.036889154358889, -7.820176127332159 ], [ 112.03695915995749, -7.82017733283161 ], [ 112.037035052564477, -7.820178640529702 ], [ 112.037156676720102, -7.820184956699324 ], [ 112.037193443058825, -7.820186866051902 ], [ 112.037374023307677, -7.820194876006673 ] ] ] } }
]
}
