{
"type": "FeatureCollection",
"name": "Batas_Administrasi",
"crs": { "type": "name", "properties": { "name": "urn:ogc:def:crs:OGC:1.3:CRS84" } },
"features": [
{ "type": "Feature", "properties": { "OBJECTID_1": 33, "KELURAHAN": "Banaran", "KECAMATAN": "Pesantren", "KOTA": "Kediri", "SUMBER": "Permendagri No. 73 Tahun 2014, RBI dan Hasil FGD Kelurahan Tahun 2018", "Shape_Leng": 4779.2595042800003, "Shape_Area": 1048108.53818 }, "geometry": { "type": "Polygon", "coordinates": [ [ [ 112.037864940105052, -7.831166132506909 ], [ 112.038502397622693, -7.831408837322492 ], [ 112.038512391243771, -7.831378856551428 ], [ 112.038927131057378, -7.831543039484806 ], [ 112.039604713948407, -7.831797344958654 ], [ 112.040116295410968, -7.832001815677682 ], [ 112.040982253320351, -7.832344711969369 ], [ 112.04161428875031, -7.832597322938236 ], [ 112.042082762387579, -7.832779496910028 ], [ 112.042697281990215, -7.83301846102251 ], [ 112.042726434651584, -7.833029797231001 ], [ 112.042738096388661, -7.833034674848063 ], [ 112.043677653646384, -7.833427637798243 ], [ 112.043805056420965, -7.833478558457056 ], [ 112.043939472290688, -7.833532279867532 ], [ 112.043867264266993, -7.833741167412833 ], [ 112.043801340386281, -7.833918381174443 ], [ 112.04379589260023, -7.833933026325603 ], [ 112.043721071047798, -7.834142797617294 ], [ 112.0437151690804, -7.834159344073056 ], [ 112.04367153532786, -7.834286452184395 ], [ 112.04363104488047, -7.834404404331129 ], [ 112.043597768488809, -7.834501341664891 ], [ 112.04342655563029, -7.835000097634547 ], [ 112.04340920562197, -7.835050639628172 ], [ 112.043408609551832, -7.835052376680514 ], [ 112.043392954116186, -7.835097983595901 ], [ 112.043396719919301, -7.835097692998424 ], [ 112.043267486612748, -7.835471985835992 ], [ 112.043109470061438, -7.835858904124934 ], [ 112.043103078015434, -7.835876063176266 ], [ 112.043098092635759, -7.835891035482288 ], [ 112.043095579242703, -7.835898584543546 ], [ 112.043167381723308, -7.835927287549445 ], [ 112.043225832510629, -7.835950652264 ], [ 112.043237198749679, -7.835955195952593 ], [ 112.043257943747676, -7.835959035394567 ], [ 112.043291587792467, -7.835965262214597 ], [ 112.043938801672425, -7.836226408678252 ], [ 112.044115477672847, -7.836310766336728 ], [ 112.044112397043861, -7.83632251691958 ], [ 112.044111976588084, -7.836324119683809 ], [ 112.044110072878695, -7.836331385060083 ], [ 112.044084478366557, -7.836398130236423 ], [ 112.044052503239882, -7.836481515309861 ], [ 112.044027165524227, -7.836547591484194 ], [ 112.044020428981369, -7.836565158386636 ], [ 112.043868177207969, -7.836961817660684 ], [ 112.043860002461869, -7.836983114323077 ], [ 112.043820865145477, -7.83708507848246 ], [ 112.043772046425289, -7.83721226458643 ], [ 112.043739863738665, -7.8372961087027 ], [ 112.043730796898828, -7.837319731021212 ], [ 112.043725430794467, -7.837332955133771 ], [ 112.04371106408658, -7.837368357951023 ], [ 112.043593297222515, -7.837658568693731 ], [ 112.043464297700709, -7.837976462507105 ], [ 112.043368066269522, -7.838207054067887 ], [ 112.043287742016147, -7.838399530263573 ], [ 112.043122855508216, -7.838782808198379 ], [ 112.043021017919756, -7.839031620423496 ], [ 112.043021198417406, -7.839031626307453 ], [ 112.043013962822243, -7.839050221855994 ], [ 112.042979480868652, -7.839138842438629 ], [ 112.042977453695741, -7.83913805790209 ], [ 112.042873954415697, -7.839098006105874 ], [ 112.042870331287929, -7.83909660418559 ], [ 112.042829782393696, -7.839080912549969 ], [ 112.042774704911537, -7.839061877975372 ], [ 112.042753562041469, -7.839054570170076 ], [ 112.042682749960804, -7.839030098288456 ], [ 112.042300272241008, -7.838897911965373 ], [ 112.042275080910144, -7.83888920597385 ], [ 112.042080039650983, -7.838821798449561 ], [ 112.042058589057277, -7.83881364573718 ], [ 112.041905315694819, -7.838755391505632 ], [ 112.04148537215832, -7.838595783758367 ], [ 112.04140628037527, -7.83856572291512 ], [ 112.041396995493315, -7.838595824084615 ], [ 112.041353627202511, -7.838723231690625 ], [ 112.041160706598504, -7.839289990676838 ], [ 112.041155830166247, -7.839304317852669 ], [ 112.041127454727075, -7.839286938158704 ], [ 112.041084436891353, -7.839283918820676 ], [ 112.041059640156817, -7.839282178510028 ], [ 112.041032276665049, -7.839269091387162 ], [ 112.041013241072832, -7.839261953740693 ], [ 112.041003722473477, -7.839242917568407 ], [ 112.041003722997459, -7.839222692979568 ], [ 112.041016288833973, -7.839182200990653 ], [ 112.041025137826168, -7.839153687251031 ], [ 112.041020379230133, -7.839117995316284 ], [ 112.041000153702811, -7.839078734789504 ], [ 112.040956133427542, -7.839039473374669 ], [ 112.040920441393055, -7.839021626976822 ], [ 112.040882370235266, -7.839007351669226 ], [ 112.040853816445889, -7.839001402424209 ], [ 112.040816935345532, -7.839006161257927 ], [ 112.040778863084299, -7.839027576075279 ], [ 112.040750310678106, -7.839056130356279 ], [ 112.040728895126847, -7.839094201373923 ], [ 112.040702721372185, -7.839148928146925 ], [ 112.040667836789723, -7.839213688345298 ], [ 112.040665595873321, -7.839216307649191 ], [ 112.040663475794091, -7.839219012574199 ], [ 112.040661479409934, -7.839221858282755 ], [ 112.040659614759775, -7.839224795012039 ], [ 112.040657856392954, -7.83922780021448 ], [ 112.040656190673843, -7.839230861261901 ], [ 112.040654613040758, -7.839233967312585 ], [ 112.040653131644987, -7.839237113824293 ], [ 112.040651761004384, -7.839240303474404 ], [ 112.040650528331781, -7.839243538004536 ], [ 112.04064947628062, -7.839246828162307 ], [ 112.040648618686504, -7.839250267068583 ], [ 112.040647941704833, -7.839253757984854 ], [ 112.040647397233784, -7.839257287463684 ], [ 112.040646945336334, -7.839260842941937 ], [ 112.0406462221449, -7.839268002290773 ], [ 112.040645404565481, -7.839278785874727 ], [ 112.040645023350876, -7.839285967893514 ], [ 112.040644908897775, -7.839289546957328 ], [ 112.04064487241277, -7.839293114071082 ], [ 112.04064494290688, -7.839296664640998 ], [ 112.040645159356316, -7.839300189526607 ], [ 112.040645572536519, -7.839303683175958 ], [ 112.040646142523059, -7.839306773067584 ], [ 112.040646853932444, -7.839309838190513 ], [ 112.04064924371032, -7.839318948817075 ], [ 112.040649933258678, -7.839321976008452 ], [ 112.040650465005285, -7.839325006302973 ], [ 112.040650760059336, -7.839328045322029 ], [ 112.040650758672555, -7.839331137529733 ], [ 112.040650495198733, -7.839334238524733 ], [ 112.040650027673394, -7.839337344545966 ], [ 112.040649398707259, -7.839340449157232 ], [ 112.040648639131959, -7.839343550473507 ], [ 112.04064776706845, -7.839346641214713 ], [ 112.040646790670223, -7.839349717743002 ], [ 112.04064571264017, -7.839352772816365 ], [ 112.040644485177552, -7.839355914178603 ], [ 112.040641799728519, -7.839362133258985 ], [ 112.040633243343905, -7.83938066692581 ], [ 112.040631928513235, -7.839383687311929 ], [ 112.040629416853662, -7.839389767586964 ], [ 112.040627082172037, -7.839395897167736 ], [ 112.040626004215895, -7.839398982086665 ], [ 112.040625009741447, -7.839402083983297 ], [ 112.040624125972769, -7.83940520912127 ], [ 112.040623385566676, -7.839408360133146 ], [ 112.040622774780502, -7.839411846363785 ], [ 112.040622347271508, -7.839415361987381 ], [ 112.040622070364947, -7.839418897136098 ], [ 112.04062193224803, -7.839422442794911 ], [ 112.040621931088907, -7.839425991733032 ], [ 112.040622077752957, -7.839429536688251 ], [ 112.040622401244491, -7.839433070353596 ], [ 112.040622866292864, -7.839436268130201 ], [ 112.040623461009773, -7.839439455637859 ], [ 112.040627028569816, -7.839455361862776 ], [ 112.040627625136651, -7.839458563836523 ], [ 112.040578989307662, -7.83948681229337 ], [ 112.040543297132103, -7.839518934948893 ], [ 112.04050403569093, -7.839558195944909 ], [ 112.040457636970999, -7.839595077862309 ], [ 112.04042075491725, -7.839636717924266 ], [ 112.040382683813988, -7.839673600065662 ], [ 112.040325576747321, -7.839719999383158 ], [ 112.040285125899217, -7.839739035092132 ], [ 112.040250623482677, -7.839752122220446 ], [ 112.04021493131944, -7.839756881691801 ], [ 112.040154255721703, -7.839749741934641 ], [ 112.040081914341613, -7.83972374854011 ], [ 112.04003219100241, -7.839695384875845 ], [ 112.040022869892866, -7.839690125187606 ], [ 112.040013437608636, -7.839685018620255 ], [ 112.040010253811914, -7.839683398529685 ], [ 112.040007038445026, -7.839681848157218 ], [ 112.040003816976551, -7.839680397285759 ], [ 112.039997287430921, -7.839677680257864 ], [ 112.03998737492023, -7.839673853722593 ], [ 112.039892512090248, -7.839638712544845 ], [ 112.039890961590913, -7.839638138449907 ], [ 112.039849765375678, -7.839622536751198 ], [ 112.039826747060872, -7.839613819821099 ], [ 112.039819993775311, -7.839611213681542 ], [ 112.039813285637322, -7.839608526937194 ], [ 112.039809905411644, -7.839607059272078 ], [ 112.039806679535275, -7.839605659057233 ], [ 112.039803442398352, -7.839604106927943 ], [ 112.039800273890748, -7.83960243434161 ], [ 112.039797253857429, -7.839600654667365 ], [ 112.03979429883239, -7.839598757258286 ], [ 112.039791391668956, -7.839596776524577 ], [ 112.039785669435332, -7.839592647512393 ], [ 112.039777203477328, -7.839586247949058 ], [ 112.039726684941215, -7.839547356068143 ], [ 112.039698558657605, -7.839525842467233 ], [ 112.039692879705512, -7.839521611147459 ], [ 112.039687107501976, -7.839517446080286 ], [ 112.039675342231376, -7.839509290139123 ], [ 112.039663397455456, -7.839501162677601 ], [ 112.039654378221243, -7.839495112677925 ], [ 112.039648316368087, -7.839491178951689 ], [ 112.039645255216016, -7.839489275472394 ], [ 112.039642161584496, -7.839487440809011 ], [ 112.039639022841428, -7.839485701220853 ], [ 112.039635820035201, -7.839484094740238 ], [ 112.039632578672553, -7.839482666525132 ], [ 112.039629275960877, -7.839481368697606 ], [ 112.03962592813086, -7.839480163232063 ], [ 112.039619144941597, -7.839477931591692 ], [ 112.039612297675745, -7.839475827632304 ], [ 112.039601979870667, -7.839472774460212 ], [ 112.039595089381322, -7.839470795416903 ], [ 112.039588195522398, -7.839468920389856 ], [ 112.039584746056192, -7.839468057044828 ], [ 112.039581293166478, -7.83946727601027 ], [ 112.039577836938577, -7.83946661165384 ], [ 112.039574374772826, -7.839466112820539 ], [ 112.039570903191887, -7.839465840114945 ], [ 112.039567637276647, -7.839465847271312 ], [ 112.039567383331729, -7.839465847898087 ], [ 112.039563854069812, -7.839466087235434 ], [ 112.039560319783718, -7.839466494806893 ], [ 112.039556779447551, -7.839467022680854 ], [ 112.039549693908143, -7.839468309971731 ], [ 112.039539067291514, -7.839470557449975 ], [ 112.039532007144103, -7.839472209158379 ], [ 112.039524995520438, -7.83947404434377 ], [ 112.039518501172495, -7.83947600577536 ], [ 112.039508863811108, -7.83947925742866 ], [ 112.039502509139311, -7.839481586613428 ], [ 112.039496249223049, -7.839484090116949 ], [ 112.03949317529684, -7.839485444381847 ], [ 112.039490157845933, -7.839486897088914 ], [ 112.039487214185343, -7.83948848165888 ], [ 112.039484343504654, -7.839490236983729 ], [ 112.039481548428199, -7.839492124167023 ], [ 112.039478808013115, -7.83949410979695 ], [ 112.039473436492315, -7.839498272523652 ], [ 112.039460216233394, -7.839509022504337 ], [ 112.039454860062961, -7.839513158060418 ], [ 112.039452131357109, -7.839515111102265 ], [ 112.039449350661272, -7.839516945793647 ], [ 112.039446497905914, -7.839518615154319 ], [ 112.039443546645941, -7.839520061366818 ], [ 112.039440434227984, -7.839521254739965 ], [ 112.039437221480327, -7.839522220447329 ], [ 112.039433933947819, -7.839523019021869 ], [ 112.039430592606948, -7.839523697441589 ], [ 112.039423804149294, -7.839524824819788 ], [ 112.039416938176956, -7.839525781454157 ], [ 112.039406598438433, -7.839527046927744 ], [ 112.039399735449621, -7.839527743986475 ], [ 112.03939633050139, -7.839528008339419 ], [ 112.039392957067349, -7.839528180363907 ], [ 112.039389625934334, -7.839528221143376 ], [ 112.039386356015811, -7.839528077270445 ], [ 112.039383168898951, -7.839527676338435 ], [ 112.039380094286301, -7.839526926927806 ], [ 112.039377042071493, -7.839525700833548 ], [ 112.039374109555894, -7.839524101823622 ], [ 112.039371265249983, -7.839522232174971 ], [ 112.0393684821384, -7.839520169734263 ], [ 112.039365742223609, -7.8395179715242 ], [ 112.039363032913883, -7.839515680083546 ], [ 112.039357665586436, -7.839510934280327 ], [ 112.039336302193362, -7.839491505831515 ], [ 112.039314845831143, -7.83947225668556 ], [ 112.039309619662987, -7.839467379392634 ], [ 112.039307089448968, -7.839464893964109 ], [ 112.039304648892468, -7.839462355858104 ], [ 112.039302337843054, -7.839459742365809 ], [ 112.039300205206231, -7.839457025329586 ], [ 112.039298320713627, -7.839454162974161 ], [ 112.039296731420947, -7.839451112675768 ], [ 112.039295391177177, -7.83944791615153 ], [ 112.039294232062346, -7.839444614267824 ], [ 112.039293203359279, -7.83944123609121 ], [ 112.039292265220695, -7.839437805234879 ], [ 112.039290558297864, -7.83943084452275 ], [ 112.039288967298162, -7.839423816597619 ], [ 112.039283563187112, -7.839399128464316 ], [ 112.039281953153079, -7.839392105108169 ], [ 112.039280228965069, -7.839385130872273 ], [ 112.039279288956777, -7.839381677410023 ], [ 112.039278268313325, -7.83937825761021 ], [ 112.039277136232229, -7.839374885115107 ], [ 112.039275849227209, -7.83937157902477 ], [ 112.039274402029378, -7.839368408992419 ], [ 112.039272806249528, -7.839365302635931 ], [ 112.039271101750614, -7.839362242673023 ], [ 112.039269318428239, -7.839359215463658 ], [ 112.039265604103946, -7.839353222909675 ], [ 112.039261783774791, -7.839347274029296 ], [ 112.039236684318027, -7.839308699215707 ], [ 112.039230846067383, -7.839299843991767 ], [ 112.039226846507333, -7.839294033929106 ], [ 112.039224781565252, -7.839291184680242 ], [ 112.039222647838926, -7.839288393483839 ], [ 112.03922042179714, -7.839285680295152 ], [ 112.039218098085726, -7.839283080399701 ], [ 112.039215681154147, -7.8392805594186 ], [ 112.039213198154656, -7.839278094674417 ], [ 112.039208100920163, -7.839273274944357 ], [ 112.039202908656179, -7.839268535941913 ], [ 112.039187171651918, -7.839254446852312 ], [ 112.039176617945728, -7.839245138390277 ], [ 112.039171261114205, -7.83924059966977 ], [ 112.039168537513874, -7.839238395991277 ], [ 112.039165766015984, -7.839236261166712 ], [ 112.039162930353825, -7.839234218751089 ], [ 112.039159944311493, -7.839232246346631 ], [ 112.039156890492819, -7.839230372690939 ], [ 112.039153787874113, -7.839228569700248 ], [ 112.039147486839354, -7.839225100522239 ], [ 112.039141112618054, -7.839221742768126 ], [ 112.039131475897378, -7.839216843794304 ], [ 112.039124996131321, -7.839213715118095 ], [ 112.039121728315891, -7.839212224558939 ], [ 112.039118431671156, -7.839210811850828 ], [ 112.039115095383352, -7.839209505057436 ], [ 112.039111696825941, -7.83920832322733 ], [ 112.039108258627678, -7.839207248216321 ], [ 112.039104791597893, -7.839206250151975 ], [ 112.039094292302181, -7.839203518482271 ], [ 112.039076678803269, -7.839199293079597 ], [ 112.039066087836218, -7.839196898983275 ], [ 112.03905900734928, -7.839195469380793 ], [ 112.039055454199655, -7.83919485319293 ], [ 112.039051888599587, -7.839194336521745 ], [ 112.039048421283951, -7.839193954366402 ], [ 112.039044941511122, -7.83919366901449 ], [ 112.03903795884932, -7.839193285582191 ], [ 112.03902745282241, -7.839192958775318 ], [ 112.038988877441994, -7.839192218248273 ], [ 112.038974851919889, -7.839192045732916 ], [ 112.038964234362567, -7.839192094533143 ], [ 112.03895356908707, -7.83919228454003 ], [ 112.038903784210092, -7.83919354238178 ], [ 112.038893127967881, -7.839193717894197 ], [ 112.038886043662202, -7.839193673866879 ], [ 112.038882514422312, -7.839193555953014 ], [ 112.038878995823495, -7.839193340335682 ], [ 112.038875495029345, -7.839192989916097 ], [ 112.038872006519711, -7.839192473053223 ], [ 112.038868534910051, -7.839191822294729 ], [ 112.038861624577066, -7.839190250275504 ], [ 112.038854740945524, -7.839188473791769 ], [ 112.038847867961849, -7.839186602317748 ], [ 112.038778599388692, -7.83918031741538 ], [ 112.038761466803166, -7.839179840531136 ], [ 112.038733389000612, -7.839161757194829 ], [ 112.038637444734704, -7.839127861042651 ], [ 112.038617272123815, -7.839120830093539 ], [ 112.03861030709254, -7.839120241307496 ], [ 112.038566589232815, -7.839116546928811 ], [ 112.038549598535923, -7.839112208723841 ], [ 112.038533038916555, -7.839107981603147 ], [ 112.038522911107663, -7.839101809499496 ], [ 112.038501095901665, -7.839088515879533 ], [ 112.038487352967692, -7.839080141385073 ], [ 112.038487104139463, -7.839080010857892 ], [ 112.038446664836499, -7.83905872648976 ], [ 112.038422394269915, -7.839053015231181 ], [ 112.038402868444933, -7.839049692600523 ], [ 112.038394050972258, -7.839048191297217 ], [ 112.038390780941384, -7.839047635001528 ], [ 112.038388843783039, -7.839047305142254 ], [ 112.038365287033059, -7.839040880343195 ], [ 112.038356006842662, -7.83904516303095 ], [ 112.038331022484755, -7.839054443357047 ], [ 112.038310321609373, -7.839064436657567 ], [ 112.038287302341189, -7.839062631202884 ], [ 112.038273915861112, -7.839061581611328 ], [ 112.038242506595793, -7.839057298831332 ], [ 112.038214058452212, -7.839046033875354 ], [ 112.038183203621031, -7.839033816165559 ], [ 112.038164571068393, -7.839026437718317 ], [ 112.038106401994639, -7.839003403550672 ], [ 112.038091173371797, -7.83899388590078 ], [ 112.038087336032618, -7.838992410302765 ], [ 112.038080892351445, -7.838989931796947 ], [ 112.03806642629813, -7.838984368193127 ], [ 112.038036921363613, -7.838979609501616 ], [ 112.037997897978045, -7.838974850749259 ], [ 112.037976763416765, -7.838976728851009 ], [ 112.037969937392063, -7.838977335352661 ], [ 112.037955067576902, -7.838978657173411 ], [ 112.037897961045559, -7.838993886304112 ], [ 112.037878628460632, -7.839001200942848 ], [ 112.03786274449871, -7.839007211051751 ], [ 112.037838188381755, -7.839019489346432 ], [ 112.03782467341324, -7.839026246997715 ], [ 112.037794215997508, -7.839038620323429 ], [ 112.037773277394919, -7.839050041357292 ], [ 112.037772371901184, -7.839050629651436 ], [ 112.037754241213193, -7.839062414578075 ], [ 112.037737988062304, -7.839079750721642 ], [ 112.037731704079476, -7.839086454378681 ], [ 112.037728530880145, -7.839089839295324 ], [ 112.037725687844386, -7.839092871579721 ], [ 112.037700941673322, -7.839121425347986 ], [ 112.037698533208882, -7.839123782769793 ], [ 112.037679845444373, -7.839142075453539 ], [ 112.037661282538807, -7.839160247541383 ], [ 112.037658212696115, -7.839163252347207 ], [ 112.037653019388586, -7.839168336216032 ], [ 112.037623751556751, -7.839190465277348 ], [ 112.037599212449777, -7.839197535876067 ], [ 112.037581635575378, -7.839202600506556 ], [ 112.037566644890191, -7.839197603439692 ], [ 112.037562771964573, -7.839194210557108 ], [ 112.037549512626384, -7.839182613299761 ], [ 112.037523100486027, -7.839152631763762 ], [ 112.037484706806637, -7.839088309116096 ], [ 112.037468135153503, -7.839060546295385 ], [ 112.037441247155144, -7.83902628259767 ], [ 112.037436195859513, -7.839017665076044 ], [ 112.03743113454739, -7.839009031299455 ], [ 112.037426258015699, -7.838994808664792 ], [ 112.037423996063936, -7.838988211075185 ], [ 112.037417452196323, -7.838972744449105 ], [ 112.037413358152378, -7.838966858627046 ], [ 112.037407934321237, -7.838959062330114 ], [ 112.037391873016716, -7.838951329312637 ], [ 112.037299073908599, -7.83893050931428 ], [ 112.037269330680303, -7.838922180509162 ], [ 112.037252994000227, -7.838918977492869 ], [ 112.037238992947238, -7.838916232691335 ], [ 112.037150357523245, -7.838911473021828 ], [ 112.037100042435881, -7.838901152678962 ], [ 112.037080759021492, -7.838897196294734 ], [ 112.03703083914877, -7.838890451041929 ], [ 112.03702647504312, -7.838889776236693 ], [ 112.037025564368975, -7.838889737779871 ], [ 112.036992719028333, -7.838885299261128 ], [ 112.036969664988433, -7.83888446606819 ], [ 112.036943344723809, -7.838883514295969 ], [ 112.036891822974027, -7.83888401465096 ], [ 112.036882073483014, -7.838884109195038 ], [ 112.036831509931531, -7.838885894171978 ], [ 112.036798807651437, -7.838883924349078 ], [ 112.036782136309199, -7.838882919875378 ], [ 112.036747926574506, -7.83887980966901 ], [ 112.03672978800536, -7.838878161240538 ], [ 112.036728825413647, -7.838878033373386 ], [ 112.036703722775528, -7.838874718055959 ], [ 112.036666732471048, -7.838869832981093 ], [ 112.036631635641001, -7.83885972022401 ], [ 112.036615612174117, -7.838851878551173 ], [ 112.036603676754723, -7.838846038244911 ], [ 112.036575363137985, -7.838832310106883 ], [ 112.03654478487239, -7.838817485052838 ], [ 112.036527726203602, -7.838809125882752 ], [ 112.036485298377855, -7.838788336398093 ], [ 112.036474917415333, -7.83878357123455 ], [ 112.036470871850455, -7.838781510974123 ], [ 112.036468854818224, -7.838780788784372 ], [ 112.036412725167366, -7.838755023429247 ], [ 112.036364541064856, -7.838740152140819 ], [ 112.036352618950005, -7.838737120919118 ], [ 112.036329443566899, -7.838731229573147 ], [ 112.036323085351071, -7.838729931999473 ], [ 112.036311328957837, -7.83872753255768 ], [ 112.036300295769408, -7.838725280565473 ], [ 112.036252111535134, -7.838716952734922 ], [ 112.036228911422398, -7.838708029831452 ], [ 112.03618429666021, -7.838686019300782 ], [ 112.036178570938219, -7.838682662615655 ], [ 112.036149794284981, -7.83866579363302 ], [ 112.03612531373706, -7.838658041477726 ], [ 112.036114748553132, -7.838654695790931 ], [ 112.036114102297987, -7.838654491173 ], [ 112.036068893114034, -7.838642594399999 ], [ 112.035974109927835, -7.838607566026343 ], [ 112.035932074244272, -7.838592031094492 ], [ 112.035922064083309, -7.838588305085906 ], [ 112.035833945260606, -7.83855550505656 ], [ 112.035824998118002, -7.838552174375859 ], [ 112.0357942198617, -7.838543381324026 ], [ 112.035790615016566, -7.838542029037208 ], [ 112.035790115730308, -7.838542208435471 ], [ 112.035776802264508, -7.838538404625757 ], [ 112.035766701672628, -7.838535518136431 ], [ 112.035714852480751, -7.838527559210518 ], [ 112.035701037126302, -7.838467491812276 ], [ 112.035696601247921, -7.838455393450502 ], [ 112.035696130998204, -7.838454111235903 ], [ 112.035692670320458, -7.838444673086364 ], [ 112.035686156213387, -7.838426908221444 ], [ 112.03567481512269, -7.838410165460115 ], [ 112.035656175470805, -7.838382650017055 ], [ 112.035626194343592, -7.838344103217701 ], [ 112.035589074712547, -7.838304127798122 ], [ 112.035549100031105, -7.838277002145424 ], [ 112.035503414090527, -7.838252731308039 ], [ 112.035500828254968, -7.838251581816595 ], [ 112.035495919890707, -7.838249400665316 ], [ 112.035439168624066, -7.838224177533672 ], [ 112.035377778641958, -7.838189913462277 ], [ 112.035317236364079, -7.838163967050114 ], [ 112.035307822229171, -7.838159932961871 ], [ 112.035253570567448, -7.838129950935634 ], [ 112.035252312279113, -7.838129075836733 ], [ 112.035221155776043, -7.838107402022726 ], [ 112.035187897886416, -7.838084265497223 ], [ 112.035146495101827, -7.83805285636172 ], [ 112.035111026442451, -7.838017388077176 ], [ 112.035109375342131, -7.838015737046745 ], [ 112.035066544931396, -7.83798575586996 ], [ 112.035029425592441, -7.837968624213008 ], [ 112.034992305649638, -7.837960057405322 ], [ 112.034950902791479, -7.837955774497722 ], [ 112.034946813744327, -7.837955931963732 ], [ 112.034934391528751, -7.837956410169004 ], [ 112.03491378396086, -7.837957202418754 ], [ 112.034878091861756, -7.837957202371132 ], [ 112.034839543979487, -7.837954346848171 ], [ 112.034782437691959, -7.83794435310396 ], [ 112.034729613623583, -7.83792722110407 ], [ 112.034675361408802, -7.837918654743636 ], [ 112.034623388517375, -7.837921903540591 ], [ 112.034583990354946, -7.837924366259578 ], [ 112.034583835180385, -7.837924331368297 ], [ 112.03452789738121, -7.837911900925747 ], [ 112.034506895412676, -7.837907234143352 ], [ 112.034422663206399, -7.837871541855846 ], [ 112.034354134725604, -7.837850127050072 ], [ 112.03426133555476, -7.837838705058911 ], [ 112.034199382198892, -7.83782085468107 ], [ 112.034198022620913, -7.837820462787329 ], [ 112.034177102551254, -7.837814434634859 ], [ 112.034153975606799, -7.837793234833198 ], [ 112.034151404028322, -7.837790877897422 ], [ 112.034132844238812, -7.837778029146694 ], [ 112.034129159131396, -7.837776122631872 ], [ 112.034112142986984, -7.837767321890742 ], [ 112.034092869532955, -7.837753045002334 ], [ 112.034081448500473, -7.837738054244126 ], [ 112.034073596030126, -7.837714497107638 ], [ 112.034071453950872, -7.837675236082532 ], [ 112.034075574423824, -7.837637471875235 ], [ 112.034075737609129, -7.837635975564604 ], [ 112.034071454273985, -7.837595999877095 ], [ 112.034069881598441, -7.837589008051343 ], [ 112.034065029711925, -7.837567446838602 ], [ 112.034054322328586, -7.837541748711735 ], [ 112.034041472911753, -7.837526044252543 ], [ 112.034030012055283, -7.837519167138237 ], [ 112.03402005806177, -7.837513195266937 ], [ 112.034000070542362, -7.837503201647484 ], [ 112.033972944813215, -7.837500346042142 ], [ 112.03396603878106, -7.837503441635901 ], [ 112.03396571499999, -7.83750344152612 ], [ 112.033965473471071, -7.837503695356395 ], [ 112.033952243023521, -7.837509625547714 ], [ 112.033941276626706, -7.837523029733007 ], [ 112.033926545048104, -7.837541034897227 ], [ 112.033925247976669, -7.837542817978387 ], [ 112.03390393082546, -7.83757212917503 ], [ 112.033897991417589, -7.837580296190109 ], [ 112.033881361961662, -7.837595144159555 ], [ 112.033860277407314, -7.837613968941838 ], [ 112.033858016829967, -7.837615987727613 ], [ 112.033852564104976, -7.83761923621798 ], [ 112.033824466404127, -7.837635975433303 ], [ 112.033811433593513, -7.837640406512504 ], [ 112.033788774336742, -7.837648110793541 ], [ 112.03377430214428, -7.837648110129417 ], [ 112.033749513405027, -7.837648110360133 ], [ 112.033730570298701, -7.837647147509491 ], [ 112.033707396648211, -7.837645968933484 ], [ 112.033685588768762, -7.837643649245048 ], [ 112.033673846134079, -7.837642400111815 ], [ 112.033654927528829, -7.83763629647572 ], [ 112.033653730310334, -7.837635910512647 ], [ 112.033651717095495, -7.837635261556678 ], [ 112.033612456360899, -7.837616225787026 ], [ 112.033611819359336, -7.83761572720575 ], [ 112.03359647774316, -7.83760373334901 ], [ 112.033578027457594, -7.837589308802566 ], [ 112.033547020728676, -7.837565066832698 ], [ 112.033541748084261, -7.837561903445611 ], [ 112.033505380914917, -7.837540083092526 ], [ 112.033480395799188, -7.837542462412402 ], [ 112.0334566020464, -7.837557928476328 ], [ 112.033455014514317, -7.837558881107022 ], [ 112.033421464419504, -7.837579010775622 ], [ 112.033414961242244, -7.837582913019717 ], [ 112.033413756307581, -7.837583443252133 ], [ 112.033385217471491, -7.837596000580473 ], [ 112.033351695739015, -7.837601157504289 ], [ 112.033338818317617, -7.83760313901929 ], [ 112.033286063909145, -7.837609437459371 ], [ 112.033277164822024, -7.837610500273038 ], [ 112.033259106428289, -7.837612656383897 ], [ 112.033218696462654, -7.837615627929144 ], [ 112.033182517553783, -7.837618287922454 ], [ 112.033178204884379, -7.837618605097269 ], [ 112.033118718015302, -7.837623364425444 ], [ 112.033089391929565, -7.837620105361501 ], [ 112.033075888287911, -7.8376186054832 ], [ 112.033058621213925, -7.837612489629436 ], [ 112.033018780409662, -7.837598379789629 ], [ 112.032984650639264, -7.837586097341592 ], [ 112.032982113463007, -7.837585183767514 ], [ 112.03294406582566, -7.837571491887338 ], [ 112.032908072103979, -7.837563185310684 ], [ 112.032906945939899, -7.83756292578998 ], [ 112.032873884825008, -7.837557004211019 ], [ 112.032859118610673, -7.837554359711865 ], [ 112.032855127337811, -7.837552973976985 ], [ 112.032807722233983, -7.837536513984332 ], [ 112.032786548479422, -7.837526902163785 ], [ 112.032733899197098, -7.837503001692571 ], [ 112.032725547732838, -7.837499210938672 ], [ 112.032699219460739, -7.837487258447555 ], [ 112.032677059604467, -7.837477912224251 ], [ 112.032645194372407, -7.837464472868577 ], [ 112.032594285176913, -7.837443001002645 ], [ 112.032552882602886, -7.837423727086156 ], [ 112.032551699156954, -7.837423408917509 ], [ 112.032551180037416, -7.837423269100259 ], [ 112.032534322270124, -7.837418730432797 ], [ 112.032529030310215, -7.837416926422506 ], [ 112.032502913625805, -7.837408023103661 ], [ 112.032476987749902, -7.837406621480074 ], [ 112.032476501561206, -7.837406595538979 ], [ 112.032447948189073, -7.837405167793597 ], [ 112.032442709510377, -7.837404742892224 ], [ 112.032431802172511, -7.837403857966176 ], [ 112.032421536177594, -7.837403025733407 ], [ 112.032412051665759, -7.837398020399792 ], [ 112.032395837906932, -7.837389462714167 ], [ 112.032369426227149, -7.837383038220462 ], [ 112.032343014107923, -7.837382324234743 ], [ 112.03232025089676, -7.837378767758167 ], [ 112.032319111719701, -7.837378379839988 ], [ 112.032298042099853, -7.837370903073139 ], [ 112.032272344166202, -7.837353057615348 ], [ 112.032256435806275, -7.837346608283268 ], [ 112.032245931912655, -7.837342349780902 ], [ 112.032220594138664, -7.837334114710064 ], [ 112.032217378243672, -7.837333069844099 ], [ 112.032216744900666, -7.837332951107941 ], [ 112.032194535246774, -7.837328786401912 ], [ 112.032170979091177, -7.837316651625193 ], [ 112.032160650498454, -7.837308816613629 ], [ 112.032150277381177, -7.837300947342862 ], [ 112.032138012179033, -7.837294473705351 ], [ 112.032124579123831, -7.837287384305049 ], [ 112.032092457002861, -7.837273107135128 ], [ 112.032074541995016, -7.837264989533763 ], [ 112.032048206545227, -7.837253056912393 ], [ 112.032046771056798, -7.837252406532976 ], [ 112.031993432598497, -7.8372336764089 ], [ 112.031953258103883, -7.837219569085054 ], [ 112.031936872808501, -7.837211691923779 ], [ 112.031916138984656, -7.83720172353997 ], [ 112.031901951168535, -7.837195295302664 ], [ 112.031870453050814, -7.837181022012064 ], [ 112.03184288731714, -7.837166320341438 ], [ 112.031839567150854, -7.83716454947819 ], [ 112.031827622363764, -7.837158179054071 ], [ 112.031806953469342, -7.837152845659129 ], [ 112.031805493259782, -7.837152468474268 ], [ 112.031799589015705, -7.837150992449171 ], [ 112.031791217258075, -7.837148899321298 ], [ 112.031781696120859, -7.837148167447293 ], [ 112.031772656661914, -7.837147471474721 ], [ 112.031750528354806, -7.837143188969563 ], [ 112.031726971256361, -7.837131767754864 ], [ 112.031691701867274, -7.837118154867251 ], [ 112.031686282231107, -7.837116062647955 ], [ 112.031677466598353, -7.837113815948703 ], [ 112.031649877130718, -7.837106782902054 ], [ 112.031597052743763, -7.837096075481545 ], [ 112.031572864177903, -7.837088609929255 ], [ 112.03153923163552, -7.837078229940487 ], [ 112.031525424817403, -7.837070725400561 ], [ 112.031510491875977, -7.837062608611338 ], [ 112.031503173018393, -7.837056434868065 ], [ 112.031496034573365, -7.837046917040805 ], [ 112.031490680661292, -7.837030260776507 ], [ 112.031488300991271, -7.837005276563013 ], [ 112.031490680385104, -7.836953523421343 ], [ 112.031497190182506, -7.836898151530237 ], [ 112.031500555235084, -7.836869528335493 ], [ 112.031510073335539, -7.83679719300611 ], [ 112.031531012404244, -7.836727713007844 ], [ 112.03155004794489, -7.836694400013799 ], [ 112.031555759440948, -7.836665847045606 ], [ 112.031557579548135, -7.836641846508136 ], [ 112.031562385490901, -7.836578495469786 ], [ 112.031566228669035, -7.836527837615194 ], [ 112.031573842552504, -7.836477393016363 ], [ 112.031574608353012, -7.836471267311108 ], [ 112.031576698522841, -7.836454550314115 ], [ 112.031584903700363, -7.836435404447967 ], [ 112.031588119400595, -7.836427900738982 ], [ 112.031618576411759, -7.83638697350271 ], [ 112.031629998418154, -7.836357468669074 ], [ 112.031639515679856, -7.836326059267448 ], [ 112.031645276094324, -7.836303380389474 ], [ 112.031654744427641, -7.836266096897256 ], [ 112.031702582140682, -7.836095136573422 ], [ 112.031712803277429, -7.836058608237436 ], [ 112.031727080549345, -7.836003404542752 ], [ 112.031730887355408, -7.83595676692608 ], [ 112.031738501650722, -7.835866347850494 ], [ 112.031753730358091, -7.835772121514321 ], [ 112.03177371811401, -7.835693123008597 ], [ 112.031779669477615, -7.835673226564058 ], [ 112.031827179663622, -7.835514408881679 ], [ 112.031840342645182, -7.835470405542757 ], [ 112.031870632577537, -7.83535097683091 ], [ 112.031878873787804, -7.835318483438941 ], [ 112.031887492246028, -7.835284500447292 ], [ 112.031906967542952, -7.835207712693371 ], [ 112.031907808787707, -7.835202025447193 ], [ 112.031908781187866, -7.835195458783303 ], [ 112.031915354169683, -7.835151035649722 ], [ 112.031913294318599, -7.835148752510142 ], [ 112.031905054910041, -7.835139618142875 ], [ 112.031858146683888, -7.835057046370453 ], [ 112.031923649763371, -7.835043761033098 ], [ 112.031905775236027, -7.835020364939131 ], [ 112.032057603151131, -7.834115457961731 ], [ 112.032071960854381, -7.8340505939541 ], [ 112.03207366185093, -7.834050420662262 ], [ 112.032214131840433, -7.833461204081392 ], [ 112.032214695308696, -7.833427057216562 ], [ 112.032215076595406, -7.833404005321967 ], [ 112.032215289651106, -7.833391084251443 ], [ 112.032225325979354, -7.833344360834846 ], [ 112.032227356444935, -7.833342080340986 ], [ 112.03223495554181, -7.83333354571006 ], [ 112.032240781941198, -7.833327003336043 ], [ 112.032250300186462, -7.833308918753076 ], [ 112.032257180323782, -7.833244503559725 ], [ 112.032266168549427, -7.833160346943571 ], [ 112.032278945686187, -7.833040719632247 ], [ 112.032278689654532, -7.833040608111127 ], [ 112.032287061404176, -7.83297717598744 ], [ 112.032342714825546, -7.832555482149123 ], [ 112.032345166775983, -7.832536900255471 ], [ 112.03234551488579, -7.832534259400055 ], [ 112.03234930530563, -7.83253033940424 ], [ 112.032754043853217, -7.83211172839154 ], [ 112.032761056739986, -7.832103441193226 ], [ 112.032763950565567, -7.832100777821873 ], [ 112.032735620342365, -7.832062033123885 ], [ 112.032710818200883, -7.832028111193845 ], [ 112.032690934014155, -7.832001770727526 ], [ 112.032619535718041, -7.831909122248668 ], [ 112.032576067873038, -7.831852717821262 ], [ 112.032539555803353, -7.83180533965084 ], [ 112.032482492172505, -7.831731291612887 ], [ 112.032354816477167, -7.831565608762975 ], [ 112.032417583988831, -7.831397019436328 ], [ 112.032441504899936, -7.831336069855785 ], [ 112.032483403662567, -7.831229315294186 ], [ 112.032496661321815, -7.831191409322213 ], [ 112.03234497011573, -7.831086118232806 ], [ 112.032304737873119, -7.831060832370003 ], [ 112.032288496736584, -7.831050625050354 ], [ 112.032149213276284, -7.830915435918076 ], [ 112.032080256108259, -7.830855310619709 ], [ 112.031826843677166, -7.830835679952772 ], [ 112.031134419769302, -7.830758347367638 ], [ 112.031136590102804, -7.830728857944191 ], [ 112.031136847243971, -7.830725364442467 ], [ 112.031138322534787, -7.830705329724254 ], [ 112.03113941778868, -7.830690445707052 ], [ 112.031143028122329, -7.830659763448838 ], [ 112.031162866389124, -7.830491206881049 ], [ 112.031167338454523, -7.83045320756053 ], [ 112.031182529172781, -7.830327266905644 ], [ 112.031183784173308, -7.830316860284832 ], [ 112.031188875288223, -7.830274647563037 ], [ 112.031203998448348, -7.83014926600522 ], [ 112.031216722697906, -7.830043773099318 ], [ 112.031217803507047, -7.830034817595327 ], [ 112.031228225723297, -7.829948408169977 ], [ 112.031231524994581, -7.829921054036213 ], [ 112.031235049141387, -7.829891838054612 ], [ 112.031238881706869, -7.829860065425798 ], [ 112.031240071819198, -7.829850195285132 ], [ 112.031240809539369, -7.829844081405683 ], [ 112.031241884112944, -7.829835172042389 ], [ 112.031247786720712, -7.829786236585441 ], [ 112.031254010181215, -7.829734637729167 ], [ 112.03128077674522, -7.829512716959871 ], [ 112.031283772945045, -7.829487882378935 ], [ 112.031283974707534, -7.829486210516007 ], [ 112.031286033196778, -7.829469144489123 ], [ 112.031286438488848, -7.829465781766091 ], [ 112.031568402605046, -7.829502561389116 ], [ 112.031767325161965, -7.829533017695974 ], [ 112.032049052750651, -7.82960154634319 ], [ 112.032397406390842, -7.829681496406903 ], [ 112.032960862693173, -7.829816649702951 ], [ 112.033257889827041, -7.829878269134678 ], [ 112.033441091345168, -7.829911111007456 ], [ 112.033599879256784, -7.829939576456594 ], [ 112.033630918233854, -7.829945141244715 ], [ 112.034040423970282, -7.830038296449386 ], [ 112.034247437032462, -7.830100162090718 ], [ 112.034522540348178, -7.830176159457534 ], [ 112.0345647914057, -7.830187830441027 ], [ 112.035044292228804, -7.830244762707729 ], [ 112.035064049204465, -7.830247108210819 ], [ 112.035237291174695, -7.830292148103126 ], [ 112.035431209103365, -7.830342563666661 ], [ 112.035650851707985, -7.830408559698037 ], [ 112.035906404767715, -7.830487557952754 ], [ 112.036177188036405, -7.830566555694975 ], [ 112.036555047051834, -7.8306750589987 ], [ 112.036834871295525, -7.830751678048729 ], [ 112.037049499228203, -7.830809736685741 ], [ 112.037328573169106, -7.830905253256273 ], [ 112.037337413672873, -7.83090843676765 ], [ 112.037474470367769, -7.830963402060908 ], [ 112.037470533371263, -7.830974033244616 ], [ 112.037453055614208, -7.831021223610902 ], [ 112.037864940105052, -7.831166132506909 ] ] ] } }
]
}
