%YAML 1.1
%TAG !u! tag:unity3d.com,2011:
--- !u!114 &11400000
MonoBehaviour:
  m_ObjectHideFlags: 0
  m_CorrespondingSourceObject: {fileID: 0}
  m_PrefabInstance: {fileID: 0}
  m_PrefabAsset: {fileID: 0}
  m_GameObject: {fileID: 0}
  m_Enabled: 1
  m_EditorHideFlags: 0
  m_Script: {fileID: 11500000, guid: 6b65b97a1d4bd83408bc65bc5638701d, type: 3}
  m_Name: DialogueSet3
  m_EditorClassIdentifier: 
  dialogueSet:
  - {fileID: 11400000, guid: 0b006cfc4e256a24f82ed21dc9c7958e, type: 2}
  - {fileID: 11400000, guid: b94244771c676c84aa0f165f7e96bd6d, type: 2}
  - {fileID: 11400000, guid: 1ce2cb19fee0fbb488d07bb59dfbe6b3, type: 2}
  - {fileID: 11400000, guid: b9f1f8e055b0fcd4fa0a208b5011d2ba, type: 2}
  - {fileID: 11400000, guid: d948cb06faf15fc49a56a38e7465775e, type: 2}
  - {fileID: 11400000, guid: 4cf2d0fc5baebe140a2e58a365003755, type: 2}
  - {fileID: 11400000, guid: 0513b08395df0334ca0cc717c67162f5, type: 2}
  - {fileID: 11400000, guid: 7863c996ee118584d95eb74b3ad1522f, type: 2}
  - {fileID: 11400000, guid: ad3a74e30ef8a5c4aabb972b47c07261, type: 2}
  - {fileID: 11400000, guid: 26bb57310cd7d4d4cbc1f5cef2afa4da, type: 2}
  - {fileID: 11400000, guid: bb64e995a68c2b14d970e65d4c9bcc0c, type: 2}
