%YAML 1.1
%TAG !u! tag:unity3d.com,2011:
--- !u!114 &11400000
MonoBehaviour:
  m_ObjectHideFlags: 0
  m_CorrespondingSourceObject: {fileID: 0}
  m_PrefabInstance: {fileID: 0}
  m_PrefabAsset: {fileID: 0}
  m_GameObject: {fileID: 0}
  m_Enabled: 1
  m_EditorHideFlags: 0
  m_Script: {fileID: 11500000, guid: 72947a0b57c6a8d4aa734548fa0e6804, type: 3}
  m_Name: '[S]CollectProps'
  m_EditorClassIdentifier: 
  objID: 0
  objDescription: Collect props
  goal: {fileID: 11400000, guid: 8d015d4d387e29944be6d967e4f40b36, type: 2}
  chainedObjective: {fileID: 11400000, guid: 96d140c47add6ec4c923496e17cfc784, type: 2}
