%YAML 1.1
%TAG !u! tag:unity3d.com,2011:
--- !u!114 &11400000
MonoBehaviour:
  m_ObjectHideFlags: 0
  m_CorrespondingSourceObject: {fileID: 0}
  m_PrefabInstance: {fileID: 0}
  m_PrefabAsset: {fileID: 0}
  m_GameObject: {fileID: 0}
  m_Enabled: 1
  m_EditorHideFlags: 0
  m_Script: {fileID: 11500000, guid: 6b65b97a1d4bd83408bc65bc5638701d, type: 3}
  m_Name: DialogueSet1
  m_EditorClassIdentifier: 
  dialogueSet:
  - {fileID: 11400000, guid: 7e14a2af13a6c1e43b43bdbdfe37850b, type: 2}
  - {fileID: 11400000, guid: 2c3fb8b084dd82b40aa21ba8d19a5da8, type: 2}
  - {fileID: 11400000, guid: 01248fe217a8e6544ac3a75cadb3b2e8, type: 2}
