%YAML 1.1
%TAG !u! tag:unity3d.com,2011:
--- !u!114 &11400000
MonoBehaviour:
  m_ObjectHideFlags: 0
  m_CorrespondingSourceObject: {fileID: 0}
  m_PrefabInstance: {fileID: 0}
  m_PrefabAsset: {fileID: 0}
  m_GameObject: {fileID: 0}
  m_Enabled: 1
  m_EditorHideFlags: 0
  m_Script: {fileID: 11500000, guid: 6b65b97a1d4bd83408bc65bc5638701d, type: 3}
  m_Name: Set 3
  m_EditorClassIdentifier: 
  dialogueSet:
  - {fileID: 11400000, guid: 392252a5765416f40a7d38d15d874e23, type: 2}
  - {fileID: 11400000, guid: 961b8ac78b8d2e44695bb40657da959f, type: 2}
  - {fileID: 11400000, guid: 915fa34789d5aef44bdaf7e3a7f7c897, type: 2}
  - {fileID: 11400000, guid: 8584c0c00dcf368499b71e372f25d3d6, type: 2}
  - {fileID: 11400000, guid: 4bb1ed9ce1964a24592cdf6eadd43ef6, type: 2}
  - {fileID: 11400000, guid: e9eea1c4561fa1c418a4821ebaee37e2, type: 2}
  - {fileID: 11400000, guid: 189a1b4301e99cf4fbac35620c3016d2, type: 2}
  - {fileID: 11400000, guid: ca8566b5c41ee594d962db439cf3d29a, type: 2}
  - {fileID: 11400000, guid: 891fbf34f914a11479c59127c4ee18fa, type: 2}
  - {fileID: 11400000, guid: a4376e6294aedc44ead22ae80ae193dd, type: 2}
