%YAML 1.1
%TAG !u! tag:unity3d.com,2011:
--- !u!114 &11400000
MonoBehaviour:
  m_ObjectHideFlags: 0
  m_CorrespondingSourceObject: {fileID: 0}
  m_PrefabInstance: {fileID: 0}
  m_PrefabAsset: {fileID: 0}
  m_GameObject: {fileID: 0}
  m_Enabled: 1
  m_EditorHideFlags: 0
  m_Script: {fileID: 11500000, guid: 66751946fa55bc843a84e2074ef6701d, type: 3}
  m_Name: Dialogue 1
  m_EditorClassIdentifier: 
  charPortrait: {fileID: 21300000, guid: d945a3af58c02bb4ebd57e1dd76a236a, type: 3}
  sourceName: The Intern
  dialogue: The room's dark, I gotta find the Generator....
