%YAML 1.1
%TAG !u! tag:unity3d.com,2011:
--- !u!114 &11400000
MonoBehaviour:
  m_ObjectHideFlags: 0
  m_CorrespondingSourceObject: {fileID: 0}
  m_PrefabInstance: {fileID: 0}
  m_PrefabAsset: {fileID: 0}
  m_GameObject: {fileID: 0}
  m_Enabled: 1
  m_EditorHideFlags: 0
  m_Script: {fileID: 11500000, guid: 6b65b97a1d4bd83408bc65bc5638701d, type: 3}
  m_Name: 1
  m_EditorClassIdentifier: 
  dialogueSet:
  - {fileID: 11400000, guid: 89d1d15e13c9b994f88866ade0d0e7b1, type: 2}
  - {fileID: 11400000, guid: 7d224d979d6105d4985fe44b64662930, type: 2}
  - {fileID: 11400000, guid: 249b8c20c65d05848a421f79734eed83, type: 2}
