%YAML 1.1
%TAG !u! tag:unity3d.com,2011:
--- !u!114 &11400000
MonoBehaviour:
  m_ObjectHideFlags: 0
  m_CorrespondingSourceObject: {fileID: 0}
  m_PrefabInstance: {fileID: 0}
  m_PrefabAsset: {fileID: 0}
  m_GameObject: {fileID: 0}
  m_Enabled: 1
  m_EditorHideFlags: 0
  m_Script: {fileID: 11500000, guid: a9562ce2c3ec03e4a9a685ad339d0c6d, type: 3}
  m_Name: Room3Key
  m_EditorClassIdentifier: 
  itemName: Room 3 Key
  itemDescription: This key unlocks Room 3
  itemType: 1
  itemKeyID: 2
