%YAML 1.1
%TAG !u! tag:unity3d.com,2011:
--- !u!114 &11400000
MonoBehaviour:
  m_ObjectHideFlags: 0
  m_CorrespondingSourceObject: {fileID: 0}
  m_PrefabInstance: {fileID: 0}
  m_PrefabAsset: {fileID: 0}
  m_GameObject: {fileID: 0}
  m_Enabled: 1
  m_EditorHideFlags: 0
  m_Script: {fileID: 11500000, guid: 6b65b97a1d4bd83408bc65bc5638701d, type: 3}
  m_Name: '[1]DialCutscene'
  m_EditorClassIdentifier: 
  dialogueSet:
  - {fileID: 11400000, guid: 47ccc5fe4aafac544bd36ad0bc855933, type: 2}
  - {fileID: 11400000, guid: 43b2eb742e10eb8448a0dd15299a7799, type: 2}
  - {fileID: 11400000, guid: 4767b77349603164faaa465ea391db70, type: 2}
  - {fileID: 11400000, guid: 59ee3f130a3247d498662f09661d2e91, type: 2}
  - {fileID: 11400000, guid: 7c9e03129d03e7a40a7741d6ee3c0dcd, type: 2}
