%YAML 1.1
%TAG !u! tag:unity3d.com,2011:
--- !u!114 &11400000
MonoBehaviour:
  m_ObjectHideFlags: 0
  m_CorrespondingSourceObject: {fileID: 0}
  m_PrefabInstance: {fileID: 0}
  m_PrefabAsset: {fileID: 0}
  m_GameObject: {fileID: 0}
  m_Enabled: 1
  m_EditorHideFlags: 0
  m_Script: {fileID: 11500000, guid: 6b65b97a1d4bd83408bc65bc5638701d, type: 3}
  m_Name: DialogueSet3
  m_EditorClassIdentifier: 
  dialogueSet:
  - {fileID: 11400000, guid: 1242d86a77f2068478ae678a27af6e46, type: 2}
  - {fileID: 11400000, guid: 935a979186b81a540b0c618660ee0261, type: 2}
  - {fileID: 11400000, guid: 889d8eb16123f004dbcf31422e3e17f8, type: 2}
  - {fileID: 11400000, guid: 406a73746143c4a4498d65872df1d580, type: 2}
  - {fileID: 11400000, guid: 09a621cb3d99cd44a9db72274c957421, type: 2}
  - {fileID: 11400000, guid: d888094bc5e67e34f9508ebfc6931528, type: 2}
  - {fileID: 11400000, guid: 11ce9a22c306f0b43b4648dacf797365, type: 2}
  - {fileID: 11400000, guid: 42663cec62b820d44b7cd069466e19d4, type: 2}
  - {fileID: 11400000, guid: d6dc6df777123594ca33df488501efff, type: 2}
  - {fileID: 11400000, guid: a1325dee0300f6a418c5b29564c63a56, type: 2}
  - {fileID: 11400000, guid: 1c0860a1c74be5e489a3a40bb3c3eaf7, type: 2}
  - {fileID: 11400000, guid: 5393fe053f0092848981482dfbce106c, type: 2}
  - {fileID: 11400000, guid: 30e9d98bd43dea2418cc9a534698621d, type: 2}
  - {fileID: 11400000, guid: 1ef6d62a7f87da74c9ec8673ae7510b3, type: 2}
  - {fileID: 11400000, guid: cf13875506f9d6d48a8b63740ff4fc37, type: 2}
