%YAML 1.1
%TAG !u! tag:unity3d.com,2011:
--- !u!114 &11400000
MonoBehaviour:
  m_ObjectHideFlags: 0
  m_CorrespondingSourceObject: {fileID: 0}
  m_PrefabInstance: {fileID: 0}
  m_PrefabAsset: {fileID: 0}
  m_GameObject: {fileID: 0}
  m_Enabled: 1
  m_EditorHideFlags: 0
  m_Script: {fileID: 11500000, guid: 66751946fa55bc843a84e2074ef6701d, type: 3}
  m_Name: 19
  m_EditorClassIdentifier: 
  charPortrait: {fileID: 21300000, guid: e706f801c1b699b40b9647a39c02734e, type: 3}
  sourceName: Ellie'
  dialogue: " Alright Lily, we\u2019ll just be around the library see you in class."
