%YAML 1.1
%TAG !u! tag:unity3d.com,2011:
--- !u!1 &1547619883360014062
GameObject:
  m_ObjectHideFlags: 0
  m_CorrespondingSourceObject: {fileID: 0}
  m_PrefabInstance: {fileID: 0}
  m_PrefabAsset: {fileID: 0}
  serializedVersion: 6
  m_Component:
  - component: {fileID: 1547619883360014048}
  - component: {fileID: 1547619883360014049}
  m_Layer: 0
  m_Name: PlayersData
  m_TagString: Untagged
  m_Icon: {fileID: 0}
  m_NavMeshLayer: 0
  m_StaticEditorFlags: 0
  m_IsActive: 1
--- !u!4 &1547619883360014048
Transform:
  m_ObjectHideFlags: 0
  m_CorrespondingSourceObject: {fileID: 0}
  m_PrefabInstance: {fileID: 0}
  m_PrefabAsset: {fileID: 0}
  m_GameObject: {fileID: 1547619883360014062}
  m_LocalRotation: {x: -0, y: -0, z: -0, w: 1}
  m_LocalPosition: {x: 0, y: 0, z: 0}
  m_LocalScale: {x: 1, y: 1, z: 1}
  m_Children: []
  m_Father: {fileID: 0}
  m_RootOrder: 0
  m_LocalEulerAnglesHint: {x: 0, y: 0, z: 0}
--- !u!114 &1547619883360014049
MonoBehaviour:
  m_ObjectHideFlags: 0
  m_CorrespondingSourceObject: {fileID: 0}
  m_PrefabInstance: {fileID: 0}
  m_PrefabAsset: {fileID: 0}
  m_GameObject: {fileID: 1547619883360014062}
  m_Enabled: 1
  m_EditorHideFlags: 0
  m_Script: {fileID: 11500000, guid: d703c34b1ed5dbd4ea0cdd809841a921, type: 3}
  m_Name: 
  m_EditorClassIdentifier: 
  pNotes: []
  pLogs: []
  charIDs: 
  scribble: {fileID: 8300000, guid: 8ced0cfd27747064bb115fe6be8ec06e, type: 3}
  manananggalObsIDs: 010000000200000003000000
  aswangObsIDs: 01000000020000000300000004000000
  mangkukulamObsID: 
  sceneHasPlayer: 1
  player: {fileID: 0}
  journalSoundSource: {fileID: 0}
  uiInventory: {fileID: 0}
  inventory:
    itemList: []
