%YAML 1.1
%TAG !u! tag:unity3d.com,2011:
--- !u!114 &11400000
MonoBehaviour:
  m_ObjectHideFlags: 0
  m_CorrespondingSourceObject: {fileID: 0}
  m_PrefabInstance: {fileID: 0}
  m_PrefabAsset: {fileID: 0}
  m_GameObject: {fileID: 0}
  m_Enabled: 1
  m_EditorHideFlags: 0
  m_Script: {fileID: 11500000, guid: 09b4a8cf0e2609e4684e3e2fc57e021b, type: 3}
  m_Name: 1stHouseDial
  m_EditorClassIdentifier: 
  dialogueSet:
  - {fileID: 11400000, guid: 2ae858e0c53c22c438b3f93363f3a64e, type: 2}
  - {fileID: 11400000, guid: 668a880548386f0439b03e262856f409, type: 2}
  - {fileID: 11400000, guid: cebb8eff3eb06424da9c1559cdf3e2d9, type: 2}
  - {fileID: 11400000, guid: d6e8189e89ad92d49adb3c1d6d96f25d, type: 2}
  - {fileID: 11400000, guid: 518e47efeb9b420408ed093b00d8ed08, type: 2}
  - {fileID: 11400000, guid: c829ab7d36dde424892f0b38025eb85f, type: 2}
  - {fileID: 11400000, guid: bfec4bfc8ede8dc4d8b20b423d262727, type: 2}
  - {fileID: 11400000, guid: e1f480d6cfdf6294c8ce5f9bb8c674f5, type: 2}
  - {fileID: 11400000, guid: f5b5801e3a818ce419ecfe79603b2f77, type: 2}
  - {fileID: 11400000, guid: c65747c7495b7224dabb4c76922a06f2, type: 2}
  - {fileID: 11400000, guid: 47609d4b9ba5b5c439c4d88d5bca49f8, type: 2}
  - {fileID: 11400000, guid: 2ac1ad7edfeb210438eb39e1221d36b3, type: 2}
  - {fileID: 11400000, guid: 4b3539d0ffca86a4aa1b89254d2d6a93, type: 2}
  - {fileID: 11400000, guid: 3aeb6cdc501efa24c8a2205e7590a399, type: 2}
  - {fileID: 11400000, guid: df835fbe400bb9d438edb22940f2c73b, type: 2}
