%YAML 1.1
%TAG !u! tag:unity3d.com,2011:
--- !u!114 &11400000
MonoBehaviour:
  m_ObjectHideFlags: 0
  m_CorrespondingSourceObject: {fileID: 0}
  m_PrefabInstance: {fileID: 0}
  m_PrefabAsset: {fileID: 0}
  m_GameObject: {fileID: 0}
  m_Enabled: 1
  m_EditorHideFlags: 0
  m_Script: {fileID: 11500000, guid: 457672bbeeae68648a251b4651340881, type: 3}
  m_Name: Light
  m_EditorClassIdentifier: 
  sName: 
  aCooldown: 0
  dCooldown: 0
  canUseAblty: 0
  whatAmulet: 11
  amuletEffect: {fileID: 1007593765635025268, guid: c6a2d6f5b513a254da759b39a4fc8243,
    type: 3}
