%YAML 1.1
%TAG !u! tag:unity3d.com,2011:
--- !u!114 &11400000
MonoBehaviour:
  m_ObjectHideFlags: 0
  m_CorrespondingSourceObject: {fileID: 0}
  m_PrefabInstance: {fileID: 0}
  m_PrefabAsset: {fileID: 0}
  m_GameObject: {fileID: 0}
  m_Enabled: 1
  m_EditorHideFlags: 0
  m_Script: {fileID: 11500000, guid: 8bea234a80a27c24d9767bbf270acd01, type: 3}
  m_Name: Fireball
  m_EditorClassIdentifier: 
  craftID: 1
  cName: FireBall
  cDescription: Launch a fire projectile
  scrollType: 8
  cIngredients:
  - ingredient: 4
    amount: 5
  - ingredient: 12
    amount: 10
  - ingredient: 13
    amount: 5
