%YAML 1.1
%TAG !u! tag:unity3d.com,2011:
--- !u!114 &11400000
MonoBehaviour:
  m_ObjectHideFlags: 0
  m_CorrespondingSourceObject: {fileID: 0}
  m_PrefabInstance: {fileID: 0}
  m_PrefabAsset: {fileID: 0}
  m_GameObject: {fileID: 0}
  m_Enabled: 1
  m_EditorHideFlags: 0
  m_Script: {fileID: 11500000, guid: 8a60287fc968f4dc4b59b3d8973c58d1, type: 3}
  m_Name: NormalAmmo
  m_EditorClassIdentifier: 
  nameString: NormalAmmo
  itemType: 6
  description: Serves as an ammo for your blowpipe.
  prefab: {fileID: 2187626184921711375, guid: b551f4558e73a474b92909823d4a8b35, type: 3}
  sprite2D: {fileID: 21300000, guid: 38ffeec4bcfac654ab27a8a1edd236ff, type: 3}
  questItem: 0
  isStackable: 1
  maxBatCharge: 0
  curBatCharge: 0
  keyID: 0
