%YAML 1.1
%TAG !u! tag:unity3d.com,2011:
--- !u!114 &11400000
MonoBehaviour:
  m_ObjectHideFlags: 0
  m_CorrespondingSourceObject: {fileID: 0}
  m_PrefabInstance: {fileID: 0}
  m_PrefabAsset: {fileID: 0}
  m_GameObject: {fileID: 0}
  m_Enabled: 1
  m_EditorHideFlags: 0
  m_Script: {fileID: 11500000, guid: 09b4a8cf0e2609e4684e3e2fc57e021b, type: 3}
  m_Name: Set
  m_EditorClassIdentifier: 
  dialogueSet:
  - {fileID: 11400000, guid: 8f3838a5a9ec2fd48b9a990a8dfd3212, type: 2}
  - {fileID: 11400000, guid: 1fa8ca47c0c1f3d49965da31b600008e, type: 2}
  - {fileID: 11400000, guid: 6494a4a7cbbb24344aca6369534a25c8, type: 2}
  - {fileID: 11400000, guid: 8af9665515d9f194ca25d96663566539, type: 2}
  - {fileID: 11400000, guid: 6a629616d241aa74db6dd72b5052168e, type: 2}
  - {fileID: 11400000, guid: 88bb0e07b65e2ed46a8a1236e0acea52, type: 2}
