%YAML 1.1
%TAG !u! tag:unity3d.com,2011:
--- !u!114 &11400000
MonoBehaviour:
  m_ObjectHideFlags: 0
  m_CorrespondingSourceObject: {fileID: 0}
  m_PrefabInstance: {fileID: 0}
  m_PrefabAsset: {fileID: 0}
  m_GameObject: {fileID: 0}
  m_Enabled: 1
  m_EditorHideFlags: 0
  m_Script: {fileID: 11500000, guid: 09b4a8cf0e2609e4684e3e2fc57e021b, type: 3}
  m_Name: 1S
  m_EditorClassIdentifier: 
  dialogueSet:
  - {fileID: 11400000, guid: ba247b0dfde05e44b838322a8c6addcd, type: 2}
  - {fileID: 11400000, guid: 211ec88f1e6d98b4db4999f5bc18a5f3, type: 2}
  - {fileID: 11400000, guid: 26fbddd8aab47ca4caa4d2e16f9c6a85, type: 2}
  - {fileID: 11400000, guid: 3c9ed054d642c904599cd710780624b9, type: 2}
  - {fileID: 11400000, guid: ceb3563383bd09c4db2a9e9e6ddc30ea, type: 2}
  - {fileID: 11400000, guid: 89bcef46c85144045bc940a5832897e9, type: 2}
  - {fileID: 11400000, guid: 2e5f7b0d6009bde4b917b24f37c817b2, type: 2}
  - {fileID: 11400000, guid: ca36496a580f8ef4f93d744ffddd4579, type: 2}
  - {fileID: 11400000, guid: 8dada450a3ce90e46a13bd1359603592, type: 2}
