%YAML 1.1
%TAG !u! tag:unity3d.com,2011:
--- !u!114 &11400000
MonoBehaviour:
  m_ObjectHideFlags: 0
  m_CorrespondingSourceObject: {fileID: 0}
  m_PrefabInstance: {fileID: 0}
  m_PrefabAsset: {fileID: 0}
  m_GameObject: {fileID: 0}
  m_Enabled: 1
  m_EditorHideFlags: 0
  m_Script: {fileID: 11500000, guid: f4a9baa85bcdc414dba86dfe2824062d, type: 3}
  m_Name: FireballAmmo
  m_EditorClassIdentifier: 
  ammoName: FireballAmmo
  ammo: {fileID: 3181808174297946081, guid: 333853ff4a2b91c45a6667714728dd4b, type: 3}
  ammoItemType: 8
  ammoSprite: {fileID: 21300000, guid: da3ca6ba4c0ef28458dbf96ee06c88a3, type: 3}
