%YAML 1.1
%TAG !u! tag:unity3d.com,2011:
--- !u!114 &11400000
MonoBehaviour:
  m_ObjectHideFlags: 0
  m_CorrespondingSourceObject: {fileID: 0}
  m_PrefabInstance: {fileID: 0}
  m_PrefabAsset: {fileID: 0}
  m_GameObject: {fileID: 0}
  m_Enabled: 1
  m_EditorHideFlags: 0
  m_Script: {fileID: 11500000, guid: 5f4bd52569f0d924988935fb67538702, type: 3}
  m_Name: Hanan
  m_EditorClassIdentifier: 
  charID: 3
  charImage: {fileID: 21300000, guid: 9a956b82934e75f4397d6f0d358b40f1, type: 3}
  charName: Hanan
  charDescription: "The Deity of the Dawn.. She\u2019s in charge of briefing agents
    in their missions in order to formally start missions. She oversees the beginning
    of the careers of each agent. I never formally had my ceremony due to the situation
    but i guess there\u2019s a first time for everything in this organization."
