{
  "name": "stateca-httpd32",
  "version": "0.0.1",
  "author": "STATE CA",
  "summary": "HTTP Apache Server - 32bit",
  "license": "Apache-2.0",
  "source": "https://git.ca.state.sbu/c1-siebel-puppet/httpd32",
  "project_page": "https://git.ca.state.sbu/c1-siebel-puppet/httpd32",
  "issues_url": "https://git.ca.state.sbu/c1-siebel-puppet/httpd32/issues",
  "data_provider": "hiera",
  "dependencies": [
    {
      "name": "puppetlabs/stdlib",
      "version_requirement": ">= 4.13.1 < 5.0.0"
    },
    {
      "name": "simp/iptables",
      "version_requirement": ">= 6.0.0 < 7.0.0"
    }
  ],
  "requirements": [
    {
      "name": "puppet",
      "version_requirement": ">= 4.7.0 < 5.0.0"
    }
  ],
  "operatingsystem_support": [
    {
      "operatingsystem": "CentOS",
      "operatingsystemrelease": [
        "6",
        "7"
      ]
    },
    {
      "operatingsystem": "RedHat",
      "operatingsystemrelease": [
        "6",
        "7"
      ]
    }
  ]
}
