0 0.331250 0.779167 0.233333 0.330556
0 0.345833 0.457639 0.225000 0.315278
0 0.361458 0.154861 0.222917 0.293056
0 0.525000 0.785417 0.175000 0.298611
0 0.553125 0.480556 0.168750 0.283333
0 0.572917 0.182639 0.208333 0.276389
