0 0.609375 0.590278 0.114583 0.038889
0 0.728125 0.590972 0.118750 0.037500
0 0.857292 0.595833 0.135417 0.047222
0 0.608333 0.555556 0.120833 0.041667
0 0.727083 0.554167 0.129167 0.038889
0 0.858333 0.559722 0.133333 0.044444
0 0.592708 0.488194 0.127083 0.048611
0 0.714583 0.484028 0.133333 0.045833
0 0.841667 0.483333 0.137500 0.047222
0 0.596875 0.703472 0.110417 0.048611
0 0.711458 0.699306 0.131250 0.043056
0 0.840625 0.700000 0.135417 0.052778
