schema_nm,table_nm,obj_typ,ord,is_key,column_nm,data_typ,nullable,column_descr
base_arca,SequelizeMeta,TBL,1,"PK,UK",name,varchar(255),"NOT NULL",
base_arca,action_log,TBL,1,PK,ActionID,int(10),"NOT NULL",
base_arca,action_log,TBL,2," ",Type,varchar(100),"NOT NULL",
base_arca,action_log,TBL,3," ",EntityType,varchar(100),"NOT NULL",
base_arca,action_log,TBL,4," ",EntityID,varchar(100),"NOT NULL",
base_arca,action_log,TBL,5," ",Date,datetime(8),"NOT NULL",
base_arca,action_log,TBL,6," ",Note,varchar(100),NULL,
base_arca,action_log,TBL,7," ",Event,json,NULL,
base_arca,action_log,TBL,8," ",UserID,int(10),NULL,
base_arca,action_log,TBL,9," ",FileID,int(10),NULL,
base_arca,activity,TBL,1,PK,ActivityID,int(10),"NOT NULL",
base_arca,activity,TBL,2," ",Name,varchar(100),NULL,
base_arca,activity,TBL,3," ",Description,text(65535),NULL,
base_arca,activity,TBL,4," ",AssignedTo,int(10),NULL,
base_arca,activity,TBL,5," ",Priority,varchar(20),NULL,
base_arca,activity,TBL,6," ",DateCreated,datetime(8),"NOT NULL",
base_arca,activity,TBL,7," ",DateModified,datetime(8),"NOT NULL",
base_arca,activity,TBL,8," ",LastModifiedBy,int(10),"NOT NULL",
base_arca,agency,TBL,1,PK,AgencyID,int(10),"NOT NULL",
base_arca,agency,TBL,2," ",AgencyName,varchar(100),"NOT NULL",
base_arca,agency,TBL,3," ",Level,varchar(10),NULL,
base_arca,agency,TBL,4," ",NPN,varchar(15),NULL,
base_arca,agency,TBL,5," ",Phone,varchar(100),NULL,
base_arca,agency,TBL,6," ",Email,varchar(100),NULL,
base_arca,agency,TBL,7," ",Active,int(10),NULL,
base_arca,agency,TBL,8," ",Portal,int(10),NULL,
base_arca,agency,TBL,9," ",PortalID,int(10),NULL,
base_arca,agency,TBL,10," ",DateCreated,datetime(8),"NOT NULL",
base_arca,agency,TBL,11," ",LastModified,datetime(8),"NOT NULL",
base_arca,agency,TBL,12," ",LastModifiedBy,int(10),NULL,
base_arca,agency,TBL,13," ",PayPrincipalSeparately,tinyint(3),NULL,
base_arca,agency,TBL,14," ",PayAgents,tinyint(3),NULL,
base_arca,agency,TBL,15," ",MinimumPayout,"decimal(13,2)",NULL,
base_arca,agency,TBL,16," ",FileID,int(10),NULL,
base_arca,agency,TBL,17," ",FullAgencyName,varchar(100),NULL,
base_arca,agency,TBL,18," ",BOBPortalAccess,tinyint(3),NULL,
base_arca,agent,TBL,1,PK,AgentID,int(10),"NOT NULL",
base_arca,agent,TBL,2," ",LastName,varchar(100),"NOT NULL",
base_arca,agent,TBL,3," ",MiddleName,varchar(50),NULL,
base_arca,agent,TBL,4," ",FirstName,varchar(100),"NOT NULL",
base_arca,agent,TBL,5," ",AgencyID,int(10),NULL,
base_arca,agent,TBL,6," ",PortalID,int(10),"NOT NULL",
base_arca,agent,TBL,7," ",AgentNumber,varchar(25),NULL,
base_arca,agent,TBL,8," ",Level,int(10),"NOT NULL",
base_arca,agent,TBL,9," ",ContactPhone,varchar(100),NULL,
base_arca,agent,TBL,10," ",Email,varchar(100),NULL,
base_arca,agent,TBL,11," ",Manager1,varchar(100),NULL,
base_arca,agent,TBL,12," ",Manager2,int(10),NULL,
base_arca,agent,TBL,13," ",Active,int(10),"NOT NULL",
base_arca,agent,TBL,14," ",Portal,int(10),NULL,
base_arca,agent,TBL,15," ",UserName,varchar(255),NULL,
base_arca,agent,TBL,16," ",Password,char(128),NULL,
base_arca,agent,TBL,17," ",Salt,char(128),NULL,
base_arca,agent,TBL,18," ",Notes,text(65535),NULL,
base_arca,agent,TBL,19," ",DateCreated,datetime(8),"NOT NULL",
base_arca,agent,TBL,20," ",LastModified,datetime(8),"NOT NULL",
base_arca,agent,TBL,21," ",LastModifiedBy,int(10),NULL,
base_arca,agent,TBL,22," ",FileID,varchar(200),NULL,
base_arca,agent,TBL,23," ",UserID,int(10),NULL,
base_arca,agent,TBL,24," ",CustomFields,json,NULL,
base_arca,agent,TBL,25," ",CustomFieldsText,mediumtext(16777215),NULL,
base_arca,agent,TBL,26," ",LastLogin,datetime(8),NULL,
base_arca,agent,TBL,27," ",Secret,varchar(255),NULL,
base_arca,agent_carrier_product,TBL,1,PK,ID,int(10),"NOT NULL",
base_arca,agent_carrier_product,TBL,2," ",AgentID,int(10),"NOT NULL",
base_arca,agent_carrier_product,TBL,3," ",CarrierID,int(10),"NOT NULL",
base_arca,agent_carrier_product,TBL,4," ",ProductID,int(10),"NOT NULL",
base_arca,agent_carriers_map,TBL,1,PK,id,int(10),"NOT NULL",
base_arca,agent_carriers_map,TBL,2," ",AgentId,int(10),"NOT NULL",
base_arca,agent_carriers_map,TBL,3," ",CarrierId,int(10),"NOT NULL",
base_arca,agent_carriers_map,TBL,4," ",CarrierSpecificId,varchar(200),"NOT NULL",
base_arca,agent_carriers_map,TBL,5," ",FileID,int(10),NULL,
base_arca,agent_principal_pay_method,TBL,1,PK,id,int(10),"NOT NULL",
base_arca,agent_principal_pay_method,TBL,2," ",AgentID,int(10),"NOT NULL",
base_arca,agent_principal_pay_method,TBL,3," ",AgencyID,int(10),"NOT NULL",
base_arca,agent_principal_pay_method,TBL,4," ",pay_as_agent,int(10),"NOT NULL",
base_arca,agent_principal_pay_method,TBL,5," ",DateCreated,date(3),"NOT NULL",
base_arca,agent_principal_pay_method,TBL,6," ",LastModified,datetime(8),"NOT NULL",
base_arca,agent_principal_pay_method,TBL,7," ",LastModifiedBy,int(10),NULL,
base_arca,alert_emails,TBL,1,PK,ID,int(10),"NOT NULL",
base_arca,alert_emails,TBL,2," ",AlertedAgents,int(10),NULL,
base_arca,alert_emails,TBL,3," ",DateCreated,datetime(8),"NOT NULL",
base_arca,alerts,TBL,1,PK,AlertID,int(10),"NOT NULL",
base_arca,alerts,TBL,2," ",Type,varchar(30),"NOT NULL",
base_arca,alerts,TBL,3," ",StartAlertMonth,int(10),"NOT NULL",
base_arca,alerts,TBL,4," ",StartAlertDay,int(10),"NOT NULL",
base_arca,alerts,TBL,5," ",DeadlineMonth,int(10),"NOT NULL",
base_arca,alerts,TBL,6," ",DeadlineDay,int(10),"NOT NULL",
base_arca,alerts,TBL,7," ",EmailAlerts,tinyint(3),NULL,
base_arca,alerts,TBL,8," ",Frequency,int(10),NULL,
base_arca,alerts,TBL,9," ",State,varchar(30),NULL,
base_arca,alerts,TBL,10," ",CarrierID,int(10),NULL,
base_arca,alerts,TBL,11," ",CarrierName,varchar(45),NULL,
base_arca,alerts,TBL,12," ",Products,json,NULL,
base_arca,alerts,TBL,13," ",Options,json,NULL,
base_arca,alerts,TBL,14," ",DoNotAlert,json,NULL,
base_arca,alerts,TBL,15," ",Active,tinyint(3),NULL,
base_arca,alerts,TBL,16," ",DateCreated,datetime(8),"NOT NULL",
base_arca,alerts,TBL,17," ",LastModified,datetime(8),"NOT NULL",
base_arca,alerts,TBL,18," ",LastModifiedBy,int(10),NULL,
base_arca,application,TBL,1,PK,PolicyID,int(10),"NOT NULL",
base_arca,application,TBL,2," ",Title,varchar(10),NULL,
base_arca,application,TBL,3," ",FirstName,varchar(100),"NOT NULL",
base_arca,application,TBL,4," ",MiddleInitial,varchar(5),NULL,
base_arca,application,TBL,5," ",LastName,varchar(100),"NOT NULL",
base_arca,application,TBL,6," ",Gender,varchar(1),NULL,
base_arca,application,TBL,7," ",Status,varchar(50),NULL,
base_arca,application,TBL,8," ",Type,varchar(100),NULL,
base_arca,application,TBL,9," ",DOB,date(3),NULL,
base_arca,application,TBL,10," ",Email,varchar(100),NULL,
base_arca,application,TBL,11," ",WorkPhone,varchar(100),NULL,
base_arca,application,TBL,12," ",HomePhone,varchar(100),NULL,
base_arca,application,TBL,13," ",CellPhone,varchar(100),NULL,
base_arca,application,TBL,14," ",Address,varchar(100),NULL,
base_arca,application,TBL,15," ",Address2,varchar(100),NULL,
base_arca,application,TBL,16," ",ZipCode,varchar(10),NULL,
base_arca,application,TBL,17," ",City,varchar(100),NULL,
base_arca,application,TBL,18," ",State,varchar(2),NULL,
base_arca,application,TBL,19," ",County,varchar(100),NULL,
base_arca,application,TBL,20," ",PolicyNumber,varchar(30),NULL,
base_arca,application,TBL,21," ",SSN,varchar(11),NULL,
base_arca,application,TBL,22," ",CarrierPolicyID,varchar(30),NULL,
base_arca,application,TBL,23," ",PolicyStatus,varchar(30),NULL,
base_arca,application,TBL,24," ",CoverageType,varchar(100),NULL,
base_arca,application,TBL,25," ",Carrier,varchar(100),"NOT NULL",
base_arca,application,TBL,26," ",Products,varchar(100),NULL,
base_arca,application,TBL,27," ",CreatedDate,datetime(8),"NOT NULL",
base_arca,application,TBL,28," ",AppSubmitDate,date(3),NULL,
base_arca,application,TBL,29," ",EffectiveDate,date(3),NULL,
base_arca,application,TBL,30," ",RenewalDate,date(3),NULL,
base_arca,application,TBL,31," ",TermDate,date(3),NULL,
base_arca,application,TBL,32," ",EnrollmentPlanYear,varchar(4),NULL,
base_arca,application,TBL,33," ",AgentFirstName,varchar(100),"NOT NULL",
base_arca,application,TBL,34," ",AgentLastName,varchar(100),"NOT NULL",
base_arca,application,TBL,35," ",AgentNumber,varchar(30),NULL,
base_arca,application,TBL,36," ",AgentID,int(10),NULL,
base_arca,application,TBL,37," ",AgencyID,int(10),NULL,
base_arca,application,TBL,38," ",CarrierID,int(10),NULL,
base_arca,application,TBL,39," ",ProductID,int(10),NULL,
base_arca,application,TBL,40," ",AgencyName,varchar(100),NULL,
base_arca,application,TBL,41," ",Manager,varchar(200),NULL,
base_arca,application,TBL,42," ",LeadSource,varchar(100),NULL,
base_arca,application,TBL,43," ",Source,varchar(100),NULL,
base_arca,application,TBL,44," ",Telemarketer,varchar(200),NULL,
base_arca,application,TBL,45," ",FaceAmount,"decimal(13,2)",NULL,
base_arca,application,TBL,46," ",AgentStateLicenseNumber,varchar(100),NULL,
base_arca,application,TBL,47," ",SEPReasons,json,NULL,
base_arca,application,TBL,48," ",AuthorizedRepresentative,json,NULL,
base_arca,application,TBL,49," ",MailingInfomation,json,NULL,
base_arca,application,TBL,50," ",MedicareInformation,json,NULL,
base_arca,application,TBL,51," ",EmergencyContact,json,NULL,
base_arca,application,TBL,52," ",PaymentInformation,json,NULL,
base_arca,application,TBL,53," ",InternalInformation,json,NULL,
base_arca,application,TBL,54," ",OtherPolicyHolderInformation,json,NULL,
base_arca,application,TBL,55," ",policyNote,text(65535),NULL,
base_arca,application,TBL,56," ",LastModified,datetime(8),"NOT NULL",
base_arca,application,TBL,57," ",LastModifiedBy,int(10),"NOT NULL",
base_arca,application,TBL,58," ",FileID,varchar(200),NULL,
base_arca,application,TBL,59," ",InputSource,int(10),"NOT NULL",
base_arca,application,TBL,60," ",TelemarketerID,int(10),NULL,
base_arca,application,TBL,61," ",AnnualPremium,"decimal(13,2)",NULL,
base_arca,application,TBL,62," ",UserID,int(10),NULL,
base_arca,application,TBL,63," ",PlanCode,varchar(100),NULL,
base_arca,application,TBL,64," ",Frequency,int(10),NULL,
base_arca,application,TBL,65," ",ConfirmationNumber,varchar(100),NULL,
base_arca,application,TBL,66," ",PipelineID,int(10),NULL,
base_arca,application,TBL,67," ",PersonID,int(10),NULL,
base_arca,application,TBL,68," ",OpportunityID,int(10),NULL,
base_arca,application,TBL,69," ",CustomFields,json,NULL,
base_arca,application,TBL,70," ",CustomFieldsText,mediumtext(16777215),NULL,
base_arca,artifacts,TBL,1,PK,ArtifactID,int(10),"NOT NULL",
base_arca,artifacts,TBL,2,PK,EntityID,int(10),"NOT NULL",
base_arca,artifacts,TBL,3," ",Entity,char(128),"NOT NULL",
base_arca,artifacts,TBL,4," ",FilePath,char(128),"NOT NULL",
base_arca,artifacts,TBL,5," ",DateCreated,datetime(8),"NOT NULL",
base_arca,artifacts,TBL,6," ",LastModified,datetime(8),"NOT NULL",
base_arca,artifacts,TBL,7," ",LastModifiedBy,char(20),NULL,
base_arca,artifacts,TBL,8," ",FileType,varchar(10),NULL,
base_arca,carrier,TBL,1,PK,CarrierID,int(10),"NOT NULL",
base_arca,carrier,TBL,2," ",CarrierName,varchar(100),"NOT NULL",
base_arca,carrier,TBL,3," ",CarrierDescription,text(65535),NULL,
base_arca,carrier,TBL,4," ",CarrierContact,varchar(100),NULL,
base_arca,carrier,TBL,5," ",CarrierPhone,varchar(100),NULL,
base_arca,carrier,TBL,6," ",CarrierEmail1,varchar(100),NULL,
base_arca,carrier,TBL,7," ",CarrierEmail2,varchar(100),NULL,
base_arca,carrier,TBL,8," ",DateCreated,datetime(8),"NOT NULL",
base_arca,carrier,TBL,9," ",LastModified,datetime(8),"NOT NULL",
base_arca,carrier,TBL,10," ",LastModifiedBy,int(10),"NOT NULL",
base_arca,carrier,TBL,11," ",FileID,int(10),NULL,
base_arca,carrier,TBL,12," ",DirectPolicySubmission,tinyint(3),NULL,
base_arca,carrier,TBL,13," ",CarrierStates,varchar(150),NULL,
base_arca,carrier_org_hierarchy,TBL,1,PK,COHID,int(10),"NOT NULL",
base_arca,carrier_org_hierarchy,TBL,2," ",ORCarrierID,varchar(50),NULL,
base_arca,carrier_org_hierarchy,TBL,3," ",ORCarrierName,varchar(50),NULL,
base_arca,carrier_org_hierarchy,TBL,4," ",ORAgencyID,varchar(50),NULL,
base_arca,carrier_org_hierarchy,TBL,5," ",ORAgencyNPN,varchar(50),NULL,
base_arca,carrier_org_hierarchy,TBL,6," ",ORAgencyName,varchar(50),NULL,
base_arca,carrier_org_hierarchy,TBL,7," ",ORPrincipalID,varchar(50),NULL,
base_arca,carrier_org_hierarchy,TBL,8," ",ORPrincipalAgentNPN,varchar(50),NULL,
base_arca,carrier_org_hierarchy,TBL,9," ",ORPrincipalAgentName,varchar(100),NULL,
base_arca,carrier_org_hierarchy,TBL,10," ",ORAgentID,varchar(50),NULL,
base_arca,carrier_org_hierarchy,TBL,11," ",ORAgentName,varchar(50),NULL,
base_arca,carrier_org_hierarchy,TBL,12," ",CarrierID,int(10),"NOT NULL",
base_arca,carrier_org_hierarchy,TBL,13," ",AgencyID,int(10),"NOT NULL",
base_arca,carrier_org_hierarchy,TBL,14," ",AgentID,int(10),"NOT NULL",
base_arca,carrier_org_hierarchy,TBL,15," ",ORName,varchar(50),"NOT NULL",
base_arca,carrier_org_hierarchy,TBL,16," ",OREffectiveDate,datetime(8),NULL,
base_arca,carrier_org_hierarchy,TBL,17," ",ORAmount,"decimal(13,2)","NOT NULL",
base_arca,carrier_org_hierarchy,TBL,18," ",ORPayLevel,varchar(100),NULL,
base_arca,carrier_org_hierarchy,TBL,19," ",ORID,varchar(100),NULL,
base_arca,carrier_org_hierarchy,TBL,20," ",OREndDate,datetime(8),NULL,
base_arca,carrier_org_hierarchy,TBL,21," ",ORCarrierStates,json,NULL,
base_arca,carrier_org_hierarchy,TBL,22," ",ORPayRate,json,NULL,
base_arca,carrier_org_hierarchy,TBL,23," ",ORTagID,json,NULL,
base_arca,carrier_org_hierarchy,TBL,24," ",HierarchyLevel,varchar(100),NULL,
base_arca,carrier_org_hierarchy,TBL,25," ",HierarchyLevelName,varchar(100),NULL,
base_arca,carrier_org_hierarchy,TBL,26," ",ContractBaseAmtNB,"decimal(13,2)",NULL,
base_arca,carrier_org_hierarchy,TBL,27," ",ContractBaseAmtREN,"decimal(13,2)",NULL,
base_arca,carrier_org_hierarchy,TBL,28," ",ContractBaseAmtOTHER,"decimal(13,2)",NULL,
base_arca,carrier_org_hierarchy,TBL,29," ",LOB,varchar(100),NULL,
base_arca,carrier_org_hierarchy,TBL,30," ",PayoutType,varchar(45),NULL,
base_arca,carrier_org_hierarchy,TBL,31," ",PayoutFrequency,int(10),NULL,
base_arca,carrier_org_hierarchy,TBL,32," ",IsActive,tinyint(3),NULL,
base_arca,components,TBL,1,PK,id,int(10),"NOT NULL",
base_arca,components,TBL,2," ",Name,varchar(100),"NOT NULL",
base_arca,components,TBL,3," ",Custom,int(10),"NOT NULL",
base_arca,condition_types,TBL,1,PK,id,int(10),"NOT NULL",
base_arca,condition_types,TBL,2," ",Name,varchar(200),"NOT NULL",
base_arca,condition_types,TBL,3," ",PayAll,tinyint(3),"NOT NULL",
base_arca,dashboard_dispositions,TBL,1,PK,id,int(10),"NOT NULL",
base_arca,dashboard_dispositions,TBL,2,"FK,UK",UserID,int(10),"NOT NULL",
base_arca,dashboard_dispositions,TBL,3," ",Disposition,json,"NOT NULL",
base_arca,dashboard_dispositions,TBL,4," ",DateCreated,datetime(8),"NOT NULL",
base_arca,dashboard_dispositions,TBL,5," ",LastModified,datetime(8),"NOT NULL",
base_arca,dashboards,TBL,1,PK,id,int(10),"NOT NULL",
base_arca,dashboards,TBL,2," ",Name,varchar(200),"NOT NULL",
base_arca,dashboards,TBL,3," ",Location,varchar(200),"NOT NULL",
base_arca,dashboards,TBL,4," ",Active,int(10),"NOT NULL",
base_arca,dashboards,TBL,5," ",InSidebar,int(10),"NOT NULL",
base_arca,dashboards,TBL,6," ",Components,json,"NOT NULL",
base_arca,dashboards,TBL,7," ",Custom,int(10),"NOT NULL",
base_arca,dashboards,TBL,8," ",SubMenuItems,json,NULL,
base_arca,dashboards,TBL,9," ",Icon,varchar(100),NULL,
base_arca,document,TBL,1,PK,DocumentID,int(10),"NOT NULL",
base_arca,document,TBL,2," ",Type,varchar(45),"NOT NULL",
base_arca,document,TBL,3," ",Status,varchar(20),"NOT NULL",
base_arca,document,TBL,4,PK,AgentID,int(10),"NOT NULL",
base_arca,document,TBL,5," ",ArtifactID,json,NULL,
base_arca,document,TBL,6," ",CarrierID,int(10),NULL,
base_arca,document,TBL,7," ",CarrierName,varchar(30),NULL,
base_arca,document,TBL,8," ",ProductID,int(10),NULL,
base_arca,document,TBL,9," ",ProductName,varchar(250),NULL,
base_arca,document,TBL,10," ",State,varchar(2),NULL,
base_arca,document,TBL,11," ",IDCode,varchar(30),NULL,
base_arca,document,TBL,12," ",LicenseNumber,varchar(45),NULL,
base_arca,document,TBL,13," ",CompletionDate,date(3),NULL,
base_arca,document,TBL,14," ",ExpirationDate,date(3),NULL,
base_arca,document,TBL,15," ",Year,varchar(4),NULL,
base_arca,document,TBL,16," ",DateCreated,datetime(8),NULL,
base_arca,document,TBL,17," ",LastModified,datetime(8),NULL,
base_arca,document,TBL,18," ",LastModifiedBy,int(10),NULL,
base_arca,email,TBL,1,PK,id,int(10),"NOT NULL",
base_arca,email,TBL,2," ",To,varchar(255),"NOT NULL",
base_arca,email,TBL,3," ",Subject,varchar(255),"NOT NULL",
base_arca,email,TBL,4," ",Content,text(65535),"NOT NULL",
base_arca,email,TBL,5," ",Type,varchar(100),NULL,
base_arca,email,TBL,6," ",HTMLContent,json,NULL,
base_arca,email,TBL,7," ",DateCreated,datetime(8),"NOT NULL",
base_arca,email,TBL,8," ",ProcessTime,datetime(8),NULL,
base_arca,event_exceptions,TBL,1,PK,id,int(10),"NOT NULL",
base_arca,event_exceptions,TBL,2," ",EventID,int(10),"NOT NULL",
base_arca,event_exceptions,TBL,3," ",IsRescheduled,int(10),NULL,
base_arca,event_exceptions,TBL,4," ",IsCancelled,int(10),NULL,
base_arca,event_exceptions,TBL,5," ",start,datetime(8),NULL,
base_arca,event_exceptions,TBL,6," ",end,datetime(8),NULL,
base_arca,event_exceptions,TBL,7," ",FullDay,int(10),NULL,
base_arca,event_exceptions,TBL,8," ",DateCreated,datetime(8),"NOT NULL",
base_arca,event_exceptions,TBL,9," ",LastModifiedBy,int(10),NULL,
base_arca,events,TBL,1,PK,id,int(10),"NOT NULL",
base_arca,events,TBL,2," ",title,varchar(255),NULL,
base_arca,events,TBL,3," ",description,text(65535),NULL,
base_arca,events,TBL,4," ",location,text(65535),NULL,
base_arca,events,TBL,5," ",contact,text(65535),NULL,
base_arca,events,TBL,6," ",url,varchar(255),NULL,
base_arca,events,TBL,7," ",start,datetime(8),NULL,
base_arca,events,TBL,8," ",end,datetime(8),NULL,
base_arca,events,TBL,9," ",DateCreated,datetime(8),"NOT NULL",
base_arca,events,TBL,10," ",LastModified,datetime(8),"NOT NULL",
base_arca,events,TBL,11," ",LastModifiedBy,int(10),NULL,
base_arca,events,TBL,12," ",FullDay,int(10),NULL,
base_arca,events,TBL,13," ",Recurring,int(10),NULL,
base_arca,events,TBL,14," ",UserID,int(10),NULL,
base_arca,events,TBL,15," ",ParentEventID,int(10),NULL,
base_arca,events,TBL,16," ",Public,int(10),NULL,
base_arca,events,TBL,17," ",Type,varchar(255),NULL,
base_arca,events,TBL,18," ",ActionID,int(10),NULL,
base_arca,expenses,TBL,1,PK,id,int(10),"NOT NULL",
base_arca,expenses,TBL,2," ",Amount,"decimal(13,2)","NOT NULL",
base_arca,expenses,TBL,3," ",Date,date(3),"NOT NULL",
base_arca,expenses,TBL,4," ",Type,varchar(200),"NOT NULL",
base_arca,expenses,TBL,5," ",Notes,text(65535),NULL,
base_arca,expenses,TBL,6," ",DateCreated,datetime(8),"NOT NULL",
base_arca,expenses,TBL,7," ",UserID,int(10),NULL,
base_arca,file_imports,TBL,1,PK,id,int(10),"NOT NULL",
base_arca,file_imports,TBL,2," ",FileName,varchar(200),"NOT NULL",
base_arca,file_imports,TBL,3," ",ImportTable,varchar(200),"NOT NULL",
base_arca,file_imports,TBL,4," ",ImportComplete,int(10),"NOT NULL",
base_arca,file_imports,TBL,5," ",SocketId,varchar(100),NULL,
base_arca,file_imports,TBL,6," ",DateCreated,datetime(8),"NOT NULL",
base_arca,file_imports,TBL,7," ",OtherInformation,json,NULL,
base_arca,file_imports,TBL,8," ",SheetTemplateIDs,json,NULL,
base_arca,grid_settings,TBL,1,PK,GridID,int(10),"NOT NULL",
base_arca,grid_settings,TBL,2,FK,UserID,int(10),"NOT NULL",
base_arca,grid_settings,TBL,3," ",GridName,varchar(100),"NOT NULL",
base_arca,grid_settings,TBL,4," ",GridTitle,varchar(100),"NOT NULL",
base_arca,grid_settings,TBL,5," ",Headers,json,"NOT NULL",
base_arca,grid_settings,TBL,6," ",Filters,json,"NOT NULL",
base_arca,grid_settings,TBL,7," ",Pagination,json,"NOT NULL",
base_arca,grid_settings,TBL,8," ",CurrentFilters,json,NULL,
base_arca,group_members,TBL,1,PK,id,int(10),"NOT NULL",
base_arca,group_members,TBL,2," ",GroupId,int(10),"NOT NULL",
base_arca,group_members,TBL,3," ",EntityId,int(10),"NOT NULL",
base_arca,groups,TBL,1,PK,id,int(10),"NOT NULL",
base_arca,groups,TBL,2," ",Type,varchar(200),"NOT NULL",
base_arca,groups,TBL,3," ",GroupName,varchar(200),"NOT NULL",
base_arca,history,TBL,1,PK,id,int(10),"NOT NULL",
base_arca,history,TBL,2," ",TableName,varchar(100),"NOT NULL",
base_arca,history,TBL,3," ",FieldName,varchar(100),"NOT NULL",
base_arca,history,TBL,4," ",EntityID,int(10),"NOT NULL",
base_arca,history,TBL,5," ",NewValue,varchar(200),NULL,
base_arca,history,TBL,6," ",OldValue,varchar(200),NULL,
base_arca,history,TBL,7," ",FileID,int(10),NULL,
base_arca,history,TBL,8," ",UserID,int(10),NULL,
base_arca,history,TBL,9," ",Timestamp,datetime(8),"NOT NULL",
base_arca,history,TBL,10," ",CallID,int(10),NULL,
base_arca,importTemplate,TBL,1,PK,id,int(10),"NOT NULL",
base_arca,importTemplate,TBL,2," ",name,varchar(100),"NOT NULL",
base_arca,importTemplate,TBL,3," ",paymentHeaders,json,"NOT NULL",
base_arca,importTemplate,TBL,4," ",onStatement,json,"NOT NULL",
base_arca,import_templates,TBL,1,PK,TemplateID,int(10),"NOT NULL",
base_arca,import_templates,TBL,2," ",TemplateName,varchar(100),"NOT NULL",
base_arca,import_templates,TBL,3," ",TemplateType,varchar(100),"NOT NULL",
base_arca,import_templates,TBL,4," ",Template,json,NULL,
base_arca,imports,TBL,1,PK,id,int(10),"NOT NULL",
base_arca,imports,TBL,2," ",CommPostDate,date(3),"NOT NULL",
base_arca,imports,TBL,3," ",FileName,varchar(200),"NOT NULL",
base_arca,imports,TBL,4," ",ReconciliationDate,date(3),NULL,
base_arca,imports,TBL,5," ",Active,int(10),NULL,
base_arca,imports,TBL,6," ",Stage,int(10),NULL,
base_arca,imports,TBL,7," ",DateCreated,datetime(8),"NOT NULL",
base_arca,imports,TBL,8," ",LastModified,datetime(8),"NOT NULL",
base_arca,imports,TBL,9," ",LastModifiedBy,int(10),"NOT NULL",
base_arca,invitations,TBL,1,PK,id,int(10),"NOT NULL",
base_arca,invitations,TBL,2," ",UserID,int(10),"NOT NULL",
base_arca,invitations,TBL,3," ",EventID,int(10),"NOT NULL",
base_arca,invitations,TBL,4," ",Response,varchar(255),NULL,
base_arca,invitations,TBL,5," ",ResponseText,text(65535),NULL,
base_arca,leadsource,TBL,1,PK,id,int(10),"NOT NULL",
base_arca,leadsource,TBL,2," ",CampaignName,varchar(100),"NOT NULL",
base_arca,leadsource,TBL,3," ",CampaignDescription,varchar(200),NULL,
base_arca,leadsource,TBL,4," ",Status,int(10),NULL,
base_arca,leadsource,TBL,5," ",DateCreated,datetime(8),"NOT NULL",
base_arca,leadsource,TBL,6," ",LastModified,datetime(8),"NOT NULL",
base_arca,leadsource,TBL,7," ",LastModifiedBy,int(10),NULL,
base_arca,leadsource,TBL,8," ",StartDate,date(3),NULL,
base_arca,leadsource,TBL,9," ",EndDate,date(3),NULL,
base_arca,leadsource,TBL,10," ",PipelineID,int(10),NULL,
base_arca,leadsource,TBL,11," ",FormID,int(10),NULL,
base_arca,leadsource,TBL,12," ",PersonFormID,int(10),NULL,
base_arca,leadsource,TBL,13," ",ColorCode,json,NULL,
base_arca,leadsource,TBL,14," ",FileID,varchar(255),NULL,
base_arca,notification,TBL,1,PK,id,int(10),"NOT NULL",
base_arca,notification,TBL,2," ",UserID,int(10),"NOT NULL",
base_arca,notification,TBL,3," ",Title,varchar(255),NULL,
base_arca,notification,TBL,4," ",Text,varchar(255),NULL,
base_arca,notification,TBL,5," ",Link,varchar(255),NULL,
base_arca,notification,TBL,6," ",Seen,datetime(8),NULL,
base_arca,notification,TBL,7," ",DisplayTime,datetime(8),NULL,
base_arca,notification,TBL,8," ",Sent,tinyint(3),"NOT NULL",
base_arca,notification,TBL,9," ",ActionID,int(10),NULL,
base_arca,notification_schedule,TBL,1,PK,id,int(10),"NOT NULL",
base_arca,notification_schedule,TBL,2," ",EventID,int(10),"NOT NULL",
base_arca,notification_schedule,TBL,3," ",Minutes,int(10),NULL,
base_arca,notification_schedule,TBL,4," ",NextOccurrence,datetime(8),NULL,
base_arca,notification_schedule,TBL,5," ",DateCreated,datetime(8),"NOT NULL",
base_arca,opportunity,TBL,1,PK,OpportunityID,int(10),"NOT NULL",
base_arca,opportunity,TBL,2," ",PersonID,int(10),NULL,
base_arca,opportunity,TBL,3," ",CampaignID,int(10),NULL,
base_arca,opportunity,TBL,4," ",AgentID,int(10),NULL,
base_arca,opportunity,TBL,5," ",TelemarketerID,int(10),NULL,
base_arca,opportunity,TBL,6," ",ProductID,int(10),NULL,
base_arca,opportunity,TBL,7," ",Status,varchar(100),"NOT NULL",
base_arca,opportunity,TBL,8," ",Notes,varchar(100),NULL,
base_arca,opportunity,TBL,9," ",FileID,int(10),NULL,
base_arca,opportunity,TBL,10," ",PipelineID,int(10),NULL,
base_arca,opportunity,TBL,11," ",PolicyID,int(10),NULL,
base_arca,opportunity,TBL,12," ",CarrierID,int(10),NULL,
base_arca,opportunity,TBL,13," ",CustomFields,json,"NOT NULL",
base_arca,opportunity,TBL,14," ",Application,json,"NOT NULL",
base_arca,opportunity,TBL,15," ",ClosedDate,date(3),NULL,
base_arca,opportunity,TBL,16," ",UserID,int(10),NULL,
base_arca,opportunity,TBL,17," ",DateCreated,datetime(8),NULL,
base_arca,opportunity,TBL,18," ",LastModified,datetime(8),NULL,
base_arca,opportunity,TBL,19," ",LastModifiedBy,int(10),NULL,
base_arca,opportunity,TBL,20," ",CustomFieldsText,mediumtext(16777215),NULL,
base_arca,opportunity,TBL,21," ",AgencyID,int(10),NULL,
base_arca,payment_conditions,TBL,1,PK,id,int(10),"NOT NULL",
base_arca,payment_conditions,TBL,2," ",ForCarrier,int(10),NULL,
base_arca,payment_conditions,TBL,3," ",ForAgency,int(10),NULL,
base_arca,payment_conditions,TBL,4," ",ForAgent,int(10),NULL,
base_arca,payment_conditions,TBL,5," ",ConditionType,int(10),NULL,
base_arca,payment_conditions,TBL,6," ",Condition,json,"NOT NULL",
base_arca,payment_conditions,TBL,7," ",Name,varchar(200),"NOT NULL",
base_arca,payment_conditions,TBL,8," ",OverrideIds,json,NULL,
base_arca,payment_conditions,TBL,9," ",PayType,varchar(100),NULL,
base_arca,payment_conditions,TBL,10," ",Active,tinyint(3),"NOT NULL",
base_arca,payment_description,TBL,1,PK,id,int(10),"NOT NULL",
base_arca,payment_description,TBL,2," ",ConditionId,int(10),"NOT NULL",
base_arca,payment_description,TBL,3," ",PayTo,varchar(200),"NOT NULL",
base_arca,payment_description,TBL,4," ",Equation,json,"NOT NULL",
base_arca,payment_description,TBL,5," ",RequiredPaymentTypes,varchar(200),"NOT NULL",
base_arca,payment_description,TBL,6," ",PayType,varchar(100),"NOT NULL",
base_arca,payment_description,TBL,7," ",StartDate,date(3),NULL,
base_arca,payment_description,TBL,8," ",EndDate,date(3),NULL,
base_arca,payment_tag_types,TBL,1,PK,id,int(10),"NOT NULL",
base_arca,payment_tag_types,TBL,2," ",entityType,varchar(100),NULL,
base_arca,payment_tag_types,TBL,3," ",name,varchar(100),"NOT NULL",
base_arca,payment_tags,TBL,1,PK,id,int(10),"NOT NULL",
base_arca,payment_tags,TBL,2," ",entityType,varchar(100),"NOT NULL",
base_arca,payment_tags,TBL,3," ",entityId,int(10),"NOT NULL",
base_arca,payment_tags,TBL,4," ",name,varchar(100),"NOT NULL",
base_arca,payment_tags,TBL,5," ",start,date(3),NULL,
base_arca,payment_tags,TBL,6," ",end,date(3),NULL,
base_arca,payment_tags,TBL,7," ",policyDateType,varchar(100),NULL,
base_arca,payment_tags,TBL,8," ",FileID,int(10),NULL,
base_arca,payment_types,TBL,1,PK,id,int(10),"NOT NULL",
base_arca,payment_types,TBL,2," ",Name,varchar(100),"NOT NULL",
base_arca,payment_types,TBL,3," ",ToType,varchar(100),"NOT NULL",
base_arca,payments,TBL,1,PK,id,int(10),"NOT NULL",
base_arca,payments,TBL,2," ",ToType,varchar(200),"NOT NULL",
base_arca,payments,TBL,3," ",For,varchar(200),"NOT NULL",
base_arca,payments,TBL,4," ",ToId,int(10),"NOT NULL",
base_arca,payments,TBL,5," ",ForType,varchar(200),NULL,
base_arca,payments,TBL,6," ",ForId,int(10),NULL,
base_arca,payments,TBL,7," ",FromType,varchar(200),"NOT NULL",
base_arca,payments,TBL,8," ",FromId,int(10),"NOT NULL",
base_arca,payments,TBL,9," ",Amount,"decimal(13,2)","NOT NULL",
base_arca,payments,TBL,10," ",StatementLineId,int(10),NULL,
base_arca,payments,TBL,11," ",DateCreated,datetime(8),NULL,
base_arca,payments,TBL,12," ",TransactionDate,date(3),"NOT NULL",
base_arca,payments,TBL,13," ",FileID,int(10),NULL,
base_arca,payments,TBL,14," ",Paid,tinyint(3),NULL,
base_arca,payments,TBL,15," ",PayType,varchar(100),NULL,
base_arca,payments,TBL,16," ",MarkedPaid,tinyint(3),NULL,
base_arca,payments,TBL,17," ",AppID,int(10),NULL,
base_arca,payments,TBL,18," ",PayoutTransactionDate,date(3),NULL,
base_arca,payments,TBL,19," ",RuleTriggered,int(10),NULL,
base_arca,payrule_join,TBL,1,PK,orig_id,int(10),"NOT NULL",
base_arca,payrule_join,TBL,2," ",new_id,int(10),NULL,
base_arca,permissions,TBL,1,PK,id,int(10),"NOT NULL",
base_arca,permissions,TBL,2," ",DashboardID,int(10),"NOT NULL",
base_arca,permissions,TBL,3," ",RoleID,int(10),"NOT NULL",
base_arca,person,TBL,1,PK,PersonID,int(10),"NOT NULL",
base_arca,person,TBL,2," ",Type,varchar(100),"NOT NULL",
base_arca,person,TBL,3," ",FirstName,varchar(100),"NOT NULL",
base_arca,person,TBL,4," ",LastName,varchar(100),"NOT NULL",
base_arca,person,TBL,5," ",DOB,date(3),NULL,
base_arca,person,TBL,6," ",Gender,varchar(100),NULL,
base_arca,person,TBL,7," ",Address,varchar(100),NULL,
base_arca,person,TBL,8," ",Address2,varchar(100),NULL,
base_arca,person,TBL,9," ",City,varchar(100),NULL,
base_arca,person,TBL,10," ",State,varchar(100),NULL,
base_arca,person,TBL,11," ",County,varchar(100),NULL,
base_arca,person,TBL,12," ",ZipCode,varchar(100),NULL,
base_arca,person,TBL,13," ",HomePhone,varchar(100),NULL,
base_arca,person,TBL,14," ",CellPhone,varchar(100),NULL,
base_arca,person,TBL,15," ",Email,varchar(100),NULL,
base_arca,person,TBL,16," ",Status,varchar(100),"NOT NULL",
base_arca,person,TBL,17," ",CustomFields,json,NULL,
base_arca,person,TBL,18," ",LeadsourceID,int(10),NULL,
base_arca,person,TBL,19," ",FullName,varchar(200),NULL,
base_arca,person,TBL,20," ",FileID,int(10),NULL,
base_arca,person,TBL,21," ",WorkPhone,varchar(100),NULL,
base_arca,person,TBL,22," ",MBI,varchar(100),NULL,
base_arca,person,TBL,23," ",DateCreated,datetime(8),NULL,
base_arca,person,TBL,24," ",LastModified,datetime(8),NULL,
base_arca,person,TBL,25," ",LastModifiedBy,int(10),NULL,
base_arca,person,TBL,26," ",CustomFieldsText,mediumtext(16777215),NULL,
base_arca,person,TBL,27," ",AgentID,int(10),NULL,
base_arca,person,TBL,28," ",AgencyID,int(10),"NOT NULL",
base_arca,person,TBL,29," ",AgentGenerated,int(10),"NOT NULL",
base_arca,person,TBL,30," ",MiddleName,varchar(255),NULL,
base_arca,pipeline,TBL,1,PK,id,int(10),"NOT NULL",
base_arca,pipeline,TBL,2," ",Type,varchar(255),"NOT NULL",
base_arca,pipeline,TBL,3," ",Name,varchar(255),NULL,
base_arca,pipeline,TBL,4," ",Pipeline,json,NULL,
base_arca,product,TBL,1,PK,ProductID,int(10),"NOT NULL",
base_arca,product,TBL,2," ",CarrierID,int(10),"NOT NULL",
base_arca,product,TBL,3," ",CarrierName,varchar(100),"NOT NULL",
base_arca,product,TBL,4," ",ProductName,varchar(250),"NOT NULL",
base_arca,product,TBL,5," ",ProductType,varchar(100),NULL,
base_arca,product,TBL,6," ",ProductDescription,text(65535),NULL,
base_arca,product,TBL,7," ",ProductYear,year,"NOT NULL",
base_arca,product,TBL,8," ",DateCreated,datetime(8),"NOT NULL",
base_arca,product,TBL,9," ",LastModified,datetime(8),"NOT NULL",
base_arca,product,TBL,10," ",LastModifiedBy,int(10),NULL,
base_arca,product,TBL,11," ",ProductPlanCodes,json,NULL,
base_arca,product,TBL,12," ",FileID,varchar(200),NULL,
base_arca,product,TBL,13," ",LifeTimeValue,int(10),NULL,
base_arca,recurrence_rules,TBL,1,PK,id,int(10),"NOT NULL",
base_arca,recurrence_rules,TBL,2," ",EventID,int(10),"NOT NULL",
base_arca,recurrence_rules,TBL,3," ",Freq,varchar(100),"NOT NULL",
base_arca,recurrence_rules,TBL,4," ",Interval,int(10),NULL,
base_arca,recurrence_rules,TBL,5," ",Count,int(10),NULL,
base_arca,recurrence_rules,TBL,6," ",Until,datetime(8),NULL,
base_arca,recurrence_rules,TBL,7," ",ByMinute,varchar(255),NULL,
base_arca,recurrence_rules,TBL,8," ",ByHour,varchar(255),NULL,
base_arca,recurrence_rules,TBL,9," ",ByDay,varchar(255),NULL,
base_arca,recurrence_rules,TBL,10," ",ByMonthDay,varchar(255),NULL,
base_arca,recurrence_rules,TBL,11," ",ByYearDay,varchar(255),NULL,
base_arca,recurrence_rules,TBL,12," ",ByWeekNo,varchar(255),NULL,
base_arca,recurrence_rules,TBL,13," ",ByMonth,varchar(255),NULL,
base_arca,recurrence_rules,TBL,14," ",BySetPos,varchar(255),NULL,
base_arca,recurrence_rules,TBL,15," ",Wkst,varchar(255),NULL,
base_arca,relationship,TBL,1,PK,id,int(10),"NOT NULL",
base_arca,relationship,TBL,2," ",name,varchar(100),"NOT NULL",
base_arca,relationship,TBL,3," ",fromType,varchar(100),"NOT NULL",
base_arca,relationship,TBL,4," ",toType,varchar(100),NULL,
base_arca,relationship,TBL,5," ",fromId,int(10),NULL,
base_arca,relationship,TBL,6," ",toId,int(10),NULL,
base_arca,relationship,TBL,7," ",fileId,int(10),NULL,
base_arca,relationship,TBL,8," ",startDate,date(3),NULL,
base_arca,relationship,TBL,9," ",endDate,date(3),NULL,
base_arca,relationship,TBL,10," ",carrierId,int(10),NULL,
base_arca,relationship_types,TBL,1,PK,id,int(10),"NOT NULL",
base_arca,relationship_types,TBL,2," ",Name,varchar(100),"NOT NULL",
base_arca,relationship_types,TBL,3," ",FromType,varchar(100),"NOT NULL",
base_arca,relationship_types,TBL,4," ",ToType,varchar(100),"NOT NULL",
base_arca,renewal_frequency,TBL,1,PK,id,int(10),"NOT NULL",
base_arca,renewal_frequency,TBL,2," ",Frequency,int(10),"NOT NULL",
base_arca,renewal_frequency,TBL,3," ",RenewalAmount,"decimal(13,2)",NULL,
base_arca,renewal_frequency,TBL,4," ",CarrierID,int(10),"NOT NULL",
base_arca,renewal_frequency,TBL,5," ",PlanType,varchar(100),NULL,
base_arca,renewal_frequency,TBL,6," ",ProductID,int(10),NULL,
base_arca,renewal_frequency,TBL,7," ",StartDate,date(3),NULL,
base_arca,renewal_frequency,TBL,8," ",EndDate,date(3),NULL,
base_arca,roles,TBL,1,PK,id,int(10),"NOT NULL",
base_arca,roles,TBL,2," ",Role,varchar(45),"NOT NULL",
base_arca,sequelizemeta,TBL,1,PK,name,varchar(255),"NOT NULL",
base_arca,setting,TBL,1,PK,SettingID,int(10),"NOT NULL",
base_arca,setting,TBL,2," ",Name,varchar(100),"NOT NULL",
base_arca,setting,TBL,3," ",Type,varchar(100),"NOT NULL",
base_arca,setting,TBL,4," ",Settings,json,NULL,
base_arca,statementLine,TBL,1,PK,id,int(10),"NOT NULL",
base_arca,statementLine,TBL,2," ",AgentID,int(10),NULL,
base_arca,statementLine,TBL,3," ",CarrierID,int(10),NULL,
base_arca,statementLine,TBL,4," ",AgencyID,int(10),NULL,
base_arca,statementLine,TBL,5," ",ProductID,int(10),NULL,
base_arca,statementLine,TBL,6," ",AppID,int(10),NULL,
base_arca,statementLine,TBL,7," ",ArcaID,int(10),NULL,
base_arca,statementLine,TBL,8," ",PostDate,date(3),"NOT NULL",
base_arca,statementLine,TBL,9," ",AgentFirst,varchar(100),NULL,
base_arca,statementLine,TBL,10," ",AgentLast,varchar(100),NULL,
base_arca,statementLine,TBL,11," ",CarrierName,varchar(50),NULL,
base_arca,statementLine,TBL,12," ",PolicyNum,varchar(45),NULL,
base_arca,statementLine,TBL,13," ",CarrierPolicyID,varchar(100),NULL,
base_arca,statementLine,TBL,14," ",PlanType,text(65535),NULL,
base_arca,statementLine,TBL,15," ",PlanInfo,varchar(200),NULL,
base_arca,statementLine,TBL,16," ",Agency,varchar(100),NULL,
base_arca,statementLine,TBL,17," ",EffectiveDate,date(3),NULL,
base_arca,statementLine,TBL,18," ",DisenrolledDate,date(3),NULL,
base_arca,statementLine,TBL,19," ",State,varchar(2),NULL,
base_arca,statementLine,TBL,20," ",PolicyHolder,varchar(45),NULL,
base_arca,statementLine,TBL,21," ",FirstName,varchar(45),NULL,
base_arca,statementLine,TBL,22," ",LastName,varchar(45),NULL,
base_arca,statementLine,TBL,23," ",PayType,varchar(45),NULL,
base_arca,statementLine,TBL,24," ",FaceAmount,"decimal(13,2)",NULL,
base_arca,statementLine,TBL,25," ",AR_In_Rate,varchar(45),NULL,
base_arca,statementLine,TBL,26," ",AR_Premium,varchar(45),NULL,
base_arca,statementLine,TBL,27," ",PolicyHolderAge,int(10),NULL,
base_arca,statementLine,TBL,28," ",SSN,varchar(45),NULL,
base_arca,statementLine,TBL,29," ",ProductName,varchar(100),NULL,
base_arca,statementLine,TBL,30," ",SubmitDate,date(3),NULL,
base_arca,statementLine,TBL,31," ",PaymentFrequency,int(10),NULL,
base_arca,statementLine,TBL,32," ",Reconciled,int(10),"NOT NULL",
base_arca,statementLine,TBL,33," ",Notes,text(65535),NULL,
base_arca,statementLine,TBL,34," ",DateCreated,datetime(8),NULL,
base_arca,statementLine,TBL,35," ",LastModified,datetime(8),NULL,
base_arca,statementLine,TBL,36," ",LastModifiedBy,int(10),NULL,
base_arca,statementLine,TBL,37," ",FileID,int(10),NULL,
base_arca,statementLine,TBL,38," ",TelemarketerID,int(10),NULL,
base_arca,statementLine,TBL,39," ",AnnualPremium,"decimal(13,2)",NULL,
base_arca,statementLine,TBL,40," ",Original,json,NULL,
base_arca,tag_types,TBL,1,PK,id,int(10),"NOT NULL",
base_arca,tag_types,TBL,2," ",entityType,varchar(100),NULL,
base_arca,tag_types,TBL,3," ",type,varchar(100),"NOT NULL",
base_arca,tag_types,TBL,4," ",name,varchar(100),"NOT NULL",
base_arca,tags,TBL,1,PK,id,int(10),"NOT NULL",
base_arca,tags,TBL,2," ",entityType,varchar(100),"NOT NULL",
base_arca,tags,TBL,3," ",entityId,int(10),"NOT NULL",
base_arca,tags,TBL,4," ",tagType,varchar(100),"NOT NULL",
base_arca,tags,TBL,5," ",name,varchar(100),"NOT NULL",
base_arca,tags,TBL,6," ",value,varchar(100),NULL,
base_arca,tags,TBL,7," ",fileId,int(10),NULL,
base_arca,telemarketer,TBL,1,PK,id,int(10),"NOT NULL",
base_arca,telemarketer,TBL,2," ",FirstName,varchar(100),"NOT NULL",
base_arca,telemarketer,TBL,3," ",LastName,varchar(200),"NOT NULL",
base_arca,telemarketer,TBL,4," ",Status,int(10),NULL,
base_arca,telemarketer,TBL,5," ",DateCreated,datetime(8),"NOT NULL",
base_arca,telemarketer,TBL,6," ",LastModified,datetime(8),"NOT NULL",
base_arca,telemarketer,TBL,7," ",LastModifiedBy,int(10),NULL,
base_arca,telemarketer,TBL,8," ",AgencyID,int(10),NULL,
base_arca,telemarketer,TBL,9," ",Email,varchar(100),NULL,
base_arca,telemarketer,TBL,10," ",ContactPhone,varchar(100),NULL,
base_arca,telemarketer,TBL,11," ",FileID,varchar(200),NULL,
base_arca,telemarketer,TBL,12," ",UserID,int(10),NULL,
base_arca,telemarketer,TBL,13," ",Active,int(10),NULL,
base_arca,telemarketer,TBL,14," ",Portal,int(10),NULL,
base_arca,telemarketer,TBL,15," ",UserName,varchar(25),NULL,
base_arca,telemarketer,TBL,16," ",TelemarketerID,varchar(25),NULL,
base_arca,telemarketer,TBL,17," ",Password,char(128),NULL,
base_arca,telemarketer,TBL,18," ",Salt,char(128),NULL,
base_arca,telemarketer,TBL,19," ",PortalID,int(10),"NOT NULL",
base_arca,token,TBL,1,PK,TokenID,varchar(255),"NOT NULL",
base_arca,token,TBL,2," ",Valid,tinyint(3),"NOT NULL",
base_arca,token,TBL,3," ",Issued,datetime(8),"NOT NULL",
base_arca,user_attempts,TBL,1,PK,user_id,int(10),"NOT NULL",
base_arca,user_attempts,TBL,2,PK,agent_id,int(10),"NOT NULL",
base_arca,user_attempts,TBL,3,PK,time,varchar(30),"NOT NULL",
base_arca,users,TBL,1," ",USER,char(32),NULL,NULL
base_arca,users,TBL,1,PK,UserID,int(10),"NOT NULL",
base_arca,users,TBL,2," ",CURRENT_CONNECTIONS,bigint(19),"NOT NULL",NULL
base_arca,users,TBL,2," ",UserName,varchar(250),"NOT NULL",
base_arca,users,TBL,3," ",TOTAL_CONNECTIONS,bigint(19),"NOT NULL",NULL
base_arca,users,TBL,3," ",FirstName,varchar(100),"NOT NULL",
base_arca,users,TBL,4," ",MAX_SESSION_CONTROLLED_MEMORY,bigint(20),"NOT NULL",NULL
base_arca,users,TBL,4," ",LastName,varchar(100),"NOT NULL",
base_arca,users,TBL,5," ",MAX_SESSION_TOTAL_MEMORY,bigint(20),"NOT NULL",NULL
base_arca,users,TBL,5," ",Role,varchar(25),NULL,
base_arca,users,TBL,6," ",Password,char(128),"NOT NULL",
base_arca,users,TBL,7," ",Salt,char(128),"NOT NULL",
base_arca,users,TBL,8," ",LastLogin,datetime(8),NULL,
base_arca,users,TBL,9," ",RemoteIP,varchar(15),NULL,
base_arca,users,TBL,10," ",Active,int(10),NULL,
base_arca,users,TBL,11," ",DateCreated,datetime(8),"NOT NULL",
base_arca,users,TBL,12," ",LastModified,datetime(8),"NOT NULL",
base_arca,users,TBL,13," ",LastModifiedBy,int(10),NULL,
base_arca,users,TBL,14," ",Email,varchar(100),NULL,
base_arca,users,TBL,15," ",Secret,varchar(100),NULL,
base_arca,webhook_calls,TBL,1,PK,CallID,int(10),"NOT NULL",
base_arca,webhook_calls,TBL,2," ",RawCall,json,"NOT NULL",
base_arca,webhook_calls,TBL,3," ",MappedCall,json,"NOT NULL",
base_arca,webhook_calls,TBL,4," ",Test,tinyint(3),"NOT NULL",
base_arca,webhook_calls,TBL,5," ",TimeReceived,datetime(8),"NOT NULL",
base_arca,webhook_calls,TBL,6," ",Approved,tinyint(3),"NOT NULL",
base_arca,webhook_calls,TBL,7," ",FailureReasons,json,NULL,
base_arca,webhook_calls,TBL,8," ",CreatedEntities,json,NULL,
base_arca,webhook_calls,TBL,9," ",WebhookID,int(10),"NOT NULL",
base_arca,webhook_calls,TBL,10," ",EntityType,varchar(30),"NOT NULL",
base_arca,webhook_calls,TBL,11," ",EntityID,int(10),NULL,
base_arca,webhook_calls,TBL,12," ",LastModified,datetime(8),"NOT NULL",
base_arca,webhook_calls,TBL,13," ",LastModifiedBy,int(10),NULL,
base_arca,webhook_calls,TBL,14," ",AssociatedEntities,json,NULL,
base_arca,webhooks,TBL,1,PK,WebhookID,int(10),"NOT NULL",
base_arca,webhooks,TBL,2," ",Name,varchar(50),"NOT NULL",
base_arca,webhooks,TBL,3," ",CRM,varchar(50),"NOT NULL",
base_arca,webhooks,TBL,4," ",Status,tinyint(3),"NOT NULL",
base_arca,webhooks,TBL,5," ",WhiteList,json,"NOT NULL",
base_arca,webhooks,TBL,6," ",SecurityHeaderName,varchar(128),"NOT NULL",
base_arca,webhooks,TBL,7," ",SecurityHeaderToken,varchar(128),"NOT NULL",
base_arca,webhooks,TBL,8," ",EntityType,varchar(30),"NOT NULL",
base_arca,webhooks,TBL,9," ",Mapping,json,NULL,
base_arca,webhooks,TBL,10," ",FormID,int(10),"NOT NULL",
base_arca,webhooks,TBL,11," ",StatusChangeDate,datetime(8),NULL,
base_arca,webhooks,TBL,12," ",LastModified,datetime(8),"NOT NULL",
base_arca,webhooks,TBL,13," ",LastModifiedBy,int(10),NULL,
base_arca,zip_county,TBL,1,PK,zcid,int(10),"NOT NULL",
base_arca,zip_county,TBL,2," ",zip,varchar(5),"NOT NULL",
base_arca,zip_county,TBL,3," ",county,varchar(100),NULL,
base_arca,zip_county,TBL,4," ",city,varchar(200),NULL,
base_arca,zip_county,TBL,5," ",state,varchar(2),NULL,
base_arca,zip_county,TBL,6," ",lat,float(12),NULL,
base_arca,zip_county,TBL,7," ",lon,float(12),NULL,
base_arca,zip_county,TBL,8," ",county_id,int(10),NULL,
base_arca,zip_county,TBL,9," ",state_id,int(10),NULL,
