Equipment,Division,WeightClassKg,BodyweightKg,Name,Best3SquatKg,Best3BenchKg,Best3DeadliftKg,TotalKg,Sex,Event,BirthDate,Place
Raw,Pro Open,67.5,62.1,Sara Campisi,149.69,68.04,154.22,371.95,F,SBD,,1
Raw,Amateur Open,75,74.62,Autum Cussen,122.47,74.84,154.22,351.53,F,SBD,,1
Wraps,Pro Open,90,87.72,Sabrina Omand,215.46,117.93,197.31,530.7,F,SBD,,1
Wraps,Amateur Open,100,99.11,Brittney Bing,188.24,70.31,170.1,428.64,F,SBD,,1
Multi-ply,Pro Open,90,89.63,Abby Dejnak,229.06,142.88,183.7,555.65,F,SBD,,1
Multi-ply,Amateur Open,75,73.94,Krissy Camisa,204.12,122.47,174.63,501.22,F,SBD,,1
Unlimited,Pro Open,90,87.72,Sabrina Omand,,192.78,,192.78,F,B,,1
Unlimited,Pro Open,90,89.77,Priyanka Santiago,,158.76,,158.76,F,B,,2
