produce_dace_summary.py:231: RankWarning: Polyfit may be poorly conditioned
  vec.substract_polyfit(5, replace=False, Draw=False)
Traceback (most recent call last):
  File "produce_dace_summary.py", line 505, in <module>
    print(' [INFO] file saved '%(directory_to_yarara+'/%s_%s_DRS-%s.rdb'%(star,instrument,drs_version.replace('.','-'))))
TypeError: not all arguments converted during string formatting
Traceback (most recent call last):
  File "trigger_yarara_harps03.py", line 1189, in <module>
    sts.simu = {}
NameError: name 'sts' is not defined
sh: say : commande introuvable
sh: say : commande introuvable
Rassine_multiprocessed.py:69: DeprecationWarning: `np.float` is a deprecated alias for the builtin `float`. To silence this warning, use `float` by itself. Doing this will not modify any behavior and is safe. If you specifically wanted the numpy scalar type, use `np.float64` here.
Deprecated in NumPy 1.20; for more details and guidance: https://numpy.org/devdocs/release/1.20.0-notes.html#deprecations
  dlambda = np.float(dlambda)
sh: say : commande introuvable
sh: say : commande introuvable
sh: say : commande introuvable
sh: say : commande introuvable
Rassine_multiprocessed.py:63: DeprecationWarning: `np.float` is a deprecated alias for the builtin `float`. To silence this warning, use `float` by itself. Doing this will not modify any behavior and is safe. If you specifically wanted the numpy scalar type, use `np.float64` here.
Deprecated in NumPy 1.20; for more details and guidance: https://numpy.org/devdocs/release/1.20.0-notes.html#deprecations
  savgol_window = int(np.float(j[1]))
sh: say : commande introuvable
sh: say : commande introuvable
/hpcstorage/cretigni/Python/Rassine_functions.py:337: VisibleDeprecationWarning: Creating an ndarray from ragged nested sequences (which is a list-or-tuple of lists-or-tuples-or ndarrays with different lengths or shapes) is deprecated. If you meant to do this, you must specify 'dtype=object' when creating the ndarray.
  save = np.array(save)#[np.array(snr).argsort()[::-1]]
/home/astro/cretigni/anaconda3/lib/python3.8/site-packages/numpy/core/fromnumeric.py:3419: RuntimeWarning: Mean of empty slice.
  return _methods._mean(a, axis=axis, dtype=dtype,
/home/astro/cretigni/anaconda3/lib/python3.8/site-packages/numpy/core/_methods.py:188: RuntimeWarning: invalid value encountered in double_scalars
  ret = ret.dtype.type(ret / rcount)
  0%|          | 0/75 [00:00<?, ?it/s]  1%|▏         | 1/75 [00:00<00:33,  2.21it/s]  3%|▎         | 2/75 [00:01<00:47,  1.55it/s]  4%|▍         | 3/75 [00:01<00:45,  1.60it/s]  5%|▌         | 4/75 [00:02<00:35,  2.02it/s]  7%|▋         | 5/75 [00:02<00:33,  2.08it/s]  8%|▊         | 6/75 [00:04<01:14,  1.08s/it]  9%|▉         | 7/75 [00:06<01:28,  1.30s/it] 11%|█         | 8/75 [00:08<01:32,  1.38s/it] 12%|█▏        | 9/75 [00:09<01:34,  1.44s/it] 13%|█▎        | 10/75 [00:10<01:16,  1.18s/it] 15%|█▍        | 11/75 [00:11<01:06,  1.04s/it] 16%|█▌        | 12/75 [00:11<00:55,  1.13it/s] 17%|█▋        | 13/75 [00:12<00:51,  1.19it/s] 19%|█▊        | 14/75 [00:12<00:44,  1.36it/s] 20%|██        | 15/75 [00:13<00:39,  1.52it/s] 21%|██▏       | 16/75 [00:14<00:51,  1.14it/s] 23%|██▎       | 17/75 [00:15<00:57,  1.00it/s] 24%|██▍       | 18/75 [00:17<01:13,  1.28s/it] 25%|██▌       | 19/75 [00:18<01:01,  1.11s/it] 27%|██▋       | 20/75 [00:18<00:47,  1.15it/s] 28%|██▊       | 21/75 [00:19<00:46,  1.17it/s] 29%|██▉       | 22/75 [00:20<00:41,  1.27it/s] 31%|███       | 23/75 [00:21<00:40,  1.28it/s] 32%|███▏      | 24/75 [00:21<00:34,  1.49it/s] 33%|███▎      | 25/75 [00:22<00:39,  1.27it/s] 35%|███▍      | 26/75 [00:23<00:38,  1.27it/s] 36%|███▌      | 27/75 [00:23<00:32,  1.48it/s] 37%|███▋      | 28/75 [00:24<00:30,  1.53it/s] 39%|███▊      | 29/75 [00:24<00:29,  1.58it/s] 40%|████      | 30/75 [00:25<00:24,  1.85it/s] 41%|████▏     | 31/75 [00:25<00:24,  1.78it/s] 43%|████▎     | 32/75 [00:26<00:19,  2.25it/s] 44%|████▍     | 33/75 [00:26<00:21,  1.95it/s] 45%|████▌     | 34/75 [00:27<00:24,  1.68it/s] 48%|████▊     | 36/75 [00:28<00:18,  2.08it/s] 49%|████▉     | 37/75 [00:28<00:17,  2.22it/s] 51%|█████     | 38/75 [00:29<00:17,  2.06it/s] 52%|█████▏    | 39/75 [00:29<00:15,  2.36it/s] 53%|█████▎    | 40/75 [00:29<00:13,  2.60it/s] 55%|█████▍    | 41/75 [00:30<00:12,  2.78it/s] 57%|█████▋    | 43/75 [00:30<00:10,  2.95it/s] 59%|█████▊    | 44/75 [00:30<00:09,  3.22it/s] 60%|██████    | 45/75 [00:31<00:08,  3.56it/s] 61%|██████▏   | 46/75 [00:31<00:07,  3.64it/s] 63%|██████▎   | 47/75 [00:31<00:06,  4.20it/s] 64%|██████▍   | 48/75 [00:32<00:09,  2.75it/s] 65%|██████▌   | 49/75 [00:32<00:10,  2.40it/s] 67%|██████▋   | 50/75 [00:33<00:11,  2.19it/s] 68%|██████▊   | 51/75 [00:33<00:10,  2.31it/s] 69%|██████▉   | 52/75 [00:35<00:19,  1.15it/s] 71%|███████   | 53/75 [00:36<00:18,  1.21it/s] 72%|███████▏  | 54/75 [00:36<00:15,  1.35it/s] 73%|███████▎  | 55/75 [00:37<00:14,  1.35it/s] 75%|███████▍  | 56/75 [00:38<00:15,  1.24it/s] 77%|███████▋  | 58/75 [00:39<00:12,  1.37it/s] 80%|████████  | 60/75 [00:40<00:08,  1.77it/s] 81%|████████▏ | 61/75 [00:40<00:07,  1.86it/s] 83%|████████▎ | 62/75 [00:41<00:07,  1.69it/s] 84%|████████▍ | 63/75 [00:41<00:06,  1.95it/s] 85%|████████▌ | 64/75 [00:42<00:04,  2.24it/s] 87%|████████▋ | 65/75 [00:42<00:03,  2.64it/s] 88%|████████▊ | 66/75 [00:42<00:03,  2.77it/s] 89%|████████▉ | 67/75 [00:43<00:03,  2.45it/s] 91%|█████████ | 68/75 [00:43<00:02,  2.78it/s] 92%|█████████▏| 69/75 [00:43<00:01,  3.05it/s] 93%|█████████▎| 70/75 [00:43<00:01,  3.45it/s] 95%|█████████▍| 71/75 [00:44<00:01,  2.85it/s] 96%|█████████▌| 72/75 [00:45<00:01,  1.65it/s] 97%|█████████▋| 73/75 [00:45<00:00,  2.15it/s] 99%|█████████▊| 74/75 [00:46<00:00,  2.13it/s]100%|██████████| 75/75 [00:48<00:00,  1.07it/s]100%|██████████| 75/75 [00:48<00:00,  1.55it/s]
  0%|          | 0/75 [00:00<?, ?it/s]  1%|▏         | 1/75 [00:00<00:18,  3.90it/s]  3%|▎         | 2/75 [00:01<00:48,  1.50it/s]  4%|▍         | 3/75 [00:01<00:34,  2.08it/s]  5%|▌         | 4/75 [00:01<00:30,  2.30it/s]  7%|▋         | 5/75 [00:01<00:22,  3.14it/s]  8%|▊         | 6/75 [00:02<00:29,  2.37it/s]  9%|▉         | 7/75 [00:02<00:28,  2.42it/s] 11%|█         | 8/75 [00:03<00:25,  2.64it/s] 12%|█▏        | 9/75 [00:04<00:46,  1.41it/s] 13%|█▎        | 10/75 [00:04<00:35,  1.83it/s] 15%|█▍        | 11/75 [00:05<00:29,  2.20it/s] 16%|█▌        | 12/75 [00:05<00:27,  2.30it/s] 17%|█▋        | 13/75 [00:05<00:26,  2.33it/s] 19%|█▊        | 14/75 [00:06<00:34,  1.75it/s] 20%|██        | 15/75 [00:07<00:26,  2.23it/s] 21%|██▏       | 16/75 [00:07<00:33,  1.79it/s] 23%|██▎       | 17/75 [00:08<00:30,  1.88it/s] 24%|██▍       | 18/75 [00:09<00:35,  1.62it/s] 25%|██▌       | 19/75 [00:11<01:00,  1.08s/it] 27%|██▋       | 20/75 [00:11<00:48,  1.14it/s] 28%|██▊       | 21/75 [00:11<00:36,  1.49it/s] 29%|██▉       | 22/75 [00:11<00:26,  2.00it/s] 31%|███       | 23/75 [00:12<00:29,  1.75it/s] 32%|███▏      | 24/75 [00:12<00:24,  2.08it/s] 33%|███▎      | 25/75 [00:13<00:22,  2.25it/s] 35%|███▍      | 26/75 [00:16<00:55,  1.14s/it] 36%|███▌      | 27/75 [00:17<00:52,  1.10s/it] 37%|███▋      | 28/75 [00:17<00:41,  1.14it/s] 39%|███▊      | 29/75 [00:18<00:37,  1.22it/s] 40%|████      | 30/75 [00:18<00:32,  1.38it/s] 41%|████▏     | 31/75 [00:19<00:29,  1.49it/s] 43%|████▎     | 32/75 [00:19<00:22,  1.92it/s] 44%|████▍     | 33/75 [00:20<00:24,  1.70it/s] 45%|████▌     | 34/75 [00:20<00:19,  2.13it/s] 47%|████▋     | 35/75 [00:21<00:22,  1.81it/s] 48%|████▊     | 36/75 [00:21<00:19,  2.05it/s] 49%|████▉     | 37/75 [00:21<00:16,  2.35it/s] 51%|█████     | 38/75 [00:22<00:14,  2.48it/s] 52%|█████▏    | 39/75 [00:22<00:13,  2.71it/s] 53%|█████▎    | 40/75 [00:22<00:14,  2.36it/s] 55%|█████▍    | 41/75 [00:23<00:18,  1.80it/s] 56%|█████▌    | 42/75 [00:23<00:15,  2.11it/s] 57%|█████▋    | 43/75 [00:24<00:16,  1.96it/s] 59%|█████▊    | 44/75 [00:25<00:19,  1.57it/s] 60%|██████    | 45/75 [00:26<00:21,  1.38it/s] 61%|██████▏   | 46/75 [00:29<00:39,  1.36s/it] 63%|██████▎   | 47/75 [00:29<00:30,  1.08s/it] 64%|██████▍   | 48/75 [00:30<00:23,  1.17it/s] 65%|██████▌   | 49/75 [00:30<00:19,  1.31it/s] 67%|██████▋   | 50/75 [00:30<00:14,  1.67it/s] 68%|██████▊   | 51/75 [00:31<00:12,  1.99it/s] 69%|██████▉   | 52/75 [00:32<00:14,  1.56it/s] 71%|███████   | 53/75 [00:32<00:12,  1.78it/s] 72%|███████▏  | 54/75 [00:32<00:10,  2.02it/s] 73%|███████▎  | 55/75 [00:33<00:10,  1.89it/s] 75%|███████▍  | 56/75 [00:33<00:08,  2.29it/s] 76%|███████▌  | 57/75 [00:34<00:08,  2.23it/s] 77%|███████▋  | 58/75 [00:34<00:08,  2.06it/s] 79%|███████▊  | 59/75 [00:34<00:06,  2.32it/s] 80%|████████  | 60/75 [00:35<00:06,  2.33it/s] 81%|████████▏ | 61/75 [00:36<00:06,  2.00it/s] 83%|████████▎ | 62/75 [00:36<00:06,  2.10it/s] 84%|████████▍ | 63/75 [00:36<00:05,  2.22it/s] 85%|████████▌ | 64/75 [00:37<00:04,  2.21it/s] 87%|████████▋ | 65/75 [00:38<00:06,  1.63it/s] 88%|████████▊ | 66/75 [00:38<00:05,  1.77it/s] 89%|████████▉ | 67/75 [00:39<00:04,  1.90it/s] 91%|█████████ | 68/75 [00:39<00:03,  2.02it/s] 92%|█████████▏| 69/75 [00:40<00:04,  1.33it/s] 93%|█████████▎| 70/75 [00:41<00:03,  1.57it/s] 95%|█████████▍| 71/75 [00:42<00:02,  1.52it/s] 96%|█████████▌| 72/75 [00:42<00:01,  1.74it/s] 97%|█████████▋| 73/75 [00:42<00:01,  1.86it/s] 99%|█████████▊| 74/75 [00:44<00:00,  1.33it/s]100%|██████████| 75/75 [00:48<00:00,  1.92s/it]100%|██████████| 75/75 [00:48<00:00,  1.54it/s]
  0%|          | 0/3542 [00:00<?, ?it/s]  0%|          | 3/3542 [00:00<02:28, 23.84it/s]  0%|          | 7/3542 [00:00<01:55, 30.49it/s]  0%|          | 11/3542 [00:00<01:47, 32.82it/s]  0%|          | 16/3542 [00:00<01:35, 36.99it/s]  1%|          | 20/3542 [00:00<01:33, 37.71it/s]  1%|          | 25/3542 [00:00<01:25, 41.06it/s]  1%|          | 30/3542 [00:00<01:24, 41.71it/s]  1%|          | 35/3542 [00:00<01:30, 38.63it/s]  1%|          | 39/3542 [00:01<01:31, 38.15it/s]  1%|          | 43/3542 [00:01<01:36, 36.24it/s]  1%|▏         | 48/3542 [00:01<01:28, 39.47it/s]  1%|▏         | 53/3542 [00:01<01:28, 39.54it/s]  2%|▏         | 58/3542 [00:01<01:25, 40.70it/s]  2%|▏         | 63/3542 [00:01<01:26, 40.27it/s]  2%|▏         | 68/3542 [00:01<01:23, 41.64it/s]  2%|▏         | 73/3542 [00:01<01:21, 42.67it/s]  2%|▏         | 78/3542 [00:01<01:18, 44.30it/s]  2%|▏         | 83/3542 [00:02<01:22, 41.73it/s]  2%|▏         | 88/3542 [00:02<01:21, 42.51it/s]  3%|▎         | 94/3542 [00:02<01:17, 44.24it/s]  3%|▎         | 99/3542 [00:02<02:45, 20.85it/s]  3%|▎         | 103/3542 [00:07<16:43,  3.43it/s]  3%|▎         | 106/3542 [00:07<13:56,  4.11it/s]  3%|▎         | 112/3542 [00:07<09:07,  6.27it/s]  3%|▎         | 116/3542 [00:07<07:18,  7.81it/s]  3%|▎         | 121/3542 [00:07<05:21, 10.64it/s]  4%|▎         | 125/3542 [00:07<04:18, 13.20it/s]  4%|▎         | 129/3542 [00:07<03:33, 16.00it/s]  4%|▍         | 134/3542 [00:07<02:45, 20.58it/s]  4%|▍         | 139/3542 [00:08<02:18, 24.53it/s]  4%|▍         | 144/3542 [00:08<01:58, 28.71it/s]  4%|▍         | 149/3542 [00:08<01:56, 29.22it/s]  4%|▍         | 153/3542 [00:08<01:48, 31.18it/s]  4%|▍         | 157/3542 [00:08<01:45, 32.11it/s]  5%|▍         | 161/3542 [00:08<01:39, 33.84it/s]  5%|▍         | 165/3542 [00:08<01:38, 34.26it/s]  5%|▍         | 170/3542 [00:08<01:31, 37.04it/s]  5%|▍         | 175/3542 [00:08<01:24, 39.68it/s]  5%|▌         | 180/3542 [00:09<01:19, 42.36it/s]  5%|▌         | 185/3542 [00:09<01:18, 42.90it/s]  5%|▌         | 190/3542 [00:09<01:17, 43.09it/s]  6%|▌         | 196/3542 [00:09<01:13, 45.40it/s]  6%|▌         | 201/3542 [00:09<01:17, 43.20it/s]  6%|▌         | 206/3542 [00:09<01:18, 42.57it/s]  6%|▌         | 212/3542 [00:09<01:14, 44.99it/s]  6%|▌         | 217/3542 [00:09<01:18, 42.35it/s]  6%|▋         | 222/3542 [00:10<01:21, 40.88it/s]  6%|▋         | 227/3542 [00:10<01:53, 29.31it/s]  7%|▋         | 231/3542 [00:10<02:35, 21.35it/s]  7%|▋         | 235/3542 [00:10<02:18, 23.85it/s]  7%|▋         | 240/3542 [00:10<01:57, 28.07it/s]  7%|▋         | 246/3542 [00:11<01:38, 33.45it/s]  7%|▋         | 250/3542 [00:11<01:34, 34.77it/s]  7%|▋         | 255/3542 [00:11<01:26, 38.06it/s]  7%|▋         | 260/3542 [00:11<01:22, 39.78it/s]  7%|▋         | 265/3542 [00:11<01:20, 40.57it/s]  8%|▊         | 270/3542 [00:11<01:30, 36.01it/s]  8%|▊         | 274/3542 [00:11<01:29, 36.72it/s]  8%|▊         | 278/3542 [00:11<01:26, 37.52it/s]  8%|▊         | 282/3542 [00:12<02:09, 25.13it/s]  8%|▊         | 287/3542 [00:12<01:50, 29.36it/s]  8%|▊         | 291/3542 [00:12<02:30, 21.59it/s]  8%|▊         | 295/3542 [00:12<02:16, 23.74it/s]  8%|▊         | 298/3542 [00:12<02:17, 23.58it/s]  8%|▊         | 301/3542 [00:12<02:15, 23.98it/s]  9%|▊         | 304/3542 [00:13<02:10, 24.82it/s]  9%|▊         | 307/3542 [00:13<02:11, 24.65it/s]  9%|▉         | 310/3542 [00:13<02:20, 23.02it/s]  9%|▉         | 314/3542 [00:13<02:00, 26.86it/s]  9%|▉         | 319/3542 [00:13<01:41, 31.60it/s]  9%|▉         | 324/3542 [00:13<01:30, 35.70it/s]  9%|▉         | 328/3542 [00:13<01:27, 36.59it/s]  9%|▉         | 333/3542 [00:13<01:21, 39.44it/s] 10%|▉         | 338/3542 [00:13<01:17, 41.33it/s] 10%|▉         | 344/3542 [00:14<01:11, 44.58it/s] 10%|▉         | 349/3542 [00:14<01:10, 45.31it/s] 10%|▉         | 354/3542 [00:14<01:10, 45.35it/s] 10%|█         | 359/3542 [00:14<01:12, 44.19it/s] 10%|█         | 364/3542 [00:14<01:12, 43.73it/s] 10%|█         | 369/3542 [00:14<01:17, 40.72it/s] 11%|█         | 374/3542 [00:14<01:18, 40.47it/s] 11%|█         | 379/3542 [00:14<01:19, 40.02it/s] 11%|█         | 384/3542 [00:15<01:16, 41.32it/s] 11%|█         | 389/3542 [00:15<01:14, 42.24it/s] 11%|█         | 394/3542 [00:15<01:17, 40.61it/s] 11%|█▏        | 399/3542 [00:15<01:17, 40.36it/s] 11%|█▏        | 404/3542 [00:15<01:19, 39.32it/s] 12%|█▏        | 409/3542 [00:15<01:17, 40.33it/s] 12%|█▏        | 414/3542 [00:15<01:18, 39.83it/s] 12%|█▏        | 418/3542 [00:15<01:23, 37.31it/s] 12%|█▏        | 422/3542 [00:16<01:45, 29.70it/s] 12%|█▏        | 426/3542 [00:16<01:43, 30.23it/s] 12%|█▏        | 430/3542 [00:16<01:43, 30.05it/s] 12%|█▏        | 435/3542 [00:16<01:32, 33.77it/s] 12%|█▏        | 440/3542 [00:16<01:23, 36.97it/s] 13%|█▎        | 445/3542 [00:16<01:19, 38.97it/s] 13%|█▎        | 450/3542 [00:16<01:14, 41.39it/s] 13%|█▎        | 455/3542 [00:16<01:11, 42.96it/s] 13%|█▎        | 460/3542 [00:17<01:09, 44.11it/s] 13%|█▎        | 465/3542 [00:17<01:08, 45.03it/s] 13%|█▎        | 471/3542 [00:17<01:05, 46.71it/s] 13%|█▎        | 476/3542 [00:17<01:05, 46.66it/s] 14%|█▎        | 481/3542 [00:17<01:08, 44.97it/s] 14%|█▎        | 486/3542 [00:17<01:13, 41.62it/s] 14%|█▍        | 491/3542 [00:17<01:12, 42.24it/s] 14%|█▍        | 496/3542 [00:17<01:11, 42.71it/s] 14%|█▍        | 501/3542 [00:17<01:09, 43.67it/s] 14%|█▍        | 506/3542 [00:18<01:15, 40.37it/s] 14%|█▍        | 511/3542 [00:18<01:26, 34.99it/s] 15%|█▍        | 515/3542 [00:18<01:26, 35.09it/s] 15%|█▍        | 519/3542 [00:18<01:26, 35.01it/s] 15%|█▍        | 523/3542 [00:18<01:46, 28.24it/s] 15%|█▍        | 527/3542 [00:18<01:43, 29.15it/s] 15%|█▍        | 531/3542 [00:19<01:49, 27.50it/s] 15%|█▌        | 536/3542 [00:19<01:34, 31.79it/s] 15%|█▌        | 540/3542 [00:19<01:35, 31.45it/s] 15%|█▌        | 544/3542 [00:19<01:33, 31.92it/s] 15%|█▌        | 549/3542 [00:19<01:25, 34.89it/s] 16%|█▌        | 553/3542 [00:19<01:22, 36.10it/s] 16%|█▌        | 557/3542 [00:19<02:03, 24.10it/s] 16%|█▌        | 561/3542 [00:20<01:51, 26.67it/s] 16%|█▌        | 565/3542 [00:20<01:42, 29.18it/s] 16%|█▌        | 569/3542 [00:20<01:36, 30.92it/s] 16%|█▌        | 574/3542 [00:20<01:25, 34.60it/s] 16%|█▋        | 579/3542 [00:20<01:19, 37.17it/s] 16%|█▋        | 584/3542 [00:20<01:16, 38.82it/s] 17%|█▋        | 589/3542 [00:20<01:13, 40.19it/s] 17%|█▋        | 594/3542 [00:20<01:12, 40.87it/s] 17%|█▋        | 599/3542 [00:20<01:15, 38.79it/s] 17%|█▋        | 603/3542 [00:21<01:25, 34.23it/s] 17%|█▋        | 607/3542 [00:21<01:27, 33.69it/s] 17%|█▋        | 611/3542 [00:21<01:24, 34.55it/s] 17%|█▋        | 616/3542 [00:21<01:19, 36.77it/s] 18%|█▊        | 620/3542 [00:21<01:21, 35.72it/s] 18%|█▊        | 624/3542 [00:21<01:29, 32.59it/s] 18%|█▊        | 628/3542 [00:21<01:40, 29.08it/s] 18%|█▊        | 632/3542 [00:22<01:39, 29.29it/s] 18%|█▊        | 636/3542 [00:22<01:39, 29.07it/s] 18%|█▊        | 640/3542 [00:22<01:32, 31.44it/s] 18%|█▊        | 644/3542 [00:22<01:38, 29.30it/s] 18%|█▊        | 649/3542 [00:22<01:27, 33.13it/s] 18%|█▊        | 654/3542 [00:22<01:18, 36.69it/s] 19%|█▊        | 659/3542 [00:22<01:12, 39.75it/s] 19%|█▊        | 664/3542 [00:22<01:11, 40.26it/s] 19%|█▉        | 669/3542 [00:22<01:08, 42.23it/s] 19%|█▉        | 674/3542 [00:23<01:10, 40.72it/s] 19%|█▉        | 679/3542 [00:23<01:06, 42.74it/s] 19%|█▉        | 684/3542 [00:23<01:05, 43.97it/s] 19%|█▉        | 689/3542 [00:23<01:04, 43.91it/s] 20%|█▉        | 694/3542 [00:23<01:23, 34.18it/s] 20%|█▉        | 698/3542 [00:23<01:39, 28.47it/s] 20%|█▉        | 702/3542 [00:23<01:36, 29.49it/s] 20%|█▉        | 706/3542 [00:24<01:30, 31.24it/s] 20%|██        | 710/3542 [00:24<01:28, 31.97it/s] 20%|██        | 714/3542 [00:24<01:25, 33.08it/s] 20%|██        | 718/3542 [00:24<01:23, 33.75it/s] 20%|██        | 723/3542 [00:24<01:16, 36.97it/s] 21%|██        | 727/3542 [00:24<01:16, 36.61it/s] 21%|██        | 731/3542 [00:24<01:15, 37.37it/s] 21%|██        | 735/3542 [00:24<01:15, 37.14it/s] 21%|██        | 739/3542 [00:24<01:15, 36.92it/s] 21%|██        | 743/3542 [00:25<01:16, 36.68it/s] 21%|██        | 748/3542 [00:25<01:11, 39.07it/s] 21%|██▏       | 753/3542 [00:25<01:07, 41.29it/s] 21%|██▏       | 758/3542 [00:25<01:06, 41.92it/s] 22%|██▏       | 763/3542 [00:25<01:05, 42.29it/s] 22%|██▏       | 768/3542 [00:25<01:03, 43.47it/s] 22%|██▏       | 773/3542 [00:25<01:01, 45.23it/s] 22%|██▏       | 778/3542 [00:25<01:00, 45.99it/s] 22%|██▏       | 783/3542 [00:25<01:00, 45.42it/s] 22%|██▏       | 788/3542 [00:26<00:59, 45.96it/s] 22%|██▏       | 793/3542 [00:26<01:00, 45.08it/s] 23%|██▎       | 798/3542 [00:26<01:22, 33.41it/s] 23%|██▎       | 802/3542 [00:26<01:22, 33.15it/s] 23%|██▎       | 806/3542 [00:26<01:36, 28.49it/s] 23%|██▎       | 810/3542 [00:26<01:34, 29.00it/s] 23%|██▎       | 814/3542 [00:27<01:32, 29.42it/s] 23%|██▎       | 818/3542 [00:27<01:27, 30.99it/s] 23%|██▎       | 822/3542 [00:27<01:23, 32.74it/s] 23%|██▎       | 827/3542 [00:27<01:16, 35.56it/s] 23%|██▎       | 831/3542 [00:27<01:14, 36.43it/s] 24%|██▎       | 836/3542 [00:27<01:09, 38.81it/s] 24%|██▎       | 841/3542 [00:27<01:06, 40.78it/s] 24%|██▍       | 847/3542 [00:27<01:01, 43.96it/s] 24%|██▍       | 853/3542 [00:27<00:57, 46.88it/s] 24%|██▍       | 858/3542 [00:28<00:59, 45.09it/s] 24%|██▍       | 864/3542 [00:28<00:57, 46.96it/s] 25%|██▍       | 869/3542 [00:28<00:56, 47.53it/s] 25%|██▍       | 874/3542 [00:28<01:01, 43.72it/s] 25%|██▍       | 879/3542 [00:28<00:58, 45.19it/s] 25%|██▍       | 884/3542 [00:28<00:57, 46.16it/s] 25%|██▌       | 890/3542 [00:28<00:55, 47.87it/s] 25%|██▌       | 895/3542 [00:28<00:54, 48.45it/s] 25%|██▌       | 901/3542 [00:28<00:52, 50.46it/s] 26%|██▌       | 907/3542 [00:29<00:52, 50.67it/s] 26%|██▌       | 913/3542 [00:29<00:52, 50.44it/s] 26%|██▌       | 919/3542 [00:29<00:52, 50.00it/s] 26%|██▌       | 925/3542 [00:29<01:10, 37.09it/s] 26%|██▋       | 930/3542 [00:29<01:22, 31.61it/s] 26%|██▋       | 934/3542 [00:29<01:22, 31.75it/s] 27%|██▋       | 939/3542 [00:29<01:14, 34.94it/s] 27%|██▋       | 943/3542 [00:30<01:14, 35.08it/s] 27%|██▋       | 949/3542 [00:30<01:05, 39.67it/s] 27%|██▋       | 954/3542 [00:30<01:04, 40.14it/s] 27%|██▋       | 959/3542 [00:30<01:01, 41.74it/s] 27%|██▋       | 964/3542 [00:30<00:59, 43.19it/s] 27%|██▋       | 969/3542 [00:30<00:58, 44.15it/s] 28%|██▊       | 975/3542 [00:30<00:54, 47.46it/s] 28%|██▊       | 980/3542 [00:31<01:17, 33.00it/s] 28%|██▊       | 986/3542 [00:31<01:07, 38.11it/s] 28%|██▊       | 992/3542 [00:31<00:59, 42.56it/s] 28%|██▊       | 997/3542 [00:31<00:57, 44.25it/s] 28%|██▊       | 1003/3542 [00:31<00:54, 46.92it/s] 28%|██▊       | 1009/3542 [00:31<00:51, 49.29it/s] 29%|██▊       | 1015/3542 [00:31<00:52, 48.29it/s] 29%|██▉       | 1020/3542 [00:31<00:56, 44.67it/s] 29%|██▉       | 1025/3542 [00:31<00:56, 44.51it/s] 29%|██▉       | 1031/3542 [00:32<00:53, 46.86it/s] 29%|██▉       | 1036/3542 [00:32<00:54, 45.90it/s] 29%|██▉       | 1041/3542 [00:32<00:56, 44.03it/s] 30%|██▉       | 1046/3542 [00:32<00:57, 43.62it/s] 30%|██▉       | 1052/3542 [00:32<00:53, 46.39it/s] 30%|██▉       | 1057/3542 [00:32<00:53, 46.09it/s] 30%|██▉       | 1062/3542 [00:32<00:54, 45.31it/s] 30%|███       | 1068/3542 [00:32<00:52, 47.33it/s] 30%|███       | 1073/3542 [00:32<00:52, 46.90it/s] 30%|███       | 1078/3542 [00:33<00:52, 47.13it/s] 31%|███       | 1084/3542 [00:33<00:50, 48.44it/s] 31%|███       | 1090/3542 [00:33<00:49, 49.49it/s] 31%|███       | 1095/3542 [00:33<00:49, 48.99it/s] 31%|███       | 1101/3542 [00:33<00:48, 50.08it/s] 31%|███▏      | 1107/3542 [00:33<00:48, 49.84it/s] 31%|███▏      | 1113/3542 [00:33<00:48, 50.39it/s] 32%|███▏      | 1119/3542 [00:33<00:46, 52.38it/s] 32%|███▏      | 1125/3542 [00:33<00:47, 50.62it/s] 32%|███▏      | 1131/3542 [00:34<00:49, 48.45it/s] 32%|███▏      | 1136/3542 [00:34<01:13, 32.57it/s] 32%|███▏      | 1140/3542 [00:34<01:16, 31.51it/s] 32%|███▏      | 1144/3542 [00:34<01:13, 32.81it/s] 32%|███▏      | 1149/3542 [00:34<01:05, 36.35it/s] 33%|███▎      | 1154/3542 [00:34<01:00, 39.32it/s] 33%|███▎      | 1159/3542 [00:34<00:57, 41.44it/s] 33%|███▎      | 1164/3542 [00:35<00:54, 43.41it/s] 33%|███▎      | 1170/3542 [00:35<00:50, 46.84it/s] 33%|███▎      | 1175/3542 [00:35<00:50, 46.66it/s] 33%|███▎      | 1180/3542 [00:35<00:54, 43.28it/s] 33%|███▎      | 1185/3542 [00:35<00:53, 44.08it/s] 34%|███▎      | 1190/3542 [00:35<00:52, 44.63it/s] 34%|███▍      | 1196/3542 [00:35<00:49, 47.65it/s] 34%|███▍      | 1202/3542 [00:35<00:47, 49.07it/s] 34%|███▍      | 1207/3542 [00:35<00:48, 48.56it/s] 34%|███▍      | 1212/3542 [00:36<00:54, 42.83it/s] 34%|███▍      | 1217/3542 [00:36<00:57, 40.72it/s] 35%|███▍      | 1222/3542 [00:36<00:58, 39.86it/s] 35%|███▍      | 1227/3542 [00:36<00:57, 40.36it/s] 35%|███▍      | 1233/3542 [00:36<00:52, 43.79it/s] 35%|███▍      | 1238/3542 [00:36<00:52, 43.68it/s] 35%|███▌      | 1243/3542 [00:36<00:55, 41.67it/s] 35%|███▌      | 1248/3542 [00:37<00:57, 40.03it/s] 35%|███▌      | 1253/3542 [00:37<01:01, 37.14it/s] 35%|███▌      | 1257/3542 [00:37<01:47, 21.25it/s] 36%|███▌      | 1260/3542 [00:37<01:52, 20.23it/s] 36%|███▌      | 1263/3542 [00:38<03:06, 12.20it/s] 36%|███▌      | 1268/3542 [00:38<02:16, 16.70it/s] 36%|███▌      | 1273/3542 [00:38<01:45, 21.45it/s] 36%|███▌      | 1279/3542 [00:38<01:22, 27.38it/s] 36%|███▋      | 1285/3542 [00:38<01:08, 32.94it/s] 36%|███▋      | 1290/3542 [00:38<01:03, 35.36it/s] 37%|███▋      | 1295/3542 [00:39<01:03, 35.26it/s] 37%|███▋      | 1300/3542 [00:39<00:59, 37.94it/s] 37%|███▋      | 1305/3542 [00:39<00:55, 40.01it/s] 37%|███▋      | 1311/3542 [00:39<00:51, 43.30it/s] 37%|███▋      | 1316/3542 [00:39<00:52, 42.59it/s] 37%|███▋      | 1322/3542 [00:39<00:48, 45.57it/s] 37%|███▋      | 1327/3542 [00:39<00:48, 45.62it/s] 38%|███▊      | 1332/3542 [00:39<00:48, 45.63it/s] 38%|███▊      | 1337/3542 [00:39<00:49, 44.69it/s] 38%|███▊      | 1342/3542 [00:40<00:49, 44.49it/s] 38%|███▊      | 1347/3542 [00:40<00:48, 44.87it/s] 38%|███▊      | 1352/3542 [00:40<00:47, 45.89it/s] 38%|███▊      | 1358/3542 [00:40<00:44, 48.56it/s] 38%|███▊      | 1363/3542 [00:40<00:47, 45.87it/s] 39%|███▊      | 1368/3542 [00:40<00:47, 45.65it/s] 39%|███▉      | 1374/3542 [00:40<00:45, 47.88it/s] 39%|███▉      | 1380/3542 [00:40<00:44, 48.37it/s] 39%|███▉      | 1385/3542 [00:41<01:00, 35.93it/s] 39%|███▉      | 1390/3542 [00:41<01:01, 35.00it/s] 39%|███▉      | 1394/3542 [00:41<00:59, 35.82it/s] 39%|███▉      | 1398/3542 [00:41<01:02, 34.12it/s] 40%|███▉      | 1402/3542 [00:41<01:12, 29.43it/s] 40%|███▉      | 1406/3542 [00:41<01:09, 30.70it/s] 40%|███▉      | 1412/3542 [00:41<00:58, 36.69it/s] 40%|████      | 1417/3542 [00:41<00:53, 39.50it/s] 40%|████      | 1422/3542 [00:42<00:51, 40.84it/s] 40%|████      | 1427/3542 [00:42<00:49, 42.56it/s] 40%|████      | 1432/3542 [00:42<00:48, 43.55it/s] 41%|████      | 1437/3542 [00:42<00:49, 42.72it/s] 41%|████      | 1442/3542 [00:42<00:47, 43.91it/s] 41%|████      | 1447/3542 [00:42<00:48, 42.86it/s] 41%|████      | 1452/3542 [00:42<00:46, 44.69it/s] 41%|████      | 1458/3542 [00:42<00:43, 47.48it/s] 41%|████▏     | 1463/3542 [00:42<00:43, 47.51it/s] 41%|████▏     | 1468/3542 [00:43<00:43, 47.42it/s] 42%|████▏     | 1473/3542 [00:43<00:43, 47.94it/s] 42%|████▏     | 1478/3542 [00:43<00:44, 46.54it/s] 42%|████▏     | 1483/3542 [00:43<00:44, 46.54it/s] 42%|████▏     | 1488/3542 [00:43<00:43, 47.24it/s] 42%|████▏     | 1493/3542 [00:43<01:06, 30.60it/s] 42%|████▏     | 1497/3542 [00:43<01:06, 30.59it/s] 42%|████▏     | 1501/3542 [00:44<01:16, 26.73it/s] 42%|████▏     | 1505/3542 [00:44<01:21, 24.86it/s] 43%|████▎     | 1508/3542 [00:44<01:22, 24.51it/s] 43%|████▎     | 1512/3542 [00:44<01:15, 27.05it/s] 43%|████▎     | 1517/3542 [00:44<01:04, 31.26it/s] 43%|████▎     | 1521/3542 [00:44<01:00, 33.25it/s] 43%|████▎     | 1526/3542 [00:44<00:56, 35.78it/s] 43%|████▎     | 1531/3542 [00:45<00:51, 39.06it/s] 43%|████▎     | 1536/3542 [00:45<00:47, 41.91it/s] 44%|████▎     | 1542/3542 [00:45<00:44, 45.42it/s] 44%|████▎     | 1547/3542 [00:45<00:44, 45.11it/s] 44%|████▍     | 1552/3542 [00:45<00:43, 46.16it/s] 44%|████▍     | 1557/3542 [00:45<00:43, 46.01it/s] 44%|████▍     | 1563/3542 [00:45<00:41, 47.87it/s] 44%|████▍     | 1568/3542 [00:45<00:41, 47.61it/s] 44%|████▍     | 1573/3542 [00:45<00:41, 47.40it/s] 45%|████▍     | 1578/3542 [00:45<00:41, 47.38it/s] 45%|████▍     | 1583/3542 [00:46<00:41, 46.98it/s] 45%|████▍     | 1589/3542 [00:46<00:40, 48.77it/s] 45%|████▌     | 1595/3542 [00:46<00:38, 50.18it/s] 45%|████▌     | 1601/3542 [00:46<00:39, 48.89it/s] 45%|████▌     | 1606/3542 [00:46<00:41, 46.72it/s] 45%|████▌     | 1611/3542 [00:46<00:41, 46.43it/s] 46%|████▌     | 1616/3542 [00:46<00:44, 43.71it/s] 46%|████▌     | 1621/3542 [00:47<00:57, 33.55it/s] 46%|████▌     | 1625/3542 [00:47<01:04, 29.59it/s] 46%|████▌     | 1629/3542 [00:47<01:10, 27.14it/s] 46%|████▌     | 1634/3542 [00:47<01:01, 31.17it/s] 46%|████▋     | 1639/3542 [00:47<00:54, 34.76it/s] 46%|████▋     | 1644/3542 [00:47<00:50, 37.54it/s] 47%|████▋     | 1649/3542 [00:47<00:50, 37.35it/s] 47%|████▋     | 1655/3542 [00:47<00:45, 41.71it/s] 47%|████▋     | 1660/3542 [00:48<00:43, 43.45it/s] 47%|████▋     | 1665/3542 [00:48<00:43, 43.12it/s] 47%|████▋     | 1671/3542 [00:48<00:40, 46.21it/s] 47%|████▋     | 1676/3542 [00:48<00:39, 46.75it/s] 47%|████▋     | 1681/3542 [00:48<00:40, 46.46it/s] 48%|████▊     | 1686/3542 [00:48<00:39, 46.55it/s] 48%|████▊     | 1692/3542 [00:48<00:36, 50.08it/s] 48%|████▊     | 1698/3542 [00:48<00:35, 51.86it/s] 48%|████▊     | 1704/3542 [00:48<00:37, 48.80it/s] 48%|████▊     | 1709/3542 [00:49<00:38, 48.06it/s] 48%|████▊     | 1714/3542 [00:49<00:37, 48.53it/s] 49%|████▊     | 1719/3542 [00:49<00:59, 30.60it/s] 49%|████▊     | 1724/3542 [00:49<00:53, 33.94it/s] 49%|████▉     | 1729/3542 [00:49<00:49, 36.41it/s] 49%|████▉     | 1734/3542 [00:49<00:48, 37.59it/s] 49%|████▉     | 1739/3542 [00:49<00:44, 40.42it/s] 49%|████▉     | 1744/3542 [00:50<00:43, 41.47it/s] 49%|████▉     | 1750/3542 [00:50<00:39, 45.52it/s] 50%|████▉     | 1756/3542 [00:50<00:36, 48.38it/s] 50%|████▉     | 1762/3542 [00:50<00:37, 47.90it/s] 50%|████▉     | 1768/3542 [00:50<00:35, 49.53it/s] 50%|█████     | 1774/3542 [00:50<00:34, 51.61it/s] 50%|█████     | 1780/3542 [00:50<00:33, 52.30it/s] 50%|█████     | 1787/3542 [00:50<00:31, 55.28it/s] 51%|█████     | 1793/3542 [00:50<00:32, 53.17it/s] 51%|█████     | 1799/3542 [00:51<00:33, 52.39it/s] 51%|█████     | 1805/3542 [00:51<00:33, 51.50it/s] 51%|█████     | 1811/3542 [00:51<00:34, 49.65it/s] 51%|█████▏    | 1817/3542 [00:51<00:34, 50.30it/s] 51%|█████▏    | 1823/3542 [00:51<00:33, 51.45it/s] 52%|█████▏    | 1829/3542 [00:51<00:33, 50.40it/s] 52%|█████▏    | 1835/3542 [00:51<00:35, 47.76it/s] 52%|█████▏    | 1840/3542 [00:51<00:35, 47.67it/s] 52%|█████▏    | 1845/3542 [00:52<00:35, 47.19it/s] 52%|█████▏    | 1850/3542 [00:52<00:38, 44.06it/s] 52%|█████▏    | 1855/3542 [00:52<00:37, 44.76it/s] 53%|█████▎    | 1860/3542 [00:52<00:36, 45.94it/s] 53%|█████▎    | 1865/3542 [00:52<00:36, 45.87it/s] 53%|█████▎    | 1870/3542 [00:52<00:37, 45.16it/s] 53%|█████▎    | 1875/3542 [00:52<00:46, 35.86it/s] 53%|█████▎    | 1880/3542 [00:52<00:43, 37.78it/s] 53%|█████▎    | 1885/3542 [00:53<00:41, 40.29it/s] 53%|█████▎    | 1891/3542 [00:53<00:37, 43.57it/s] 54%|█████▎    | 1897/3542 [00:53<00:34, 47.06it/s] 54%|█████▎    | 1902/3542 [00:53<00:34, 47.15it/s] 54%|█████▍    | 1907/3542 [00:53<00:35, 45.70it/s] 54%|█████▍    | 1912/3542 [00:53<00:35, 46.09it/s] 54%|█████▍    | 1917/3542 [00:53<00:36, 44.62it/s] 54%|█████▍    | 1922/3542 [00:53<00:37, 43.26it/s] 54%|█████▍    | 1927/3542 [00:53<00:38, 42.28it/s] 55%|█████▍    | 1932/3542 [00:54<00:37, 43.35it/s] 55%|█████▍    | 1937/3542 [00:54<00:38, 41.80it/s] 55%|█████▍    | 1942/3542 [00:54<00:39, 40.86it/s] 55%|█████▍    | 1947/3542 [00:54<00:37, 42.94it/s] 55%|█████▌    | 1952/3542 [00:54<00:37, 42.87it/s] 55%|█████▌    | 1958/3542 [00:54<00:34, 45.39it/s] 55%|█████▌    | 1964/3542 [00:54<00:33, 47.81it/s] 56%|█████▌    | 1969/3542 [00:54<00:35, 44.83it/s] 56%|█████▌    | 1975/3542 [00:55<00:33, 47.12it/s] 56%|█████▌    | 1981/3542 [00:55<00:31, 48.91it/s] 56%|█████▌    | 1986/3542 [00:55<00:32, 47.51it/s] 56%|█████▌    | 1992/3542 [00:55<00:31, 49.03it/s] 56%|█████▋    | 1997/3542 [00:55<00:31, 49.19it/s] 57%|█████▋    | 2002/3542 [00:55<00:32, 46.67it/s] 57%|█████▋    | 2007/3542 [00:55<00:33, 45.62it/s] 57%|█████▋    | 2012/3542 [00:55<00:34, 44.27it/s] 57%|█████▋    | 2017/3542 [00:55<00:34, 44.32it/s] 57%|█████▋    | 2022/3542 [00:56<00:33, 45.55it/s] 57%|█████▋    | 2027/3542 [00:56<00:32, 46.05it/s] 57%|█████▋    | 2033/3542 [00:56<00:31, 48.67it/s] 58%|█████▊    | 2039/3542 [00:56<00:29, 50.71it/s] 58%|█████▊    | 2045/3542 [00:56<00:30, 49.76it/s] 58%|█████▊    | 2050/3542 [00:56<00:32, 46.62it/s] 58%|█████▊    | 2056/3542 [00:56<00:30, 48.86it/s] 58%|█████▊    | 2062/3542 [00:56<00:29, 50.55it/s] 58%|█████▊    | 2068/3542 [00:56<00:29, 50.74it/s] 59%|█████▊    | 2074/3542 [00:57<00:29, 50.15it/s] 59%|█████▊    | 2080/3542 [00:57<00:30, 47.61it/s] 59%|█████▉    | 2085/3542 [00:57<00:31, 46.90it/s] 59%|█████▉    | 2090/3542 [00:57<00:31, 46.43it/s] 59%|█████▉    | 2095/3542 [00:57<00:30, 46.73it/s] 59%|█████▉    | 2101/3542 [00:57<00:29, 48.60it/s] 59%|█████▉    | 2106/3542 [00:57<00:30, 47.63it/s] 60%|█████▉    | 2111/3542 [00:57<00:31, 45.91it/s] 60%|█████▉    | 2117/3542 [00:57<00:29, 48.53it/s] 60%|█████▉    | 2122/3542 [00:58<00:29, 48.33it/s] 60%|██████    | 2127/3542 [00:58<00:30, 46.49it/s] 60%|██████    | 2133/3542 [00:58<00:29, 48.06it/s] 60%|██████    | 2138/3542 [00:58<00:29, 47.79it/s] 61%|██████    | 2143/3542 [00:58<00:30, 46.31it/s] 61%|██████    | 2148/3542 [00:58<00:30, 45.93it/s] 61%|██████    | 2154/3542 [00:58<00:28, 47.96it/s] 61%|██████    | 2159/3542 [00:58<00:30, 44.72it/s] 61%|██████    | 2165/3542 [00:59<00:28, 47.74it/s] 61%|██████▏   | 2170/3542 [00:59<00:29, 46.93it/s] 61%|██████▏   | 2176/3542 [00:59<00:28, 48.76it/s] 62%|██████▏   | 2181/3542 [00:59<00:28, 47.49it/s] 62%|██████▏   | 2186/3542 [00:59<00:29, 45.93it/s] 62%|██████▏   | 2192/3542 [00:59<00:27, 48.82it/s] 62%|██████▏   | 2197/3542 [00:59<00:29, 45.67it/s] 62%|██████▏   | 2202/3542 [00:59<00:28, 46.80it/s] 62%|██████▏   | 2208/3542 [00:59<00:26, 49.86it/s] 63%|██████▎   | 2214/3542 [01:00<00:27, 47.54it/s] 63%|██████▎   | 2219/3542 [01:00<00:28, 45.86it/s] 63%|██████▎   | 2224/3542 [01:00<00:29, 45.17it/s] 63%|██████▎   | 2230/3542 [01:00<00:27, 47.29it/s] 63%|██████▎   | 2236/3542 [01:00<00:26, 50.13it/s] 63%|██████▎   | 2242/3542 [01:00<00:27, 46.98it/s] 63%|██████▎   | 2247/3542 [01:00<00:27, 46.60it/s] 64%|██████▎   | 2252/3542 [01:00<00:28, 45.66it/s] 64%|██████▎   | 2257/3542 [01:01<00:29, 43.69it/s] 64%|██████▍   | 2262/3542 [01:01<00:33, 38.72it/s] 64%|██████▍   | 2268/3542 [01:01<00:29, 43.02it/s] 64%|██████▍   | 2273/3542 [01:01<00:29, 43.32it/s] 64%|██████▍   | 2278/3542 [01:01<00:28, 44.11it/s] 64%|██████▍   | 2284/3542 [01:01<00:26, 47.01it/s] 65%|██████▍   | 2290/3542 [01:01<00:25, 48.80it/s] 65%|██████▍   | 2295/3542 [01:01<00:26, 47.46it/s] 65%|██████▍   | 2300/3542 [01:01<00:26, 47.08it/s] 65%|██████▌   | 2305/3542 [01:02<00:26, 46.41it/s] 65%|██████▌   | 2311/3542 [01:02<00:24, 49.32it/s] 65%|██████▌   | 2316/3542 [01:02<00:24, 49.20it/s] 66%|██████▌   | 2322/3542 [01:02<00:23, 51.57it/s] 66%|██████▌   | 2328/3542 [01:02<00:24, 49.42it/s] 66%|██████▌   | 2335/3542 [01:02<00:22, 53.18it/s] 66%|██████▌   | 2341/3542 [01:02<00:23, 50.65it/s] 66%|██████▋   | 2347/3542 [01:02<00:25, 46.07it/s] 66%|██████▋   | 2352/3542 [01:03<00:28, 41.74it/s] 67%|██████▋   | 2358/3542 [01:03<00:25, 45.74it/s] 67%|██████▋   | 2365/3542 [01:03<00:23, 50.33it/s] 67%|██████▋   | 2371/3542 [01:03<00:22, 51.43it/s] 67%|██████▋   | 2377/3542 [01:03<00:22, 52.57it/s] 67%|██████▋   | 2383/3542 [01:03<00:22, 51.28it/s] 67%|██████▋   | 2389/3542 [01:03<00:22, 50.33it/s] 68%|██████▊   | 2395/3542 [01:03<00:23, 48.11it/s] 68%|██████▊   | 2400/3542 [01:03<00:23, 47.93it/s] 68%|██████▊   | 2405/3542 [01:04<00:23, 48.39it/s] 68%|██████▊   | 2410/3542 [01:04<00:23, 47.72it/s] 68%|██████▊   | 2415/3542 [01:04<00:24, 46.90it/s] 68%|██████▊   | 2420/3542 [01:04<00:24, 45.57it/s] 68%|██████▊   | 2425/3542 [01:04<00:27, 39.94it/s] 69%|██████▊   | 2430/3542 [01:04<00:27, 40.35it/s] 69%|██████▉   | 2437/3542 [01:04<00:23, 46.92it/s] 69%|██████▉   | 2443/3542 [01:04<00:22, 49.50it/s] 69%|██████▉   | 2449/3542 [01:05<00:21, 51.19it/s] 69%|██████▉   | 2455/3542 [01:05<00:20, 53.49it/s] 69%|██████▉   | 2461/3542 [01:05<00:19, 54.32it/s] 70%|██████▉   | 2468/3542 [01:05<00:18, 57.27it/s] 70%|██████▉   | 2474/3542 [01:05<00:20, 52.74it/s] 70%|███████   | 2480/3542 [01:05<00:20, 52.97it/s] 70%|███████   | 2486/3542 [01:05<00:20, 51.02it/s] 70%|███████   | 2492/3542 [01:05<00:20, 50.97it/s] 71%|███████   | 2498/3542 [01:05<00:19, 52.48it/s] 71%|███████   | 2504/3542 [01:06<00:19, 53.71it/s] 71%|███████   | 2510/3542 [01:06<00:19, 53.47it/s] 71%|███████   | 2516/3542 [01:06<00:20, 50.01it/s] 71%|███████   | 2522/3542 [01:06<00:20, 49.05it/s] 71%|███████▏  | 2527/3542 [01:06<00:21, 48.04it/s] 71%|███████▏  | 2532/3542 [01:06<00:21, 46.60it/s] 72%|███████▏  | 2538/3542 [01:06<00:20, 48.40it/s] 72%|███████▏  | 2543/3542 [01:06<00:20, 48.53it/s] 72%|███████▏  | 2548/3542 [01:06<00:20, 47.88it/s] 72%|███████▏  | 2554/3542 [01:07<00:19, 51.00it/s] 72%|███████▏  | 2560/3542 [01:07<00:18, 52.38it/s] 72%|███████▏  | 2567/3542 [01:07<00:17, 55.43it/s] 73%|███████▎  | 2573/3542 [01:07<00:18, 52.75it/s] 73%|███████▎  | 2579/3542 [01:07<00:18, 51.05it/s] 73%|███████▎  | 2585/3542 [01:07<00:18, 52.37it/s] 73%|███████▎  | 2591/3542 [01:07<00:18, 51.62it/s] 73%|███████▎  | 2597/3542 [01:07<00:20, 45.70it/s] 73%|███████▎  | 2602/3542 [01:08<00:23, 39.63it/s] 74%|███████▎  | 2608/3542 [01:08<00:21, 44.24it/s] 74%|███████▍  | 2614/3542 [01:08<00:19, 46.69it/s] 74%|███████▍  | 2619/3542 [01:08<00:25, 36.46it/s] 74%|███████▍  | 2624/3542 [01:08<00:25, 36.70it/s] 74%|███████▍  | 2630/3542 [01:08<00:22, 41.13it/s] 74%|███████▍  | 2636/3542 [01:08<00:19, 45.34it/s] 75%|███████▍  | 2642/3542 [01:09<00:18, 48.14it/s] 75%|███████▍  | 2648/3542 [01:09<00:17, 49.99it/s] 75%|███████▍  | 2654/3542 [01:09<00:17, 51.31it/s] 75%|███████▌  | 2660/3542 [01:09<00:16, 52.16it/s] 75%|███████▌  | 2666/3542 [01:09<00:16, 53.00it/s] 75%|███████▌  | 2672/3542 [01:09<00:15, 54.88it/s] 76%|███████▌  | 2678/3542 [01:09<00:15, 54.96it/s] 76%|███████▌  | 2685/3542 [01:09<00:15, 56.73it/s] 76%|███████▌  | 2691/3542 [01:09<00:15, 55.10it/s] 76%|███████▌  | 2697/3542 [01:09<00:15, 54.25it/s] 76%|███████▋  | 2703/3542 [01:10<00:15, 54.09it/s] 76%|███████▋  | 2709/3542 [01:10<00:17, 46.65it/s] 77%|███████▋  | 2715/3542 [01:10<00:16, 49.82it/s] 77%|███████▋  | 2721/3542 [01:10<00:15, 51.32it/s] 77%|███████▋  | 2727/3542 [01:10<00:16, 48.67it/s] 77%|███████▋  | 2734/3542 [01:10<00:15, 52.71it/s] 77%|███████▋  | 2740/3542 [01:10<00:15, 52.26it/s] 78%|███████▊  | 2746/3542 [01:10<00:15, 51.74it/s] 78%|███████▊  | 2752/3542 [01:11<00:15, 51.79it/s] 78%|███████▊  | 2758/3542 [01:11<00:15, 52.12it/s] 78%|███████▊  | 2765/3542 [01:11<00:13, 56.49it/s] 78%|███████▊  | 2772/3542 [01:11<00:12, 59.33it/s] 78%|███████▊  | 2779/3542 [01:11<00:12, 59.84it/s] 79%|███████▊  | 2786/3542 [01:11<00:13, 58.08it/s] 79%|███████▉  | 2792/3542 [01:11<00:13, 53.82it/s] 79%|███████▉  | 2798/3542 [01:11<00:14, 51.66it/s] 79%|███████▉  | 2805/3542 [01:12<00:13, 55.07it/s] 79%|███████▉  | 2812/3542 [01:12<00:12, 57.82it/s] 80%|███████▉  | 2818/3542 [01:12<00:12, 55.85it/s] 80%|███████▉  | 2824/3542 [01:12<00:13, 52.29it/s] 80%|███████▉  | 2830/3542 [01:12<00:14, 49.94it/s] 80%|████████  | 2837/3542 [01:12<00:13, 53.31it/s] 80%|████████  | 2843/3542 [01:12<00:12, 54.18it/s] 80%|████████  | 2850/3542 [01:12<00:12, 57.36it/s] 81%|████████  | 2856/3542 [01:12<00:11, 57.80it/s] 81%|████████  | 2862/3542 [01:13<00:12, 55.20it/s] 81%|████████  | 2868/3542 [01:13<00:12, 55.87it/s] 81%|████████  | 2874/3542 [01:13<00:11, 56.40it/s] 81%|████████▏ | 2880/3542 [01:13<00:11, 57.27it/s] 82%|████████▏ | 2887/3542 [01:13<00:10, 59.77it/s] 82%|████████▏ | 2894/3542 [01:13<00:10, 61.83it/s] 82%|████████▏ | 2901/3542 [01:13<00:11, 57.11it/s] 82%|████████▏ | 2907/3542 [01:13<00:11, 56.88it/s] 82%|████████▏ | 2913/3542 [01:13<00:10, 57.46it/s] 82%|████████▏ | 2919/3542 [01:14<00:10, 57.00it/s] 83%|████████▎ | 2925/3542 [01:14<00:11, 55.38it/s] 83%|████████▎ | 2931/3542 [01:14<00:10, 56.27it/s] 83%|████████▎ | 2937/3542 [01:14<00:10, 57.05it/s] 83%|████████▎ | 2945/3542 [01:14<00:09, 61.80it/s] 83%|████████▎ | 2952/3542 [01:14<00:09, 63.04it/s] 84%|████████▎ | 2959/3542 [01:14<00:10, 58.28it/s] 84%|████████▎ | 2966/3542 [01:14<00:09, 60.81it/s] 84%|████████▍ | 2973/3542 [01:14<00:09, 57.67it/s] 84%|████████▍ | 2979/3542 [01:15<00:10, 55.15it/s] 84%|████████▍ | 2985/3542 [01:15<00:11, 48.71it/s] 84%|████████▍ | 2991/3542 [01:15<00:13, 41.01it/s] 85%|████████▍ | 2996/3542 [01:15<00:13, 41.49it/s] 85%|████████▍ | 3001/3542 [01:15<00:12, 43.42it/s] 85%|████████▍ | 3008/3542 [01:15<00:10, 49.64it/s] 85%|████████▌ | 3015/3542 [01:15<00:09, 54.26it/s] 85%|████████▌ | 3021/3542 [01:15<00:09, 54.63it/s] 85%|████████▌ | 3028/3542 [01:16<00:08, 57.62it/s] 86%|████████▌ | 3034/3542 [01:16<00:09, 56.37it/s] 86%|████████▌ | 3040/3542 [01:16<00:09, 54.28it/s] 86%|████████▌ | 3047/3542 [01:16<00:08, 56.60it/s] 86%|████████▌ | 3053/3542 [01:16<00:08, 54.39it/s] 86%|████████▋ | 3059/3542 [01:16<00:08, 55.12it/s] 87%|████████▋ | 3066/3542 [01:16<00:08, 57.55it/s] 87%|████████▋ | 3072/3542 [01:16<00:08, 57.22it/s] 87%|████████▋ | 3078/3542 [01:16<00:08, 55.56it/s] 87%|████████▋ | 3084/3542 [01:17<00:08, 55.90it/s] 87%|████████▋ | 3091/3542 [01:17<00:07, 58.40it/s] 87%|████████▋ | 3097/3542 [01:17<00:07, 56.93it/s] 88%|████████▊ | 3104/3542 [01:17<00:07, 59.06it/s] 88%|████████▊ | 3110/3542 [01:17<00:08, 51.25it/s] 88%|████████▊ | 3116/3542 [01:17<00:08, 50.29it/s] 88%|████████▊ | 3122/3542 [01:17<00:08, 50.58it/s] 88%|████████▊ | 3128/3542 [01:17<00:07, 52.64it/s] 88%|████████▊ | 3134/3542 [01:18<00:07, 51.93it/s] 89%|████████▊ | 3140/3542 [01:18<00:07, 50.89it/s] 89%|████████▉ | 3146/3542 [01:18<00:08, 44.40it/s] 89%|████████▉ | 3151/3542 [01:18<00:11, 35.22it/s] 89%|████████▉ | 3158/3542 [01:18<00:09, 42.07it/s] 89%|████████▉ | 3164/3542 [01:18<00:08, 45.52it/s] 89%|████████▉ | 3170/3542 [01:18<00:07, 48.45it/s] 90%|████████▉ | 3179/3542 [01:18<00:06, 57.84it/s] 90%|████████▉ | 3187/3542 [01:19<00:05, 62.22it/s] 90%|█████████ | 3195/3542 [01:19<00:05, 65.61it/s] 90%|█████████ | 3202/3542 [01:19<00:05, 64.96it/s] 91%|█████████ | 3210/3542 [01:19<00:04, 68.15it/s] 91%|█████████ | 3217/3542 [01:19<00:05, 60.98it/s] 91%|█████████ | 3224/3542 [01:19<00:05, 60.42it/s] 91%|█████████ | 3232/3542 [01:19<00:04, 63.92it/s] 91%|█████████▏| 3240/3542 [01:19<00:04, 66.63it/s] 92%|█████████▏| 3247/3542 [01:20<00:04, 65.76it/s] 92%|█████████▏| 3255/3542 [01:20<00:04, 67.81it/s] 92%|█████████▏| 3262/3542 [01:20<00:04, 64.72it/s] 92%|█████████▏| 3269/3542 [01:20<00:04, 65.08it/s] 93%|█████████▎| 3277/3542 [01:20<00:03, 67.53it/s] 93%|█████████▎| 3284/3542 [01:20<00:03, 65.62it/s] 93%|█████████▎| 3291/3542 [01:20<00:03, 63.88it/s] 93%|█████████▎| 3299/3542 [01:20<00:03, 67.41it/s] 93%|█████████▎| 3306/3542 [01:20<00:03, 65.74it/s] 94%|█████████▎| 3313/3542 [01:21<00:03, 65.85it/s] 94%|█████████▍| 3322/3542 [01:21<00:03, 70.16it/s] 94%|█████████▍| 3330/3542 [01:21<00:03, 68.88it/s] 94%|█████████▍| 3337/3542 [01:21<00:02, 68.46it/s] 94%|█████████▍| 3345/3542 [01:21<00:02, 69.62it/s] 95%|█████████▍| 3353/3542 [01:21<00:02, 71.71it/s] 95%|█████████▍| 3362/3542 [01:21<00:02, 74.68it/s] 95%|█████████▌| 3370/3542 [01:21<00:02, 69.98it/s] 95%|█████████▌| 3378/3542 [01:21<00:02, 71.37it/s] 96%|█████████▌| 3386/3542 [01:22<00:02, 69.48it/s] 96%|█████████▌| 3393/3542 [01:22<00:02, 68.25it/s] 96%|█████████▌| 3402/3542 [01:22<00:01, 72.22it/s] 96%|█████████▋| 3410/3542 [01:22<00:01, 73.24it/s] 96%|█████████▋| 3418/3542 [01:22<00:01, 73.08it/s] 97%|█████████▋| 3426/3542 [01:22<00:01, 74.23it/s] 97%|█████████▋| 3434/3542 [01:22<00:01, 75.58it/s] 97%|█████████▋| 3443/3542 [01:22<00:01, 77.99it/s] 97%|█████████▋| 3451/3542 [01:22<00:01, 76.63it/s] 98%|█████████▊| 3459/3542 [01:23<00:01, 74.87it/s] 98%|█████████▊| 3467/3542 [01:23<00:01, 63.37it/s] 98%|█████████▊| 3474/3542 [01:23<00:01, 40.50it/s] 98%|█████████▊| 3482/3542 [01:23<00:01, 46.88it/s] 98%|█████████▊| 3488/3542 [01:23<00:01, 48.58it/s] 99%|█████████▊| 3496/3542 [01:23<00:00, 54.63it/s] 99%|█████████▉| 3504/3542 [01:23<00:00, 59.43it/s] 99%|█████████▉| 3513/3542 [01:24<00:00, 66.76it/s] 99%|█████████▉| 3523/3542 [01:24<00:00, 73.72it/s]100%|█████████▉| 3532/3542 [01:24<00:00, 76.30it/s]100%|█████████▉| 3541/3542 [01:24<00:00, 78.73it/s]100%|██████████| 3542/3542 [01:24<00:00, 41.96it/s]
  0%|          | 0/1 [00:00<?, ?it/s]100%|██████████| 1/1 [00:17<00:00, 17.17s/it]100%|██████████| 1/1 [00:17<00:00, 17.18s/it]
  0%|          | 0/1 [00:00<?, ?it/s]100%|██████████| 1/1 [00:22<00:00, 22.92s/it]100%|██████████| 1/1 [00:22<00:00, 22.92s/it]
  0%|          | 0/75 [00:00<?, ?it/s]  1%|▏         | 1/75 [00:00<00:47,  1.56it/s]  3%|▎         | 2/75 [00:01<00:47,  1.55it/s]  4%|▍         | 3/75 [00:01<00:39,  1.82it/s]  5%|▌         | 4/75 [00:02<00:42,  1.68it/s]  7%|▋         | 5/75 [00:02<00:34,  2.02it/s]  8%|▊         | 6/75 [00:03<00:40,  1.70it/s]  9%|▉         | 7/75 [00:04<00:42,  1.58it/s] 11%|█         | 8/75 [00:04<00:39,  1.71it/s] 12%|█▏        | 9/75 [00:05<00:37,  1.77it/s] 13%|█▎        | 10/75 [00:05<00:33,  1.93it/s] 15%|█▍        | 11/75 [00:06<00:31,  2.02it/s] 16%|█▌        | 12/75 [00:06<00:31,  1.98it/s] 17%|█▋        | 13/75 [00:07<00:33,  1.83it/s] 19%|█▊        | 14/75 [00:07<00:35,  1.71it/s] 20%|██        | 15/75 [00:08<00:36,  1.64it/s] 21%|██▏       | 16/75 [00:08<00:29,  1.97it/s] 23%|██▎       | 17/75 [00:09<00:29,  1.99it/s] 24%|██▍       | 18/75 [00:09<00:26,  2.13it/s] 25%|██▌       | 19/75 [00:10<00:27,  2.04it/s] 27%|██▋       | 20/75 [00:10<00:26,  2.06it/s] 28%|██▊       | 21/75 [00:11<00:26,  2.01it/s] 29%|██▉       | 22/75 [00:11<00:25,  2.10it/s] 31%|███       | 23/75 [00:12<00:23,  2.20it/s] 32%|███▏      | 24/75 [00:12<00:20,  2.50it/s] 33%|███▎      | 25/75 [00:12<00:21,  2.35it/s] 35%|███▍      | 26/75 [00:13<00:27,  1.81it/s] 36%|███▌      | 27/75 [00:14<00:29,  1.63it/s] 37%|███▋      | 28/75 [00:14<00:27,  1.73it/s] 39%|███▊      | 29/75 [00:15<00:24,  1.90it/s] 40%|████      | 30/75 [00:15<00:22,  1.97it/s] 41%|████▏     | 31/75 [00:16<00:26,  1.63it/s] 43%|████▎     | 32/75 [00:17<00:23,  1.82it/s] 44%|████▍     | 33/75 [00:17<00:20,  2.02it/s] 45%|████▌     | 34/75 [00:17<00:20,  1.99it/s] 47%|████▋     | 35/75 [00:18<00:19,  2.02it/s] 48%|████▊     | 36/75 [00:18<00:18,  2.16it/s] 49%|████▉     | 37/75 [00:19<00:17,  2.16it/s] 51%|█████     | 38/75 [00:19<00:16,  2.29it/s] 52%|█████▏    | 39/75 [00:20<00:17,  2.03it/s] 53%|█████▎    | 40/75 [00:20<00:15,  2.21it/s] 55%|█████▍    | 41/75 [00:21<00:15,  2.14it/s] 56%|█████▌    | 42/75 [00:21<00:14,  2.29it/s] 57%|█████▋    | 43/75 [00:22<00:15,  2.08it/s] 59%|█████▊    | 44/75 [00:22<00:14,  2.18it/s] 60%|██████    | 45/75 [00:22<00:13,  2.26it/s] 61%|██████▏   | 46/75 [00:24<00:20,  1.39it/s] 63%|██████▎   | 47/75 [00:24<00:17,  1.59it/s] 64%|██████▍   | 48/75 [00:25<00:15,  1.79it/s] 65%|██████▌   | 49/75 [00:25<00:13,  1.96it/s] 67%|██████▋   | 50/75 [00:25<00:11,  2.19it/s] 68%|██████▊   | 51/75 [00:26<00:11,  2.00it/s] 69%|██████▉   | 52/75 [00:26<00:10,  2.27it/s] 71%|███████   | 53/75 [00:27<00:08,  2.45it/s] 72%|███████▏  | 54/75 [00:27<00:08,  2.53it/s] 73%|███████▎  | 55/75 [00:27<00:07,  2.83it/s] 75%|███████▍  | 56/75 [00:28<00:06,  2.91it/s] 76%|███████▌  | 57/75 [00:28<00:05,  3.12it/s] 77%|███████▋  | 58/75 [00:28<00:05,  3.09it/s] 79%|███████▊  | 59/75 [00:29<00:06,  2.63it/s] 80%|████████  | 60/75 [00:29<00:05,  2.87it/s] 81%|████████▏ | 61/75 [00:29<00:04,  2.92it/s] 83%|████████▎ | 62/75 [00:30<00:05,  2.48it/s] 84%|████████▍ | 63/75 [00:30<00:04,  2.40it/s] 85%|████████▌ | 64/75 [00:31<00:04,  2.27it/s] 87%|████████▋ | 65/75 [00:31<00:04,  2.36it/s] 88%|████████▊ | 66/75 [00:32<00:04,  2.25it/s] 89%|████████▉ | 67/75 [00:32<00:03,  2.17it/s] 91%|█████████ | 68/75 [00:33<00:03,  2.10it/s] 92%|█████████▏| 69/75 [00:35<00:05,  1.04it/s] 93%|█████████▎| 70/75 [00:35<00:04,  1.14it/s] 95%|█████████▍| 71/75 [00:36<00:03,  1.24it/s] 96%|█████████▌| 72/75 [00:36<00:02,  1.41it/s] 97%|█████████▋| 73/75 [00:37<00:01,  1.34it/s] 99%|█████████▊| 74/75 [00:38<00:00,  1.36it/s]100%|██████████| 75/75 [00:38<00:00,  1.59it/s]100%|██████████| 75/75 [00:38<00:00,  1.93it/s]
  0%|          | 0/75 [00:00<?, ?it/s]  1%|▏         | 1/75 [00:00<00:35,  2.06it/s]  3%|▎         | 2/75 [00:01<00:39,  1.85it/s]  4%|▍         | 3/75 [00:01<00:36,  1.95it/s]  5%|▌         | 4/75 [00:01<00:33,  2.14it/s]  7%|▋         | 5/75 [00:02<00:32,  2.14it/s]  8%|▊         | 6/75 [00:03<00:36,  1.89it/s]  9%|▉         | 7/75 [00:04<00:50,  1.34it/s] 11%|█         | 8/75 [00:04<00:44,  1.52it/s] 12%|█▏        | 9/75 [00:06<01:10,  1.07s/it] 13%|█▎        | 10/75 [00:07<01:02,  1.03it/s] 15%|█▍        | 11/75 [00:07<00:51,  1.24it/s] 16%|█▌        | 12/75 [00:08<00:46,  1.36it/s] 17%|█▋        | 13/75 [00:08<00:39,  1.56it/s] 19%|█▊        | 14/75 [00:09<00:37,  1.62it/s] 20%|██        | 15/75 [00:09<00:32,  1.84it/s] 21%|██▏       | 16/75 [00:10<00:36,  1.59it/s] 23%|██▎       | 17/75 [00:11<00:34,  1.70it/s] 24%|██▍       | 18/75 [00:11<00:31,  1.78it/s] 25%|██▌       | 19/75 [00:12<00:34,  1.61it/s] 27%|██▋       | 20/75 [00:12<00:31,  1.76it/s] 28%|██▊       | 21/75 [00:13<00:31,  1.73it/s] 29%|██▉       | 22/75 [00:14<00:34,  1.54it/s] 31%|███       | 23/75 [00:14<00:29,  1.77it/s] 32%|███▏      | 24/75 [00:15<00:27,  1.85it/s] 33%|███▎      | 25/75 [00:16<00:37,  1.34it/s] 35%|███▍      | 26/75 [00:16<00:32,  1.49it/s] 36%|███▌      | 27/75 [00:18<00:39,  1.21it/s] 37%|███▋      | 28/75 [00:18<00:32,  1.43it/s] 39%|███▊      | 29/75 [00:19<00:41,  1.11it/s] 40%|████      | 30/75 [00:20<00:37,  1.22it/s] 41%|████▏     | 31/75 [00:20<00:30,  1.46it/s] 43%|████▎     | 32/75 [00:21<00:29,  1.48it/s] 44%|████▍     | 33/75 [00:22<00:28,  1.48it/s] 45%|████▌     | 34/75 [00:22<00:29,  1.38it/s] 47%|████▋     | 35/75 [00:23<00:28,  1.40it/s] 48%|████▊     | 36/75 [00:24<00:25,  1.55it/s] 49%|████▉     | 37/75 [00:24<00:23,  1.58it/s] 51%|█████     | 38/75 [00:25<00:20,  1.85it/s] 52%|█████▏    | 39/75 [00:26<00:23,  1.51it/s] 53%|█████▎    | 40/75 [00:26<00:21,  1.62it/s] 55%|█████▍    | 41/75 [00:27<00:21,  1.59it/s] 56%|█████▌    | 42/75 [00:28<00:24,  1.34it/s] 57%|█████▋    | 43/75 [00:28<00:21,  1.46it/s] 59%|█████▊    | 44/75 [00:29<00:18,  1.69it/s] 60%|██████    | 45/75 [00:29<00:16,  1.77it/s] 61%|██████▏   | 46/75 [00:30<00:16,  1.76it/s] 63%|██████▎   | 47/75 [00:30<00:15,  1.76it/s] 64%|██████▍   | 48/75 [00:31<00:15,  1.73it/s] 65%|██████▌   | 49/75 [00:32<00:15,  1.65it/s] 67%|██████▋   | 50/75 [00:32<00:15,  1.64it/s] 68%|██████▊   | 51/75 [00:33<00:17,  1.35it/s] 69%|██████▉   | 52/75 [00:34<00:15,  1.46it/s] 71%|███████   | 53/75 [00:35<00:21,  1.01it/s] 72%|███████▏  | 54/75 [00:36<00:18,  1.13it/s] 73%|███████▎  | 55/75 [00:36<00:14,  1.42it/s] 75%|███████▍  | 56/75 [00:37<00:12,  1.49it/s] 76%|███████▌  | 57/75 [00:37<00:10,  1.67it/s] 77%|███████▋  | 58/75 [00:38<00:09,  1.76it/s] 79%|███████▊  | 59/75 [00:38<00:08,  1.86it/s] 80%|████████  | 60/75 [00:39<00:07,  2.08it/s] 81%|████████▏ | 61/75 [00:40<00:08,  1.73it/s] 83%|████████▎ | 62/75 [00:40<00:07,  1.73it/s] 84%|████████▍ | 63/75 [00:41<00:07,  1.54it/s] 85%|████████▌ | 64/75 [00:41<00:06,  1.83it/s] 87%|████████▋ | 65/75 [00:42<00:05,  1.85it/s] 88%|████████▊ | 66/75 [00:43<00:05,  1.60it/s] 89%|████████▉ | 67/75 [00:44<00:06,  1.17it/s] 91%|█████████ | 68/75 [00:45<00:05,  1.23it/s] 92%|█████████▏| 69/75 [00:45<00:04,  1.41it/s] 93%|█████████▎| 70/75 [00:46<00:03,  1.64it/s] 95%|█████████▍| 71/75 [00:46<00:02,  1.63it/s] 96%|█████████▌| 72/75 [00:49<00:03,  1.31s/it] 97%|█████████▋| 73/75 [00:50<00:02,  1.05s/it] 99%|█████████▊| 74/75 [00:50<00:00,  1.17it/s]100%|██████████| 75/75 [00:51<00:00,  1.16it/s]100%|██████████| 75/75 [00:51<00:00,  1.46it/s]
  0%|          | 0/72 [00:00<?, ?it/s]  1%|▏         | 1/72 [00:00<00:09,  7.26it/s]  3%|▎         | 2/72 [00:00<00:10,  6.98it/s]  4%|▍         | 3/72 [00:00<00:09,  6.95it/s]  6%|▌         | 4/72 [00:00<00:09,  6.84it/s]  7%|▋         | 5/72 [00:00<00:09,  6.84it/s]  8%|▊         | 6/72 [00:00<00:09,  6.63it/s] 10%|▉         | 7/72 [00:01<00:09,  6.62it/s] 11%|█         | 8/72 [00:01<00:09,  6.63it/s] 12%|█▎        | 9/72 [00:01<00:09,  6.72it/s] 14%|█▍        | 10/72 [00:01<00:09,  6.62it/s] 15%|█▌        | 11/72 [00:01<00:09,  6.58it/s] 17%|█▋        | 12/72 [00:01<00:09,  6.54it/s] 18%|█▊        | 13/72 [00:01<00:09,  6.42it/s] 19%|█▉        | 14/72 [00:02<00:09,  6.24it/s] 21%|██        | 15/72 [00:02<00:09,  5.94it/s] 22%|██▏       | 16/72 [00:02<00:09,  5.99it/s] 24%|██▎       | 17/72 [00:02<00:09,  6.02it/s] 25%|██▌       | 18/72 [00:02<00:09,  5.88it/s] 26%|██▋       | 19/72 [00:02<00:09,  5.88it/s] 28%|██▊       | 20/72 [00:03<00:08,  5.96it/s] 29%|██▉       | 21/72 [00:03<00:08,  5.89it/s] 31%|███       | 22/72 [00:03<00:08,  5.79it/s] 32%|███▏      | 23/72 [00:03<00:08,  5.95it/s] 33%|███▎      | 24/72 [00:03<00:08,  5.90it/s] 35%|███▍      | 25/72 [00:04<00:07,  5.93it/s] 36%|███▌      | 26/72 [00:04<00:07,  5.94it/s] 38%|███▊      | 27/72 [00:04<00:07,  5.92it/s] 39%|███▉      | 28/72 [00:04<00:07,  5.88it/s] 40%|████      | 29/72 [00:04<00:07,  5.83it/s] 42%|████▏     | 30/72 [00:04<00:07,  5.88it/s] 43%|████▎     | 31/72 [00:05<00:07,  5.60it/s] 44%|████▍     | 32/72 [00:05<00:07,  5.59it/s] 46%|████▌     | 33/72 [00:05<00:06,  5.67it/s] 47%|████▋     | 34/72 [00:05<00:06,  5.47it/s] 49%|████▊     | 35/72 [00:05<00:06,  5.39it/s] 50%|█████     | 36/72 [00:05<00:06,  5.53it/s] 51%|█████▏    | 37/72 [00:06<00:06,  5.49it/s] 53%|█████▎    | 38/72 [00:06<00:06,  5.51it/s] 54%|█████▍    | 39/72 [00:06<00:06,  5.39it/s] 56%|█████▌    | 40/72 [00:07<00:08,  3.63it/s] 57%|█████▋    | 41/72 [00:07<00:07,  4.07it/s] 58%|█████▊    | 42/72 [00:07<00:06,  4.37it/s] 60%|█████▉    | 43/72 [00:07<00:06,  4.71it/s] 61%|██████    | 44/72 [00:07<00:05,  4.85it/s] 62%|██████▎   | 45/72 [00:09<00:19,  1.41it/s] 64%|██████▍   | 46/72 [00:09<00:15,  1.70it/s] 65%|██████▌   | 47/72 [00:10<00:11,  2.11it/s] 67%|██████▋   | 48/72 [00:10<00:09,  2.57it/s] 68%|██████▊   | 49/72 [00:10<00:07,  3.02it/s] 69%|██████▉   | 50/72 [00:10<00:06,  3.47it/s] 71%|███████   | 51/72 [00:10<00:05,  3.89it/s] 72%|███████▏  | 52/72 [00:11<00:04,  4.20it/s] 74%|███████▎  | 53/72 [00:11<00:04,  4.44it/s] 75%|███████▌  | 54/72 [00:11<00:03,  4.59it/s] 76%|███████▋  | 55/72 [00:11<00:03,  4.63it/s] 78%|███████▊  | 56/72 [00:11<00:03,  4.58it/s] 79%|███████▉  | 57/72 [00:12<00:03,  4.61it/s] 81%|████████  | 58/72 [00:12<00:03,  4.58it/s] 82%|████████▏ | 59/72 [00:12<00:02,  4.50it/s] 83%|████████▎ | 60/72 [00:12<00:02,  4.54it/s] 85%|████████▍ | 61/72 [00:13<00:02,  4.50it/s] 86%|████████▌ | 62/72 [00:13<00:02,  4.48it/s] 88%|████████▊ | 63/72 [00:13<00:02,  4.47it/s] 89%|████████▉ | 64/72 [00:13<00:01,  4.37it/s] 90%|█████████ | 65/72 [00:13<00:01,  4.28it/s] 92%|█████████▏| 66/72 [00:14<00:01,  4.22it/s] 93%|█████████▎| 67/72 [00:14<00:01,  4.19it/s] 94%|█████████▍| 68/72 [00:14<00:00,  4.24it/s] 96%|█████████▌| 69/72 [00:14<00:00,  4.15it/s] 97%|█████████▋| 70/72 [00:15<00:00,  4.15it/s] 99%|█████████▊| 71/72 [00:15<00:00,  4.09it/s]100%|██████████| 72/72 [00:15<00:00,  3.22it/s]100%|██████████| 72/72 [00:15<00:00,  4.52it/s]
  0%|          | 0/313037 [00:00<?, ?it/s]  0%|          | 771/313037 [00:00<00:40, 7705.45it/s]  0%|          | 1542/313037 [00:00<00:44, 6943.63it/s]  1%|          | 2276/313037 [00:00<00:43, 7110.75it/s]  1%|          | 2991/313037 [00:00<01:22, 3747.75it/s]  1%|          | 3728/313037 [00:00<01:07, 4553.09it/s]  1%|▏         | 4369/313037 [00:00<01:01, 4999.81it/s]  2%|▏         | 4980/313037 [00:00<00:58, 5257.43it/s]  2%|▏         | 5672/313037 [00:01<00:53, 5701.16it/s]  2%|▏         | 6409/313037 [00:01<00:49, 6160.97it/s]  2%|▏         | 7134/313037 [00:01<00:47, 6468.88it/s]  3%|▎         | 7839/313037 [00:01<00:46, 6634.28it/s]  3%|▎         | 8530/313037 [00:01<00:46, 6551.58it/s]  3%|▎         | 9205/313037 [00:01<00:46, 6597.76it/s]  3%|▎         | 9969/313037 [00:01<00:43, 6901.65it/s]  3%|▎         | 10670/313037 [00:01<00:43, 6886.58it/s]  4%|▎         | 11458/313037 [00:01<00:42, 7177.85it/s]  4%|▍         | 12182/313037 [00:01<00:43, 6917.17it/s]  4%|▍         | 12895/313037 [00:02<00:43, 6978.25it/s]  4%|▍         | 13598/313037 [00:02<00:43, 6875.00it/s]  5%|▍         | 14413/313037 [00:02<00:41, 7244.98it/s]  5%|▍         | 15141/313037 [00:02<00:41, 7110.13it/s]  5%|▌         | 15950/313037 [00:02<00:40, 7395.03it/s]  5%|▌         | 16693/313037 [00:02<00:40, 7338.60it/s]  6%|▌         | 17429/313037 [00:02<00:42, 6918.91it/s]  6%|▌         | 18265/313037 [00:02<00:40, 7326.24it/s]  6%|▌         | 19004/313037 [00:02<00:40, 7226.20it/s]  6%|▋         | 19736/313037 [00:03<00:40, 7251.97it/s]  7%|▋         | 20465/313037 [00:03<00:43, 6787.41it/s]  7%|▋         | 21177/313037 [00:03<00:42, 6879.92it/s]  7%|▋         | 21871/313037 [00:03<00:43, 6764.77it/s]  7%|▋         | 22552/313037 [00:03<00:42, 6758.70it/s]  7%|▋         | 23231/313037 [00:03<00:43, 6687.94it/s]  8%|▊         | 23902/313037 [00:03<00:44, 6543.06it/s]  8%|▊         | 24638/313037 [00:03<00:42, 6777.87it/s]  8%|▊         | 25318/313037 [00:03<00:42, 6779.05it/s]  8%|▊         | 26206/313037 [00:03<00:38, 7395.39it/s]  9%|▊         | 26948/313037 [00:04<00:40, 7082.31it/s]  9%|▉         | 27677/313037 [00:04<00:39, 7141.37it/s]  9%|▉         | 28395/313037 [00:04<00:42, 6728.66it/s]  9%|▉         | 29075/313037 [00:04<00:43, 6527.90it/s]  9%|▉         | 29733/313037 [00:04<00:43, 6540.08it/s] 10%|▉         | 30497/313037 [00:04<00:41, 6853.31it/s] 10%|▉         | 31187/313037 [00:04<00:42, 6600.60it/s] 10%|█         | 32001/313037 [00:04<00:39, 7037.97it/s] 10%|█         | 32780/313037 [00:04<00:38, 7254.29it/s] 11%|█         | 33510/313037 [00:05<00:39, 7145.03it/s] 11%|█         | 34228/313037 [00:05<00:39, 7032.98it/s] 11%|█         | 35025/313037 [00:05<00:38, 7303.34it/s] 11%|█▏        | 35940/313037 [00:05<00:35, 7841.88it/s] 12%|█▏        | 36728/313037 [00:05<00:35, 7815.93it/s] 12%|█▏        | 37512/313037 [00:05<00:36, 7505.10it/s] 12%|█▏        | 38267/313037 [00:05<00:37, 7407.79it/s] 12%|█▏        | 39011/313037 [00:05<00:38, 7127.44it/s] 13%|█▎        | 39767/313037 [00:05<00:37, 7249.80it/s] 13%|█▎        | 40577/313037 [00:05<00:36, 7494.59it/s] 13%|█▎        | 41330/313037 [00:06<00:38, 7140.50it/s] 13%|█▎        | 42050/313037 [00:06<00:38, 7089.55it/s] 14%|█▎        | 42763/313037 [00:06<00:38, 7037.40it/s] 14%|█▍        | 43469/313037 [00:06<00:38, 6975.68it/s] 14%|█▍        | 44192/313037 [00:06<00:38, 7048.60it/s] 14%|█▍        | 44901/313037 [00:06<00:37, 7058.13it/s] 15%|█▍        | 45608/313037 [00:06<00:39, 6725.16it/s] 15%|█▍        | 46285/313037 [00:06<00:40, 6665.39it/s] 15%|█▌        | 47177/313037 [00:06<00:36, 7312.87it/s] 15%|█▌        | 47950/313037 [00:07<00:35, 7432.42it/s] 16%|█▌        | 48697/313037 [00:07<00:35, 7438.95it/s] 16%|█▌        | 49444/313037 [00:07<00:35, 7423.81it/s] 16%|█▌        | 50189/313037 [00:07<00:38, 6820.38it/s] 16%|█▋        | 50886/313037 [00:07<00:38, 6861.10it/s] 16%|█▋        | 51614/313037 [00:07<00:37, 6978.82it/s] 17%|█▋        | 52416/313037 [00:07<00:35, 7279.92it/s] 17%|█▋        | 53150/313037 [00:07<00:36, 7132.43it/s] 17%|█▋        | 53966/313037 [00:07<00:34, 7429.71it/s] 17%|█▋        | 54713/313037 [00:07<00:34, 7418.25it/s] 18%|█▊        | 55458/313037 [00:08<00:37, 6879.18it/s] 18%|█▊        | 56156/313037 [00:08<00:37, 6864.06it/s] 18%|█▊        | 56849/313037 [00:08<00:38, 6587.99it/s] 18%|█▊        | 57647/313037 [00:08<00:36, 6977.55it/s] 19%|█▊        | 58411/313037 [00:08<00:35, 7164.92it/s] 19%|█▉        | 59134/313037 [00:08<00:36, 7015.16it/s] 19%|█▉        | 59840/313037 [00:08<00:36, 6989.89it/s] 19%|█▉        | 60637/313037 [00:08<00:34, 7272.62it/s] 20%|█▉        | 61368/313037 [00:08<00:34, 7243.71it/s] 20%|█▉        | 62095/313037 [00:09<00:35, 7156.10it/s] 20%|██        | 62813/313037 [00:09<00:35, 7117.20it/s] 20%|██        | 63564/313037 [00:09<00:34, 7231.93it/s] 21%|██        | 64289/313037 [00:09<00:35, 7077.83it/s] 21%|██        | 64999/313037 [00:09<00:36, 6822.41it/s] 21%|██        | 65773/313037 [00:09<00:34, 7083.86it/s] 21%|██        | 66511/313037 [00:09<00:34, 7169.66it/s] 21%|██▏       | 67231/313037 [00:09<00:35, 6964.17it/s] 22%|██▏       | 67947/313037 [00:09<00:34, 7018.73it/s] 22%|██▏       | 68651/313037 [00:09<00:35, 6861.46it/s] 22%|██▏       | 69339/313037 [00:10<00:35, 6823.03it/s] 22%|██▏       | 70023/313037 [00:10<00:35, 6817.65it/s] 23%|██▎       | 70778/313037 [00:10<00:34, 7032.07it/s] 23%|██▎       | 71483/313037 [00:10<00:34, 6981.47it/s] 23%|██▎       | 72182/313037 [00:10<00:34, 6932.79it/s] 23%|██▎       | 72876/313037 [00:10<00:34, 6914.14it/s] 24%|██▎       | 73568/313037 [00:10<00:34, 6891.07it/s] 24%|██▍       | 74404/313037 [00:10<00:32, 7325.64it/s] 24%|██▍       | 75138/313037 [00:10<00:32, 7272.90it/s] 24%|██▍       | 75866/313037 [00:10<00:32, 7271.38it/s] 24%|██▍       | 76684/313037 [00:11<00:31, 7541.36it/s] 25%|██▍       | 77488/313037 [00:11<00:30, 7688.35it/s] 25%|██▍       | 78258/313037 [00:11<00:31, 7505.50it/s] 25%|██▌       | 79048/313037 [00:11<00:30, 7619.84it/s] 25%|██▌       | 79812/313037 [00:11<00:30, 7622.83it/s] 26%|██▌       | 80576/313037 [00:11<00:51, 4521.93it/s] 26%|██▌       | 81346/313037 [00:11<00:44, 5160.27it/s] 26%|██▌       | 82093/313037 [00:12<00:40, 5675.01it/s] 26%|██▋       | 82779/313037 [00:12<00:38, 5959.69it/s] 27%|██▋       | 83472/313037 [00:12<00:36, 6208.28it/s] 27%|██▋       | 84158/313037 [00:12<00:36, 6197.03it/s] 27%|██▋       | 84983/313037 [00:12<00:33, 6753.29it/s] 27%|██▋       | 85821/313037 [00:12<00:31, 7205.97it/s] 28%|██▊       | 86572/313037 [00:12<00:31, 7187.92it/s] 28%|██▊       | 87312/313037 [00:12<00:31, 7207.47it/s] 28%|██▊       | 88048/313037 [00:12<00:31, 7096.38it/s] 28%|██▊       | 88827/313037 [00:12<00:30, 7294.85it/s] 29%|██▊       | 89565/313037 [00:13<00:30, 7222.51it/s] 29%|██▉       | 90398/313037 [00:13<00:29, 7544.29it/s] 29%|██▉       | 91158/313037 [00:13<00:29, 7441.56it/s] 29%|██▉       | 91906/313037 [00:13<00:30, 7282.12it/s] 30%|██▉       | 92638/313037 [00:13<00:30, 7174.65it/s] 30%|██▉       | 93358/313037 [00:13<00:30, 7166.68it/s] 30%|███       | 94077/313037 [00:13<00:30, 7106.31it/s] 30%|███       | 94789/313037 [00:13<00:32, 6803.59it/s] 31%|███       | 95607/313037 [00:13<00:30, 7195.14it/s] 31%|███       | 96359/313037 [00:13<00:29, 7287.48it/s] 31%|███       | 97091/313037 [00:14<00:29, 7269.91it/s] 31%|███▏      | 97930/313037 [00:14<00:28, 7597.76it/s] 32%|███▏      | 98692/313037 [00:14<00:28, 7601.34it/s] 32%|███▏      | 99454/313037 [00:14<00:28, 7467.10it/s] 32%|███▏      | 100244/313037 [00:14<00:28, 7593.96it/s] 32%|███▏      | 101020/313037 [00:14<00:27, 7641.27it/s] 33%|███▎      | 101786/313037 [00:14<00:45, 4603.65it/s] 33%|███▎      | 102509/313037 [00:15<00:40, 5137.35it/s] 33%|███▎      | 103235/313037 [00:15<00:37, 5614.25it/s] 33%|███▎      | 103902/313037 [00:15<00:36, 5715.16it/s] 33%|███▎      | 104683/313037 [00:15<00:33, 6243.99it/s] 34%|███▎      | 105416/313037 [00:15<00:31, 6530.51it/s] 34%|███▍      | 106257/313037 [00:15<00:29, 7046.93it/s] 34%|███▍      | 107000/313037 [00:15<00:29, 7077.22it/s] 34%|███▍      | 107823/313037 [00:15<00:27, 7403.56it/s] 35%|███▍      | 108584/313037 [00:15<00:28, 7226.22it/s] 35%|███▍      | 109360/313037 [00:15<00:27, 7378.65it/s] 35%|███▌      | 110116/313037 [00:16<00:27, 7430.53it/s] 35%|███▌      | 110868/313037 [00:16<00:28, 7164.96it/s] 36%|███▌      | 111592/313037 [00:16<00:28, 7103.32it/s] 36%|███▌      | 112404/313037 [00:16<00:27, 7394.39it/s] 36%|███▌      | 113149/313037 [00:16<00:27, 7219.11it/s] 36%|███▋      | 113875/313037 [00:16<00:28, 6908.82it/s] 37%|███▋      | 114640/313037 [00:16<00:27, 7117.03it/s] 37%|███▋      | 115444/313037 [00:16<00:26, 7380.55it/s] 37%|███▋      | 116187/313037 [00:16<00:26, 7316.34it/s] 37%|███▋      | 116922/313037 [00:17<00:27, 7225.41it/s] 38%|███▊      | 117647/313037 [00:17<00:27, 7103.10it/s] 38%|███▊      | 118542/313037 [00:17<00:25, 7636.31it/s] 38%|███▊      | 119309/313037 [00:17<00:26, 7388.22it/s] 38%|███▊      | 120165/313037 [00:17<00:24, 7723.54it/s] 39%|███▊      | 120942/313037 [00:17<00:25, 7452.61it/s] 39%|███▉      | 121692/313037 [00:17<00:32, 5927.59it/s] 39%|███▉      | 122496/313037 [00:17<00:29, 6445.12it/s] 39%|███▉      | 123291/313037 [00:17<00:27, 6833.57it/s] 40%|███▉      | 124034/313037 [00:18<00:27, 6992.90it/s] 40%|███▉      | 124763/313037 [00:18<00:27, 6875.93it/s] 40%|████      | 125497/313037 [00:18<00:26, 7003.85it/s] 40%|████      | 126213/313037 [00:18<00:26, 6965.01it/s] 41%|████      | 126920/313037 [00:18<00:26, 6969.75it/s] 41%|████      | 127625/313037 [00:18<00:27, 6731.59it/s] 41%|████      | 128332/313037 [00:18<00:27, 6827.97it/s] 41%|████      | 129020/313037 [00:18<00:27, 6805.94it/s] 41%|████▏     | 129731/313037 [00:18<00:26, 6893.56it/s] 42%|████▏     | 130494/313037 [00:18<00:25, 7108.57it/s] 42%|████▏     | 131309/313037 [00:19<00:24, 7416.00it/s] 42%|████▏     | 132078/313037 [00:19<00:24, 7494.89it/s] 42%|████▏     | 132879/313037 [00:19<00:23, 7648.12it/s] 43%|████▎     | 133702/313037 [00:19<00:22, 7821.23it/s] 43%|████▎     | 134489/313037 [00:19<00:22, 7834.71it/s] 43%|████▎     | 135274/313037 [00:19<00:27, 6359.85it/s] 43%|████▎     | 135973/313037 [00:19<00:27, 6520.52it/s] 44%|████▎     | 136660/313037 [00:19<00:27, 6423.35it/s] 44%|████▍     | 137489/313037 [00:19<00:25, 6928.53it/s] 44%|████▍     | 138274/313037 [00:20<00:24, 7184.58it/s] 44%|████▍     | 139010/313037 [00:20<00:24, 7107.89it/s] 45%|████▍     | 139733/313037 [00:20<00:30, 5643.15it/s] 45%|████▍     | 140480/313037 [00:20<00:28, 6087.43it/s] 45%|████▌     | 141137/313037 [00:20<00:27, 6151.93it/s] 45%|████▌     | 141850/313037 [00:20<00:26, 6413.00it/s] 46%|████▌     | 142631/313037 [00:20<00:25, 6799.13it/s] 46%|████▌     | 143334/313037 [00:20<00:25, 6776.43it/s] 46%|████▌     | 144134/313037 [00:20<00:23, 7124.36it/s] 46%|████▋     | 144860/313037 [00:21<00:24, 6946.59it/s] 47%|████▋     | 145583/313037 [00:21<00:23, 7027.21it/s] 47%|████▋     | 146407/313037 [00:21<00:22, 7378.69it/s] 47%|████▋     | 147221/313037 [00:21<00:21, 7600.51it/s] 47%|████▋     | 147986/313037 [00:21<00:21, 7529.39it/s] 48%|████▊     | 148743/313037 [00:21<00:22, 7450.89it/s] 48%|████▊     | 149491/313037 [00:21<00:22, 7288.65it/s] 48%|████▊     | 150223/313037 [00:21<00:23, 6997.36it/s] 48%|████▊     | 150927/313037 [00:21<00:23, 6797.65it/s] 48%|████▊     | 151815/313037 [00:22<00:21, 7386.11it/s] 49%|████▊     | 152560/313037 [00:22<00:22, 7242.51it/s] 49%|████▉     | 153402/313037 [00:22<00:21, 7580.05it/s] 49%|████▉     | 154414/313037 [00:22<00:19, 8317.86it/s] 50%|████▉     | 155722/313037 [00:22<00:16, 9711.63it/s] 50%|█████     | 156700/313037 [00:22<00:17, 9102.77it/s] 50%|█████     | 157623/313037 [00:22<00:18, 8491.73it/s] 51%|█████     | 158487/313037 [00:22<00:19, 8064.37it/s] 51%|█████     | 159306/313037 [00:22<00:19, 8042.90it/s] 51%|█████     | 160119/313037 [00:22<00:19, 7906.29it/s] 51%|█████▏    | 160915/313037 [00:23<00:19, 7743.07it/s] 52%|█████▏    | 161706/313037 [00:23<00:19, 7788.60it/s] 52%|█████▏    | 162488/313037 [00:23<00:19, 7537.87it/s] 52%|█████▏    | 163245/313037 [00:23<00:20, 7442.36it/s] 52%|█████▏    | 164076/313037 [00:23<00:19, 7687.78it/s] 53%|█████▎    | 164848/313037 [00:23<00:20, 7382.75it/s] 53%|█████▎    | 165603/313037 [00:23<00:19, 7428.83it/s] 53%|█████▎    | 166484/313037 [00:23<00:18, 7825.29it/s] 53%|█████▎    | 167270/313037 [00:23<00:19, 7671.77it/s] 54%|█████▎    | 168077/313037 [00:24<00:18, 7786.80it/s] 54%|█████▍    | 168889/313037 [00:24<00:18, 7882.49it/s] 54%|█████▍    | 169680/313037 [00:24<00:18, 7793.83it/s] 54%|█████▍    | 170497/313037 [00:24<00:18, 7902.62it/s] 55%|█████▍    | 171289/313037 [00:24<00:29, 4764.84it/s] 55%|█████▍    | 171917/313037 [00:24<00:27, 5067.29it/s] 55%|█████▌    | 172598/313037 [00:24<00:25, 5457.52it/s] 55%|█████▌    | 173250/313037 [00:24<00:24, 5714.13it/s] 56%|█████▌    | 174022/313037 [00:25<00:22, 6230.02it/s] 56%|█████▌    | 174706/313037 [00:25<00:22, 6247.66it/s] 56%|█████▌    | 175374/313037 [00:25<00:22, 6092.92it/s] 56%|█████▋    | 176165/313037 [00:25<00:20, 6585.80it/s] 57%|█████▋    | 176991/313037 [00:25<00:19, 7052.08it/s] 57%|█████▋    | 177718/313037 [00:25<00:19, 7082.22it/s] 57%|█████▋    | 178477/313037 [00:25<00:18, 7228.02it/s] 57%|█████▋    | 179310/313037 [00:25<00:17, 7547.97it/s] 58%|█████▊    | 180244/313037 [00:25<00:16, 8073.22it/s] 58%|█████▊    | 181059/313037 [00:26<00:16, 7867.99it/s] 58%|█████▊    | 181856/313037 [00:26<00:16, 7896.40it/s] 58%|█████▊    | 182650/313037 [00:26<00:22, 5677.98it/s] 59%|█████▊    | 183356/313037 [00:26<00:21, 5997.21it/s] 59%|█████▉    | 184034/313037 [00:26<00:20, 6191.61it/s] 59%|█████▉    | 184790/313037 [00:26<00:19, 6550.06it/s] 59%|█████▉    | 185489/313037 [00:26<00:19, 6574.60it/s] 59%|█████▉    | 186178/313037 [00:26<00:20, 6315.15it/s] 60%|█████▉    | 187127/313037 [00:26<00:17, 7181.19it/s] 60%|██████    | 187870/313037 [00:27<00:17, 7181.70it/s] 60%|██████    | 188659/313037 [00:27<00:16, 7382.73it/s] 61%|██████    | 189411/313037 [00:27<00:16, 7340.84it/s] 61%|██████    | 190155/313037 [00:27<00:16, 7305.01it/s] 61%|██████    | 190944/313037 [00:27<00:16, 7473.92it/s] 61%|██████    | 191699/313037 [00:27<00:16, 7495.47it/s] 61%|██████▏   | 192453/313037 [00:27<00:16, 7358.87it/s] 62%|██████▏   | 193192/313037 [00:27<00:16, 7227.71it/s] 62%|██████▏   | 193927/313037 [00:27<00:16, 7262.40it/s] 62%|██████▏   | 194683/313037 [00:27<00:16, 7349.30it/s] 62%|██████▏   | 195420/313037 [00:28<00:16, 7093.63it/s] 63%|██████▎   | 196132/313037 [00:28<00:16, 7066.77it/s] 63%|██████▎   | 196841/313037 [00:28<00:26, 4382.64it/s] 63%|██████▎   | 197620/313037 [00:28<00:22, 5080.55it/s] 63%|██████▎   | 198452/313037 [00:28<00:19, 5814.16it/s] 64%|██████▎   | 199215/313037 [00:28<00:18, 6256.56it/s] 64%|██████▍   | 199935/313037 [00:28<00:17, 6499.08it/s] 64%|██████▍   | 200649/313037 [00:29<00:17, 6557.34it/s] 64%|██████▍   | 201403/313037 [00:29<00:16, 6826.23it/s] 65%|██████▍   | 202126/313037 [00:29<00:15, 6939.59it/s] 65%|██████▍   | 202845/313037 [00:29<00:15, 6900.82it/s] 65%|██████▌   | 203652/313037 [00:29<00:15, 7235.07it/s] 65%|██████▌   | 204389/313037 [00:29<00:15, 6987.04it/s] 66%|██████▌   | 205168/313037 [00:29<00:14, 7215.41it/s] 66%|██████▌   | 205899/313037 [00:29<00:15, 6939.70it/s] 66%|██████▌   | 206601/313037 [00:29<00:15, 6796.02it/s] 66%|██████▌   | 207287/313037 [00:29<00:16, 6563.13it/s] 66%|██████▋   | 207948/313037 [00:30<00:16, 6430.84it/s] 67%|██████▋   | 208595/313037 [00:30<00:16, 6242.92it/s] 67%|██████▋   | 209222/313037 [00:30<00:18, 5707.11it/s] 67%|██████▋   | 209802/313037 [00:30<00:18, 5716.46it/s] 67%|██████▋   | 210539/313037 [00:30<00:16, 6171.61it/s] 68%|██████▊   | 211320/313037 [00:30<00:15, 6634.55it/s] 68%|██████▊   | 212071/313037 [00:30<00:14, 6885.44it/s] 68%|██████▊   | 212857/313037 [00:30<00:13, 7167.92it/s] 68%|██████▊   | 213687/313037 [00:30<00:13, 7500.02it/s] 69%|██████▊   | 214442/313037 [00:31<00:13, 7484.33it/s] 69%|██████▊   | 215194/313037 [00:31<00:13, 7414.75it/s] 69%|██████▉   | 216103/313037 [00:31<00:12, 7907.16it/s] 69%|██████▉   | 216897/313037 [00:31<00:12, 7777.21it/s] 70%|██████▉   | 217696/313037 [00:31<00:12, 7839.39it/s] 70%|██████▉   | 218622/313037 [00:31<00:11, 8259.25it/s] 70%|███████   | 219514/313037 [00:31<00:11, 8452.97it/s] 70%|███████   | 220361/313037 [00:31<00:11, 8371.53it/s] 71%|███████   | 221200/313037 [00:31<00:11, 8307.96it/s] 71%|███████   | 222076/313037 [00:31<00:10, 8441.47it/s] 71%|███████   | 222921/313037 [00:32<00:11, 8091.60it/s] 72%|███████▏  | 223855/313037 [00:32<00:10, 8452.22it/s] 72%|███████▏  | 224704/313037 [00:32<00:10, 8236.58it/s] 72%|███████▏  | 225532/313037 [00:32<00:10, 8165.16it/s] 72%|███████▏  | 226351/313037 [00:32<00:10, 8089.24it/s] 73%|███████▎  | 227162/313037 [00:32<00:11, 7746.61it/s] 73%|███████▎  | 227954/313037 [00:32<00:10, 7794.76it/s] 73%|███████▎  | 228879/313037 [00:32<00:10, 8214.63it/s] 73%|███████▎  | 229704/313037 [00:32<00:10, 8158.29it/s] 74%|███████▎  | 230523/313037 [00:33<00:10, 7900.33it/s] 74%|███████▍  | 231431/313037 [00:33<00:09, 8238.53it/s] 74%|███████▍  | 232259/313037 [00:33<00:10, 7904.34it/s] 74%|███████▍  | 233105/313037 [00:33<00:09, 8062.47it/s] 75%|███████▍  | 233916/313037 [00:33<00:10, 7563.53it/s] 75%|███████▍  | 234681/313037 [00:33<00:10, 7469.11it/s] 75%|███████▌  | 235434/313037 [00:33<00:10, 7450.83it/s] 75%|███████▌  | 236271/313037 [00:33<00:09, 7712.32it/s] 76%|███████▌  | 237047/313037 [00:33<00:10, 7519.63it/s] 76%|███████▌  | 237803/313037 [00:33<00:10, 7357.72it/s] 76%|███████▌  | 238542/313037 [00:34<00:10, 7083.79it/s] 76%|███████▋  | 239254/313037 [00:34<00:10, 7090.85it/s] 77%|███████▋  | 240035/313037 [00:34<00:10, 7296.50it/s] 77%|███████▋  | 240950/313037 [00:34<00:09, 7834.28it/s] 77%|███████▋  | 241737/313037 [00:34<00:09, 7696.88it/s] 77%|███████▋  | 242510/313037 [00:34<00:09, 7685.95it/s] 78%|███████▊  | 243281/313037 [00:34<00:09, 7563.98it/s] 78%|███████▊  | 244039/313037 [00:34<00:09, 7555.45it/s] 78%|███████▊  | 244796/313037 [00:34<00:09, 7503.43it/s] 78%|███████▊  | 245676/313037 [00:35<00:08, 7882.16it/s] 79%|███████▉  | 246558/313037 [00:35<00:08, 8159.42it/s] 79%|███████▉  | 247416/313037 [00:35<00:07, 8282.46it/s] 79%|███████▉  | 248246/313037 [00:35<00:07, 8169.85it/s] 80%|███████▉  | 249064/313037 [00:35<00:08, 7638.90it/s] 80%|███████▉  | 249836/313037 [00:35<00:08, 7509.26it/s] 80%|████████  | 250592/313037 [00:35<00:08, 7299.12it/s] 80%|████████  | 251405/313037 [00:35<00:08, 7533.53it/s] 81%|████████  | 252163/313037 [00:35<00:08, 7329.76it/s] 81%|████████  | 252900/313037 [00:35<00:08, 7221.36it/s] 81%|████████  | 253625/313037 [00:36<00:08, 7094.27it/s] 81%|████████  | 254338/313037 [00:36<00:08, 7103.46it/s] 81%|████████▏ | 255096/313037 [00:36<00:08, 7241.26it/s] 82%|████████▏ | 255888/313037 [00:36<00:07, 7438.79it/s] 82%|████████▏ | 256634/313037 [00:36<00:07, 7416.60it/s] 82%|████████▏ | 257406/313037 [00:36<00:07, 7504.19it/s] 82%|████████▏ | 258172/313037 [00:36<00:07, 7548.73it/s] 83%|████████▎ | 258928/313037 [00:36<00:07, 7498.56it/s] 83%|████████▎ | 259793/313037 [00:36<00:06, 7838.90it/s] 83%|████████▎ | 260599/313037 [00:36<00:06, 7904.51it/s] 84%|████████▎ | 261390/313037 [00:37<00:06, 7678.51it/s] 84%|████████▍ | 262238/313037 [00:37<00:06, 7911.72it/s] 84%|████████▍ | 263034/313037 [00:37<00:06, 7923.16it/s] 84%|████████▍ | 263828/313037 [00:37<00:06, 7603.72it/s] 85%|████████▍ | 264592/313037 [00:37<00:06, 7323.46it/s] 85%|████████▍ | 265329/313037 [00:37<00:06, 7033.72it/s] 85%|████████▍ | 266037/313037 [00:37<00:06, 6901.77it/s] 85%|████████▌ | 266760/313037 [00:37<00:06, 6992.93it/s] 85%|████████▌ | 267502/313037 [00:37<00:06, 7113.57it/s] 86%|████████▌ | 268221/313037 [00:38<00:06, 7134.75it/s] 86%|████████▌ | 268937/313037 [00:38<00:06, 7123.20it/s] 86%|████████▌ | 269651/313037 [00:38<00:06, 6958.56it/s] 86%|████████▋ | 270349/313037 [00:38<00:06, 6870.70it/s] 87%|████████▋ | 271096/313037 [00:38<00:05, 7043.97it/s] 87%|████████▋ | 271802/313037 [00:38<00:05, 6968.72it/s] 87%|████████▋ | 272500/313037 [00:38<00:06, 6703.76it/s] 87%|████████▋ | 273287/313037 [00:38<00:05, 7036.44it/s] 88%|████████▊ | 274015/313037 [00:38<00:05, 7107.17it/s] 88%|████████▊ | 274749/313037 [00:38<00:05, 7174.49it/s] 88%|████████▊ | 275469/313037 [00:39<00:05, 7162.96it/s] 88%|████████▊ | 276206/313037 [00:39<00:05, 7223.26it/s] 88%|████████▊ | 276930/313037 [00:39<00:05, 7167.66it/s] 89%|████████▊ | 277648/313037 [00:39<00:05, 7039.15it/s] 89%|████████▉ | 278353/313037 [00:39<00:04, 6987.40it/s] 89%|████████▉ | 279053/313037 [00:39<00:05, 6754.83it/s] 89%|████████▉ | 279811/313037 [00:39<00:04, 6992.78it/s] 90%|████████▉ | 280554/313037 [00:39<00:04, 7118.95it/s] 90%|████████▉ | 281301/313037 [00:39<00:04, 7222.12it/s] 90%|█████████ | 282025/313037 [00:40<00:04, 7145.18it/s] 90%|█████████ | 282757/313037 [00:40<00:04, 7195.56it/s] 91%|█████████ | 283610/313037 [00:40<00:03, 7590.35it/s] 91%|█████████ | 284371/313037 [00:40<00:03, 7403.12it/s] 91%|█████████ | 285121/313037 [00:40<00:03, 7430.82it/s] 91%|█████████▏| 285913/313037 [00:40<00:03, 7573.05it/s] 92%|█████████▏| 286672/313037 [00:40<00:03, 7534.43it/s] 92%|█████████▏| 287427/313037 [00:40<00:03, 7514.94it/s] 92%|█████████▏| 288258/313037 [00:40<00:03, 7749.07it/s] 92%|█████████▏| 289034/313037 [00:40<00:03, 7658.93it/s] 93%|█████████▎| 289854/313037 [00:41<00:02, 7809.33it/s] 93%|█████████▎| 290697/313037 [00:41<00:02, 7993.22it/s] 93%|█████████▎| 291497/313037 [00:41<00:02, 7524.22it/s] 93%|█████████▎| 292299/313037 [00:41<00:02, 7663.35it/s] 94%|█████████▎| 293118/313037 [00:41<00:02, 7814.93it/s] 94%|█████████▍| 293904/313037 [00:41<00:02, 7546.90it/s] 94%|█████████▍| 294663/313037 [00:41<00:02, 7425.19it/s] 94%|█████████▍| 295409/313037 [00:41<00:02, 7409.87it/s] 95%|█████████▍| 296153/313037 [00:41<00:02, 7313.49it/s] 95%|█████████▍| 296886/313037 [00:41<00:02, 7162.02it/s] 95%|█████████▌| 297682/313037 [00:42<00:02, 7391.02it/s] 95%|█████████▌| 298437/313037 [00:42<00:01, 7436.85it/s] 96%|█████████▌| 299183/313037 [00:42<00:01, 7313.61it/s] 96%|█████████▌| 299916/313037 [00:42<00:01, 7238.59it/s] 96%|█████████▌| 300663/313037 [00:42<00:01, 7306.04it/s] 96%|█████████▋| 301474/313037 [00:42<00:01, 7540.95it/s] 97%|█████████▋| 302230/313037 [00:42<00:01, 7111.21it/s] 97%|█████████▋| 302966/313037 [00:42<00:01, 7180.39it/s] 97%|█████████▋| 303689/313037 [00:42<00:01, 7127.81it/s] 97%|█████████▋| 304413/313037 [00:43<00:01, 7160.17it/s] 98%|█████████▊| 305249/313037 [00:43<00:01, 7509.86it/s] 98%|█████████▊| 306076/313037 [00:43<00:00, 7732.71it/s] 98%|█████████▊| 306866/313037 [00:43<00:00, 7780.44it/s] 98%|█████████▊| 307756/313037 [00:43<00:00, 8112.82it/s] 99%|█████████▊| 308687/313037 [00:43<00:00, 8467.50it/s] 99%|█████████▉| 309535/313037 [00:43<00:00, 8261.96it/s] 99%|█████████▉| 310363/313037 [00:43<00:00, 7886.63it/s] 99%|█████████▉| 311156/313037 [00:43<00:00, 7853.53it/s]100%|█████████▉| 311945/313037 [00:43<00:00, 7841.51it/s]100%|█████████▉| 312732/313037 [00:44<00:00, 7549.10it/s]100%|██████████| 313037/313037 [00:44<00:00, 7097.65it/s]
  0%|          | 0/73 [00:00<?, ?it/s]  1%|▏         | 1/73 [00:00<00:21,  3.29it/s]  3%|▎         | 2/73 [00:00<00:19,  3.72it/s]  4%|▍         | 3/73 [00:00<00:13,  5.15it/s]  5%|▌         | 4/73 [00:00<00:14,  4.73it/s]  7%|▋         | 5/73 [00:01<00:14,  4.63it/s]  8%|▊         | 6/73 [00:01<00:20,  3.30it/s] 10%|▉         | 7/73 [00:01<00:17,  3.67it/s] 11%|█         | 8/73 [00:01<00:14,  4.38it/s] 12%|█▏        | 9/73 [00:02<00:15,  4.15it/s] 14%|█▎        | 10/73 [00:02<00:14,  4.27it/s] 15%|█▌        | 11/73 [00:02<00:14,  4.39it/s] 16%|█▋        | 12/73 [00:02<00:14,  4.27it/s] 18%|█▊        | 13/73 [00:03<00:13,  4.43it/s] 19%|█▉        | 14/73 [00:03<00:13,  4.23it/s] 21%|██        | 15/73 [00:03<00:13,  4.20it/s] 22%|██▏       | 16/73 [00:04<00:17,  3.26it/s] 23%|██▎       | 17/73 [00:04<00:16,  3.38it/s] 25%|██▍       | 18/73 [00:04<00:13,  4.10it/s] 26%|██▌       | 19/73 [00:04<00:12,  4.43it/s] 27%|██▋       | 20/73 [00:05<00:14,  3.72it/s] 29%|██▉       | 21/73 [00:05<00:12,  4.18it/s] 30%|███       | 22/73 [00:05<00:10,  4.78it/s] 32%|███▏      | 23/73 [00:05<00:09,  5.00it/s] 33%|███▎      | 24/73 [00:05<00:09,  4.99it/s] 34%|███▍      | 25/73 [00:05<00:08,  5.78it/s] 36%|███▌      | 26/73 [00:05<00:07,  6.08it/s] 37%|███▋      | 27/73 [00:06<00:08,  5.49it/s] 38%|███▊      | 28/73 [00:09<00:45,  1.02s/it] 40%|███▉      | 29/73 [00:09<00:37,  1.18it/s] 41%|████      | 30/73 [00:09<00:27,  1.57it/s] 42%|████▏     | 31/73 [00:10<00:22,  1.85it/s] 44%|████▍     | 32/73 [00:10<00:17,  2.39it/s] 45%|████▌     | 33/73 [00:10<00:17,  2.26it/s] 47%|████▋     | 34/73 [00:10<00:13,  2.82it/s] 49%|████▉     | 36/73 [00:11<00:11,  3.19it/s] 51%|█████     | 37/73 [00:11<00:09,  3.83it/s] 52%|█████▏    | 38/73 [00:11<00:09,  3.71it/s] 53%|█████▎    | 39/73 [00:12<00:11,  2.97it/s] 55%|█████▍    | 40/73 [00:12<00:12,  2.63it/s] 56%|█████▌    | 41/73 [00:12<00:10,  3.03it/s] 58%|█████▊    | 42/73 [00:13<00:09,  3.27it/s] 59%|█████▉    | 43/73 [00:13<00:08,  3.66it/s] 60%|██████    | 44/73 [00:13<00:06,  4.20it/s] 62%|██████▏   | 45/73 [00:13<00:06,  4.31it/s] 63%|██████▎   | 46/73 [00:14<00:06,  4.34it/s] 64%|██████▍   | 47/73 [00:14<00:07,  3.38it/s] 66%|██████▌   | 48/73 [00:14<00:07,  3.32it/s] 67%|██████▋   | 49/73 [00:15<00:07,  3.40it/s] 68%|██████▊   | 50/73 [00:15<00:06,  3.81it/s] 70%|██████▉   | 51/73 [00:15<00:05,  4.18it/s] 71%|███████   | 52/73 [00:15<00:04,  4.55it/s] 73%|███████▎  | 53/73 [00:15<00:05,  3.95it/s] 74%|███████▍  | 54/73 [00:16<00:04,  4.53it/s] 75%|███████▌  | 55/73 [00:16<00:03,  4.79it/s] 78%|███████▊  | 57/73 [00:16<00:02,  6.16it/s] 79%|███████▉  | 58/73 [00:16<00:02,  6.76it/s] 81%|████████  | 59/73 [00:16<00:02,  6.45it/s] 82%|████████▏ | 60/73 [00:16<00:01,  6.87it/s] 84%|████████▎ | 61/73 [00:17<00:02,  4.09it/s] 85%|████████▍ | 62/73 [00:17<00:02,  4.26it/s] 86%|████████▋ | 63/73 [00:17<00:02,  4.03it/s] 88%|████████▊ | 64/73 [00:18<00:02,  4.40it/s] 90%|█████████ | 66/73 [00:18<00:01,  5.99it/s] 92%|█████████▏| 67/73 [00:18<00:00,  6.52it/s] 93%|█████████▎| 68/73 [00:18<00:00,  6.88it/s] 95%|█████████▍| 69/73 [00:18<00:00,  5.44it/s] 96%|█████████▌| 70/73 [00:18<00:00,  6.11it/s] 97%|█████████▋| 71/73 [00:19<00:00,  5.88it/s] 99%|█████████▊| 72/73 [00:19<00:00,  6.40it/s]100%|██████████| 73/73 [00:19<00:00,  7.04it/s]100%|██████████| 73/73 [00:19<00:00,  3.78it/s]
  0%|          | 0/73 [00:00<?, ?it/s]  1%|▏         | 1/73 [00:04<05:03,  4.22s/it]  3%|▎         | 2/73 [00:05<02:49,  2.38s/it]  4%|▍         | 3/73 [00:05<01:44,  1.49s/it]  5%|▌         | 4/73 [00:09<02:55,  2.54s/it]  7%|▋         | 5/73 [00:10<01:58,  1.75s/it]  8%|▊         | 6/73 [00:11<01:39,  1.49s/it] 10%|▉         | 7/73 [00:11<01:11,  1.08s/it] 11%|█         | 8/73 [00:11<00:51,  1.26it/s] 12%|█▏        | 9/73 [00:12<00:47,  1.35it/s] 14%|█▎        | 10/73 [00:13<00:47,  1.33it/s] 15%|█▌        | 11/73 [00:15<01:09,  1.12s/it] 16%|█▋        | 12/73 [00:16<01:08,  1.12s/it] 18%|█▊        | 13/73 [00:16<01:02,  1.04s/it] 19%|█▉        | 14/73 [00:17<00:48,  1.22it/s] 21%|██        | 15/73 [00:18<00:45,  1.26it/s] 22%|██▏       | 16/73 [00:18<00:36,  1.57it/s] 23%|██▎       | 17/73 [00:18<00:32,  1.72it/s] 25%|██▍       | 18/73 [00:19<00:41,  1.32it/s] 26%|██▌       | 19/73 [00:20<00:36,  1.49it/s] 27%|██▋       | 20/73 [00:21<00:36,  1.45it/s] 29%|██▉       | 21/73 [00:22<00:39,  1.33it/s] 30%|███       | 22/73 [00:22<00:31,  1.61it/s] 32%|███▏      | 23/73 [00:22<00:28,  1.78it/s] 33%|███▎      | 24/73 [00:23<00:23,  2.11it/s] 34%|███▍      | 25/73 [00:23<00:19,  2.40it/s] 36%|███▌      | 26/73 [00:23<00:18,  2.59it/s] 37%|███▋      | 27/73 [00:24<00:22,  2.05it/s] 38%|███▊      | 28/73 [00:24<00:19,  2.26it/s] 40%|███▉      | 29/73 [00:25<00:19,  2.30it/s] 41%|████      | 30/73 [00:25<00:17,  2.40it/s] 42%|████▏     | 31/73 [00:25<00:17,  2.35it/s] 44%|████▍     | 32/73 [00:26<00:15,  2.60it/s] 45%|████▌     | 33/73 [00:26<00:18,  2.14it/s] 47%|████▋     | 34/73 [00:27<00:17,  2.29it/s] 48%|████▊     | 35/73 [00:27<00:14,  2.63it/s] 49%|████▉     | 36/73 [00:28<00:20,  1.79it/s] 51%|█████     | 37/73 [00:29<00:22,  1.63it/s] 52%|█████▏    | 38/73 [00:30<00:24,  1.41it/s] 53%|█████▎    | 39/73 [00:30<00:23,  1.44it/s] 55%|█████▍    | 40/73 [00:31<00:23,  1.39it/s] 56%|█████▌    | 41/73 [00:32<00:21,  1.47it/s] 58%|█████▊    | 42/73 [00:32<00:19,  1.56it/s] 59%|█████▉    | 43/73 [00:33<00:18,  1.58it/s] 60%|██████    | 44/73 [00:33<00:17,  1.69it/s] 62%|██████▏   | 45/73 [00:34<00:17,  1.59it/s] 63%|██████▎   | 46/73 [00:35<00:18,  1.47it/s] 64%|██████▍   | 47/73 [00:36<00:17,  1.46it/s] 66%|██████▌   | 48/73 [00:36<00:15,  1.62it/s] 67%|██████▋   | 49/73 [00:36<00:13,  1.77it/s] 68%|██████▊   | 50/73 [00:37<00:13,  1.69it/s] 70%|██████▉   | 51/73 [00:38<00:13,  1.66it/s] 71%|███████   | 52/73 [00:38<00:13,  1.61it/s] 73%|███████▎  | 53/73 [00:39<00:14,  1.37it/s] 74%|███████▍  | 54/73 [00:40<00:12,  1.57it/s] 75%|███████▌  | 55/73 [00:40<00:10,  1.73it/s] 77%|███████▋  | 56/73 [00:41<00:08,  2.02it/s] 78%|███████▊  | 57/73 [00:41<00:07,  2.18it/s] 79%|███████▉  | 58/73 [00:41<00:07,  2.07it/s] 81%|████████  | 59/73 [00:42<00:07,  1.77it/s] 82%|████████▏ | 60/73 [00:43<00:08,  1.60it/s] 84%|████████▎ | 61/73 [00:52<00:36,  3.05s/it] 85%|████████▍ | 62/73 [00:53<00:26,  2.39s/it] 86%|████████▋ | 63/73 [00:54<00:20,  2.08s/it] 88%|████████▊ | 64/73 [00:55<00:16,  1.87s/it] 89%|████████▉ | 65/73 [00:56<00:12,  1.52s/it] 90%|█████████ | 66/73 [00:57<00:09,  1.29s/it] 92%|█████████▏| 67/73 [00:58<00:07,  1.21s/it] 93%|█████████▎| 68/73 [00:59<00:06,  1.25s/it] 95%|█████████▍| 69/73 [01:01<00:05,  1.43s/it] 96%|█████████▌| 70/73 [01:01<00:03,  1.13s/it] 97%|█████████▋| 71/73 [01:02<00:01,  1.06it/s] 99%|█████████▊| 72/73 [01:02<00:00,  1.31it/s]100%|██████████| 73/73 [01:03<00:00,  1.36it/s]100%|██████████| 73/73 [01:03<00:00,  1.15it/s]
  0%|          | 0/73 [00:00<?, ?it/s]  1%|▏         | 1/73 [00:00<00:20,  3.54it/s]  3%|▎         | 2/73 [00:00<00:24,  2.90it/s]  4%|▍         | 3/73 [00:00<00:18,  3.84it/s]  5%|▌         | 4/73 [00:01<00:18,  3.81it/s]  7%|▋         | 5/73 [00:01<00:16,  4.16it/s]  8%|▊         | 6/73 [00:01<00:19,  3.41it/s] 10%|▉         | 7/73 [00:02<00:21,  3.03it/s] 11%|█         | 8/73 [00:02<00:21,  3.01it/s] 12%|█▏        | 9/73 [00:02<00:18,  3.53it/s] 14%|█▎        | 10/73 [00:02<00:16,  3.81it/s] 15%|█▌        | 11/73 [00:02<00:14,  4.35it/s] 16%|█▋        | 12/73 [00:03<00:15,  3.85it/s] 18%|█▊        | 13/73 [00:03<00:14,  4.12it/s] 19%|█▉        | 14/73 [00:03<00:15,  3.91it/s] 21%|██        | 15/73 [00:03<00:12,  4.57it/s] 22%|██▏       | 16/73 [00:04<00:20,  2.73it/s] 23%|██▎       | 17/73 [00:04<00:17,  3.28it/s] 25%|██▍       | 18/73 [00:05<00:18,  3.00it/s] 26%|██▌       | 19/73 [00:05<00:16,  3.21it/s] 27%|██▋       | 20/73 [00:05<00:15,  3.50it/s] 29%|██▉       | 21/73 [00:06<00:18,  2.78it/s] 30%|███       | 22/73 [00:06<00:14,  3.42it/s] 32%|███▏      | 23/73 [00:06<00:11,  4.20it/s] 33%|███▎      | 24/73 [00:06<00:13,  3.75it/s] 34%|███▍      | 25/73 [00:07<00:16,  2.93it/s] 36%|███▌      | 26/73 [00:07<00:15,  3.02it/s] 37%|███▋      | 27/73 [00:07<00:14,  3.14it/s] 38%|███▊      | 28/73 [00:08<00:15,  2.83it/s] 40%|███▉      | 29/73 [00:08<00:13,  3.27it/s] 41%|████      | 30/73 [00:08<00:11,  3.79it/s] 42%|████▏     | 31/73 [00:08<00:09,  4.24it/s] 44%|████▍     | 32/73 [00:09<00:10,  4.00it/s] 45%|████▌     | 33/73 [00:09<00:10,  3.78it/s] 47%|████▋     | 34/73 [00:10<00:16,  2.31it/s] 48%|████▊     | 35/73 [00:10<00:15,  2.47it/s] 49%|████▉     | 36/73 [00:10<00:13,  2.78it/s] 51%|█████     | 37/73 [00:11<00:11,  3.14it/s] 52%|█████▏    | 38/73 [00:11<00:10,  3.41it/s] 53%|█████▎    | 39/73 [00:11<00:12,  2.77it/s] 55%|█████▍    | 40/73 [00:12<00:13,  2.39it/s] 56%|█████▌    | 41/73 [00:12<00:10,  2.92it/s] 58%|█████▊    | 42/73 [00:12<00:10,  2.88it/s] 59%|█████▉    | 43/73 [00:13<00:09,  3.05it/s] 60%|██████    | 44/73 [00:13<00:09,  3.21it/s] 62%|██████▏   | 45/73 [00:13<00:09,  3.02it/s] 63%|██████▎   | 46/73 [00:14<00:09,  3.00it/s] 64%|██████▍   | 47/73 [00:14<00:07,  3.32it/s] 66%|██████▌   | 48/73 [00:14<00:06,  3.94it/s] 67%|██████▋   | 49/73 [00:14<00:06,  3.70it/s] 68%|██████▊   | 50/73 [00:15<00:06,  3.62it/s] 70%|██████▉   | 51/73 [00:15<00:05,  4.30it/s] 71%|███████   | 52/73 [00:15<00:06,  3.33it/s] 73%|███████▎  | 53/73 [00:16<00:06,  3.09it/s] 74%|███████▍  | 54/73 [00:16<00:05,  3.72it/s] 75%|███████▌  | 55/73 [00:16<00:04,  4.12it/s] 77%|███████▋  | 56/73 [00:16<00:03,  4.35it/s] 78%|███████▊  | 57/73 [00:16<00:03,  4.17it/s] 79%|███████▉  | 58/73 [00:17<00:03,  4.42it/s] 81%|████████  | 59/73 [00:17<00:03,  3.65it/s] 82%|████████▏ | 60/73 [00:17<00:03,  4.02it/s] 84%|████████▎ | 61/73 [00:18<00:03,  3.14it/s] 86%|████████▋ | 63/73 [00:18<00:02,  4.25it/s] 88%|████████▊ | 64/73 [00:18<00:02,  3.44it/s] 89%|████████▉ | 65/73 [00:19<00:02,  3.69it/s] 90%|█████████ | 66/73 [00:19<00:01,  3.74it/s] 92%|█████████▏| 67/73 [00:19<00:01,  3.56it/s] 93%|█████████▎| 68/73 [00:19<00:01,  4.00it/s] 95%|█████████▍| 69/73 [00:20<00:01,  3.97it/s] 96%|█████████▌| 70/73 [00:20<00:00,  3.83it/s] 97%|█████████▋| 71/73 [00:20<00:00,  3.61it/s] 99%|█████████▊| 72/73 [00:21<00:00,  3.58it/s]100%|██████████| 73/73 [00:21<00:00,  4.20it/s]100%|██████████| 73/73 [00:21<00:00,  3.45it/s]
/home/astro/cretigni/anaconda3/lib/python3.8/site-packages/numpy/lib/nanfunctions.py:1111: RuntimeWarning: Mean of empty slice
  return np.nanmean(a, axis, out=out, keepdims=keepdims)
  0%|          | 0/73 [00:00<?, ?it/s]  1%|▏         | 1/73 [00:00<00:35,  2.02it/s]  3%|▎         | 2/73 [00:00<00:32,  2.16it/s]  4%|▍         | 3/73 [00:01<00:30,  2.31it/s]  5%|▌         | 4/73 [00:01<00:34,  2.03it/s]  7%|▋         | 5/73 [00:02<00:29,  2.34it/s]  8%|▊         | 6/73 [00:02<00:29,  2.27it/s] 10%|▉         | 7/73 [00:03<00:39,  1.67it/s] 11%|█         | 8/73 [00:05<00:56,  1.14it/s] 12%|█▏        | 9/73 [00:05<00:48,  1.33it/s] 14%|█▎        | 10/73 [00:06<00:45,  1.37it/s] 15%|█▌        | 11/73 [00:06<00:37,  1.67it/s] 16%|█▋        | 12/73 [00:07<00:34,  1.79it/s] 18%|█▊        | 13/73 [00:07<00:37,  1.59it/s] 19%|█▉        | 14/73 [00:08<00:34,  1.70it/s] 21%|██        | 15/73 [00:08<00:35,  1.64it/s] 22%|██▏       | 16/73 [00:09<00:29,  1.92it/s] 23%|██▎       | 17/73 [00:10<00:36,  1.54it/s] 25%|██▍       | 18/73 [00:11<00:39,  1.38it/s] 26%|██▌       | 19/73 [00:11<00:34,  1.57it/s] 27%|██▋       | 20/73 [00:11<00:30,  1.74it/s] 29%|██▉       | 21/73 [00:12<00:30,  1.72it/s] 30%|███       | 22/73 [00:13<00:28,  1.79it/s] 32%|███▏      | 23/73 [00:13<00:25,  1.94it/s] 33%|███▎      | 24/73 [00:14<00:24,  1.96it/s] 34%|███▍      | 25/73 [00:14<00:31,  1.53it/s] 36%|███▌      | 26/73 [00:15<00:28,  1.68it/s] 37%|███▋      | 27/73 [00:15<00:22,  2.08it/s] 38%|███▊      | 28/73 [00:16<00:32,  1.39it/s] 40%|███▉      | 29/73 [00:18<00:41,  1.05it/s] 41%|████      | 30/73 [00:19<00:39,  1.08it/s] 42%|████▏     | 31/73 [00:22<01:06,  1.59s/it] 44%|████▍     | 32/73 [00:24<01:05,  1.60s/it] 45%|████▌     | 33/73 [00:27<01:20,  2.01s/it] 47%|████▋     | 34/73 [00:27<01:02,  1.60s/it] 48%|████▊     | 35/73 [00:27<00:45,  1.21s/it] 49%|████▉     | 36/73 [00:28<00:39,  1.07s/it] 51%|█████     | 37/73 [00:29<00:31,  1.13it/s] 52%|█████▏    | 38/73 [00:30<00:36,  1.04s/it] 53%|█████▎    | 39/73 [00:31<00:32,  1.03it/s] 55%|█████▍    | 40/73 [00:32<00:37,  1.14s/it] 56%|█████▌    | 41/73 [00:33<00:32,  1.00s/it] 58%|█████▊    | 42/73 [00:34<00:25,  1.19it/s] 59%|█████▉    | 43/73 [00:34<00:21,  1.43it/s] 60%|██████    | 44/73 [00:35<00:23,  1.25it/s] 62%|██████▏   | 45/73 [00:35<00:20,  1.40it/s] 63%|██████▎   | 46/73 [00:36<00:17,  1.51it/s] 64%|██████▍   | 47/73 [00:36<00:15,  1.72it/s] 66%|██████▌   | 48/73 [00:37<00:14,  1.78it/s] 67%|██████▋   | 49/73 [00:38<00:13,  1.73it/s] 68%|██████▊   | 50/73 [00:38<00:12,  1.80it/s] 70%|██████▉   | 51/73 [00:38<00:10,  2.00it/s] 71%|███████   | 52/73 [00:39<00:11,  1.79it/s] 73%|███████▎  | 53/73 [00:40<00:15,  1.27it/s] 74%|███████▍  | 54/73 [00:41<00:14,  1.33it/s] 75%|███████▌  | 55/73 [00:42<00:11,  1.51it/s] 77%|███████▋  | 56/73 [00:42<00:08,  2.00it/s] 78%|███████▊  | 57/73 [00:42<00:08,  1.96it/s] 79%|███████▉  | 58/73 [00:43<00:08,  1.80it/s] 81%|████████  | 59/73 [00:43<00:07,  1.81it/s] 82%|████████▏ | 60/73 [00:44<00:06,  2.05it/s] 84%|████████▎ | 61/73 [00:45<00:07,  1.64it/s] 85%|████████▍ | 62/73 [00:45<00:06,  1.68it/s] 86%|████████▋ | 63/73 [00:46<00:06,  1.52it/s] 88%|████████▊ | 64/73 [00:46<00:05,  1.68it/s] 89%|████████▉ | 65/73 [00:47<00:04,  1.80it/s] 90%|█████████ | 66/73 [00:48<00:05,  1.25it/s] 92%|█████████▏| 67/73 [00:49<00:04,  1.29it/s] 93%|█████████▎| 68/73 [00:51<00:06,  1.24s/it] 95%|█████████▍| 69/73 [00:52<00:04,  1.01s/it] 96%|█████████▌| 70/73 [00:52<00:02,  1.30it/s] 97%|█████████▋| 71/73 [00:53<00:01,  1.20it/s] 99%|█████████▊| 72/73 [00:53<00:00,  1.45it/s]100%|██████████| 73/73 [00:54<00:00,  1.64it/s]100%|██████████| 73/73 [00:54<00:00,  1.35it/s]
Traceback (most recent call last):
  File "trigger_yarara_harps03.py", line 371, in <module>
    sts.import_drift_night(ins,bin_length=bin_length, drs_version=drs_version)
  File "/hpcstorage/cretigni/Python/my_rassine_tools.py", line 1129, in import_drift_night
    drift.night_stack(replace=True, db=db, bin_length=bin_length)
  File "/hpcstorage/cretigni/Python/my_classes.py", line 6879, in night_stack
    groups -= groups[0]
IndexError: index 0 is out of bounds for axis 0 with size 0
