------------------------
 STAR LOADED : HD110315 
------------------------

 [INFO] Complete analysis HARPN with reference spectrum launched...



LLLLLLLLLLLLLLLLLLLLLLLLLLLLLLLLLLLLLLLLLLLLLLLL

---- RECIPE : ACTIVITY PROXIES EXTRACTION ----

TTTTTTTTTTTTTTTTTTTTTTTTTTTTTTTTTTTTTTTTTTTTTTTT



 Saving activity proxies...

 [INFO] Summary table updated


LLLLLLLLLLLLLLLLLLLLLLLLLLLLLLLLLLLLLLLL

---- RECIPE : WB PROXY EXTRACTION ----

TTTTTTTTTTTTTTTTTTTTTTTTTTTTTTTTTTTTTTTT



Optimization on CaII H&K

Best Window for extraction : 0.25 AA

Best window for the core : 14 pixels

 [INFO] Summary table updated

 [INFO] RV range updated to : 16.0 kms

 [INFO] RV borders updated to : 11.0 kms

 [INFO] Nb lines in the CCF mask : 2372

 [INFO] CCF mask selected : /hpcstorage/cretigni/Yarara/HD110315/data/s1d/HARPN/KITCAT/kitcat_cleaned_mask_HD110315.p 


 [INFO] RV sys : 24.41 [km/s] 


 [INFO] Nb lines in the mask : 2372 


 [INFO] Percentage of the spectrum used : 46.6 [%] (292142) 


 [INFO] CCF mask found : /hpcstorage/cretigni/Yarara/HD110315/data/s1d/HARPN/CCF_MASK/CCF_kitcat_cleaned_mask_HD110315.fits

 Computing CCF (Current time 13h26m10s) 



 CCF computed (Current time 13h26m35s) 

 [INFO] SNR CCF continuum median : 5232

 [INFO] Photon noise RV median : 0.37 m/s
 
 [INFO] Photon noise RV from calibration : 0.31 m/s
 

 [INFO] Summary table updated

 [INFO] Summary table updated

 [INFO] Summary table updated

 [INFO] Summary table updated

 [INFO] Summary table updated


LLLLLLLLLLLLLLLLLLLLLLLLLLLLLLLLLLLLLLLLLLLL

---- RECIPE : KDE SPECTRUM EXTRACTION ----

TTTTTTTTTTTTTTTTTTTTTTTTTTTTTTTTTTTTTTTTTTTT




LLLLLLLLLLLLLLLLLLLLLLLLLLLLLLLLLLLLLLLL

---- RECIPE : CB PROXY EXTRACTION ----

TTTTTTTTTTTTTTTTTTTTTTTTTTTTTTTTTTTTTTTT



 [INFO] Dictionnary selected for CCF proxy : matching_pca

 [INFO] Mask selected for CCF proxy : CCF_G2

----------
sigma kde 1 : 1.5, sigma kde 2 : 2.5 

----------

A_left : 6284 (4)
A_right : 6587 (4)
B_left : 14319 (10)
B_right : 14283 (10)
Rms : 1.73 m/s
R_pearson (RV|CaII|WB) : -0.01 | -0.00 | 0.08

 [INFO] Summary table updated

 [INFO] Dictionnary selected for CCF proxy : matching_pca

 [INFO] Mask selected for CCF proxy : CCF_G2

 [INFO] Wavelength cut below 3805.00

 [INFO] Wavelength cut above 6834.00

 [INFO] Percentage of the spectrum used = 43%

 [INFO] Summary table updated

 [INFO] Dictionnary selected for CCF proxy : matching_pca

 [INFO] Mask selected for CCF proxy : CCF_G2
 [INFO] Dico selected matching_smooth 

---- DICO matching_mad used ----

YARARA will be launched with the star : HD110315
The reduction is finished !
SUCESS COMPUTING RV FOR ALL LINES
