
[INFO] Parameters used : star(HD110315), instrument(HARPN), sig_clipping(3.0), DRS(new)
------------------------------------------------
 STAR LOADED FROM DACE : HD110315 (HARPN)
------------------------------------------------
 Total number of files found : 74
 K-IQ clipping will be performed with k = 3.0
 [INFO] 67 spectrum selected as valid on the pool of 74 spectra
 [INFO] 44 days of observations (67) for the star : HD110315
 [INFO] BERV span of 57.1 km/s for the star : HD110315
 [WARNING] RV span too large (binary?,large amplitude planet?, transit?) for the star : HD110315, current value of 101.5 m/s
 [INFO] 0 file(s) not found on the pool of 67 files
 [INFO] 67 file(s) can be reduced in the pipeline
 python produce_dace_summary.py -s HD110315 -i HARPN -c 3.0 -D new -f 0 -o 1 

[33m [WARNING] RV span too large (binary?,large amplitude planet?, transit?), get a look on the model selected (2) : current value of 101.0 m/s[37m

 [ERROR] No files found
[31m ==============================================================================
 [INFO] Intermediate time : 0h 0m 59s 
 ==============================================================================
[37m
 Number of files to preprocess 67
[INFO] DACE table has been found. Reduction will run with it.
[INFO] DACE table has been found. Reduction will run with it.
[INFO] DACE table has been found. Reduction will run with it.
[INFO] DACE table has been found. Reduction will run with it.
[INFO] DACE table has been found. Reduction will run with it.
[INFO] DACE table has been found. Reduction will run with it.
 Number of files to match 67
Loading the data, wait... 

 [INFO] Number of files processed : 00/67 (0.0 %)

 [INFO] Spectra borders are found between : 3874.4544 and 6908.6945
Extraction of the new spectra, wait... 


 [BEGIN] RASSINE is beginning the reduction

 Computation of the local maxima : LOADING
 Spectrum SNR at 5500 : 1573
 Number of cosmic peaks removed : 1
 Number of cosmic peaks removed : 0
 [AUTO] FWHM computed from the CCF is about : 5.46 [km/s]
 Number of cosmic peaks removed : 3
 Suggestion of a streching parameter to try : 12 +/- 3
 [AUTO] par_stretching fixed : 11.75
 Computation of the local maxima : DONE
 Time of the step : 4.46

 Computation of the penality map : LOADING
 [AUTO] R fixed : 3.0
 [AUTO] Rmax found around 4227 AA and fixed : 62
 Computation of the penality map : DONE
 Time of the step : 4.53

 Rolling pin is rolling : LOADING
 Rolling pin is rolling : DONE
 Time of the step : 0.50

 Edge cutting : LOADING
 Edge cutting : DONE
 Time of the step : 0.00

 Outliers removing : LOADING
 Outliers removing : DONE
 Time of the step : 0.00
 Number of points removed to build a more equidistant grid : 23

 [END] RASSINE has finished to compute your continuum in 9.51 seconds 


------TABLE------- 

number_iteration : 0
K_factors : []
par_stretching : 11.7
par_vicinity : 7
par_smoothing_box : 6
par_smoothing_kernel : savgol
par_fwhm : 5.46
CCF_mask : master
RV_sys : 24.4161881762796
par_R : 3.0
par_Rmax : 62.0
par_reg_nu : poly_1.0
denoising_dist : 5
count_cut_lim : 3
float_precision : float32
windows_penality : 10.0
large_window_penality : 100.0
number of points : 303425
number of anchors : 575
SNR_5500 : 1573
mjd : 0
jdb : 0
wave_min : 3874.45441492
wave_max : 6908.694414920001
dwave : 0.010000000000218279
hole_left : -99.9
hole_right : -99.9
RV_shift : 0
berv : 3.4751519387720635
lamp_offset : 0
acc_sec : 0
light_file : True
speedup : 1
continuum_interpolated_saved : linear
continuum_denoised_saved : undenoised
nb_spectra_stacked : 67
arcfiles : none

----------------- 

Ouput file saved under : /hpcstorage/cretigni/Yarara/HD110315/data/s1d/HARPN/MASTER/RASSINE_Master_spectrum_2021-08-06T12:00:17.p (SNR at 5500 : 1573)
 Number of files to reduce 44
Ouput file saved under : /hpcstorage/cretigni/Yarara/HD110315/data/s1d/HARPN/STACKED/RASSINE_Stacked_spectrum_bin_1.2012-12-07T06:07:06.519.p (SNR at 5500 : 214)
Ouput file saved under : /hpcstorage/cretigni/Yarara/HD110315/data/s1d/HARPN/STACKED/RASSINE_Stacked_spectrum_bin_1.2012-12-25T05:38:27.304.p (SNR at 5500 : 274)
Ouput file saved under : /hpcstorage/cretigni/Yarara/HD110315/data/s1d/HARPN/STACKED/RASSINE_Stacked_spectrum_bin_1.2013-01-14T06:09:18.317.p (SNR at 5500 : 276)
Ouput file saved under : /hpcstorage/cretigni/Yarara/HD110315/data/s1d/HARPN/STACKED/RASSINE_Stacked_spectrum_bin_1.2013-01-15T05:30:06.996.p (SNR at 5500 : 264)
Ouput file saved under : /hpcstorage/cretigni/Yarara/HD110315/data/s1d/HARPN/STACKED/RASSINE_Stacked_spectrum_bin_1.2013-01-16T05:26:33.286.p (SNR at 5500 : 313)
Ouput file saved under : /hpcstorage/cretigni/Yarara/HD110315/data/s1d/HARPN/STACKED/RASSINE_Stacked_spectrum_bin_1.2013-01-17T05:34:56.244.p (SNR at 5500 : 331)
Ouput file saved under : /hpcstorage/cretigni/Yarara/HD110315/data/s1d/HARPN/STACKED/RASSINE_Stacked_spectrum_bin_1.2013-01-18T05:05:51.444.p (SNR at 5500 : 389)
Ouput file saved under : /hpcstorage/cretigni/Yarara/HD110315/data/s1d/HARPN/STACKED/RASSINE_Stacked_spectrum_bin_1.2013-06-13T21:06:59.774.p (SNR at 5500 : 212)
Ouput file saved under : /hpcstorage/cretigni/Yarara/HD110315/data/s1d/HARPN/STACKED/RASSINE_Stacked_spectrum_bin_1.2013-06-21T21:39:30.038.p (SNR at 5500 : 211)
Ouput file saved under : /hpcstorage/cretigni/Yarara/HD110315/data/s1d/HARPN/STACKED/RASSINE_Stacked_spectrum_bin_1.2013-06-19T21:25:58.915.p (SNR at 5500 : 150)
Ouput file saved under : /hpcstorage/cretigni/Yarara/HD110315/data/s1d/HARPN/STACKED/RASSINE_Stacked_spectrum_bin_1.2014-01-07T05:46:42.794.p (SNR at 5500 : 319)
Ouput file saved under : /hpcstorage/cretigni/Yarara/HD110315/data/s1d/HARPN/STACKED/RASSINE_Stacked_spectrum_bin_1.2014-01-08T04:56:40.560.p (SNR at 5500 : 154)
Ouput file saved under : /hpcstorage/cretigni/Yarara/HD110315/data/s1d/HARPN/STACKED/RASSINE_Stacked_spectrum_bin_1.2014-01-15T05:53:07.140.p (SNR at 5500 : 312)
Ouput file saved under : /hpcstorage/cretigni/Yarara/HD110315/data/s1d/HARPN/STACKED/RASSINE_Stacked_spectrum_bin_1.2014-01-11T06:02:38.430.p (SNR at 5500 : 229)
Ouput file saved under : /hpcstorage/cretigni/Yarara/HD110315/data/s1d/HARPN/STACKED/RASSINE_Stacked_spectrum_bin_1.2014-03-03T04:58:24.499.p (SNR at 5500 : 240)
Ouput file saved under : /hpcstorage/cretigni/Yarara/HD110315/data/s1d/HARPN/STACKED/RASSINE_Stacked_spectrum_bin_1.2014-03-04T04:38:29.501.p (SNR at 5500 : 248)
Ouput file saved under : /hpcstorage/cretigni/Yarara/HD110315/data/s1d/HARPN/STACKED/RASSINE_Stacked_spectrum_bin_1.2014-04-15T01:49:04.973.p (SNR at 5500 : 237)
Ouput file saved under : /hpcstorage/cretigni/Yarara/HD110315/data/s1d/HARPN/STACKED/RASSINE_Stacked_spectrum_bin_1.2014-04-18T02:22:26.342.p (SNR at 5500 : 225)
Ouput file saved under : /hpcstorage/cretigni/Yarara/HD110315/data/s1d/HARPN/STACKED/RASSINE_Stacked_spectrum_bin_1.2014-04-17T01:54:10.742.p (SNR at 5500 : 159)
Ouput file saved under : /hpcstorage/cretigni/Yarara/HD110315/data/s1d/HARPN/STACKED/RASSINE_Stacked_spectrum_bin_1.2014-03-07T04:18:36.070.p (SNR at 5500 : 167)
Ouput file saved under : /hpcstorage/cretigni/Yarara/HD110315/data/s1d/HARPN/STACKED/RASSINE_Stacked_spectrum_bin_1.2014-05-20T23:19:09.696.p (SNR at 5500 : 277)
Ouput file saved under : /hpcstorage/cretigni/Yarara/HD110315/data/s1d/HARPN/STACKED/RASSINE_Stacked_spectrum_bin_1.2014-04-22T02:07:45.494.p (SNR at 5500 : 241)
Ouput file saved under : /hpcstorage/cretigni/Yarara/HD110315/data/s1d/HARPN/STACKED/RASSINE_Stacked_spectrum_bin_1.2014-05-23T23:36:36.864.p (SNR at 5500 : 250)
Ouput file saved under : /hpcstorage/cretigni/Yarara/HD110315/data/s1d/HARPN/STACKED/RASSINE_Stacked_spectrum_bin_1.2014-05-22T23:06:47.088.p (SNR at 5500 : 231)
Ouput file saved under : /hpcstorage/cretigni/Yarara/HD110315/data/s1d/HARPN/STACKED/RASSINE_Stacked_spectrum_bin_1.2014-05-26T00:43:22.987.p (SNR at 5500 : 164)
Ouput file saved under : /hpcstorage/cretigni/Yarara/HD110315/data/s1d/HARPN/STACKED/RASSINE_Stacked_spectrum_bin_1.2014-06-06T22:38:08.851.p (SNR at 5500 : 286)
Ouput file saved under : /hpcstorage/cretigni/Yarara/HD110315/data/s1d/HARPN/STACKED/RASSINE_Stacked_spectrum_bin_1.2014-05-24T23:35:58.502.p (SNR at 5500 : 129)
Ouput file saved under : /hpcstorage/cretigni/Yarara/HD110315/data/s1d/HARPN/STACKED/RASSINE_Stacked_spectrum_bin_1.2014-06-04T21:46:38.669.p (SNR at 5500 : 295)
Ouput file saved under : /hpcstorage/cretigni/Yarara/HD110315/data/s1d/HARPN/STACKED/RASSINE_Stacked_spectrum_bin_1.2014-06-24T21:50:16.051.p (SNR at 5500 : 138)
Ouput file saved under : /hpcstorage/cretigni/Yarara/HD110315/data/s1d/HARPN/STACKED/RASSINE_Stacked_spectrum_bin_1.2015-01-25T06:19:01.321.p (SNR at 5500 : 211)
Ouput file saved under : /hpcstorage/cretigni/Yarara/HD110315/data/s1d/HARPN/STACKED/RASSINE_Stacked_spectrum_bin_1.2014-06-07T21:57:49.565.p (SNR at 5500 : 258)
Ouput file saved under : /hpcstorage/cretigni/Yarara/HD110315/data/s1d/HARPN/STACKED/RASSINE_Stacked_spectrum_bin_1.2015-01-23T05:30:12.713.p (SNR at 5500 : 222)
Ouput file saved under : /hpcstorage/cretigni/Yarara/HD110315/data/s1d/HARPN/STACKED/RASSINE_Stacked_spectrum_bin_1.2015-04-03T03:42:02.102.p (SNR at 5500 : 186)
Ouput file saved under : /hpcstorage/cretigni/Yarara/HD110315/data/s1d/HARPN/STACKED/RASSINE_Stacked_spectrum_bin_1.2015-01-31T04:44:05.637.p (SNR at 5500 : 152)
Ouput file saved under : /hpcstorage/cretigni/Yarara/HD110315/data/s1d/HARPN/STACKED/RASSINE_Stacked_spectrum_bin_1.2016-05-22T00:05:03.814.p (SNR at 5500 : 129)
Ouput file saved under : /hpcstorage/cretigni/Yarara/HD110315/data/s1d/HARPN/STACKED/RASSINE_Stacked_spectrum_bin_1.2015-04-04T01:59:26.452.p (SNR at 5500 : 343)
Ouput file saved under : /hpcstorage/cretigni/Yarara/HD110315/data/s1d/HARPN/STACKED/RASSINE_Stacked_spectrum_bin_1.2018-04-30T02:43:16.118.p (SNR at 5500 : 232)
Ouput file saved under : /hpcstorage/cretigni/Yarara/HD110315/data/s1d/HARPN/STACKED/RASSINE_Stacked_spectrum_bin_1.2018-04-30T23:47:02.054.p (SNR at 5500 : 193)
Ouput file saved under : /hpcstorage/cretigni/Yarara/HD110315/data/s1d/HARPN/STACKED/RASSINE_Stacked_spectrum_bin_1.2017-02-06T05:30:36.953.p (SNR at 5500 : 253)
Ouput file saved under : /hpcstorage/cretigni/Yarara/HD110315/data/s1d/HARPN/STACKED/RASSINE_Stacked_spectrum_bin_1.2018-05-29T23:48:50.512.p (SNR at 5500 : 132)
Ouput file saved under : /hpcstorage/cretigni/Yarara/HD110315/data/s1d/HARPN/STACKED/RASSINE_Stacked_spectrum_bin_1.2019-03-17T05:10:13.930.p (SNR at 5500 : 173)
Ouput file saved under : /hpcstorage/cretigni/Yarara/HD110315/data/s1d/HARPN/STACKED/RASSINE_Stacked_spectrum_bin_1.2019-01-23T05:06:51.754.p (SNR at 5500 : 134)
Ouput file saved under : /hpcstorage/cretigni/Yarara/HD110315/data/s1d/HARPN/STACKED/RASSINE_Stacked_spectrum_bin_1.2019-04-11T00:10:32.398.p (SNR at 5500 : 217)
Ouput file saved under : /hpcstorage/cretigni/Yarara/HD110315/data/s1d/HARPN/STACKED/RASSINE_Stacked_spectrum_bin_1.2019-04-20T00:39:25.130.p (SNR at 5500 : 262)
 Output directory is : /hpcstorage/cretigni/Yarara/HD110315/data/s1d/HARPN/
 [STEP INFO] Preprocessing...
 [STEP INFO] Matching frame...
 [STEP INFO] Stacking frame...
Loading the data, wait... 

Number of bins : 44
SNR 5500 statistic (Q1/Q2/Q3) : Q1 = 172 / Q2 = 231 / Q3 = 267
 Master file Master_spectrum_2021-08-06T12:00:17.p displaced to /hpcstorage/cretigni/Yarara/HD110315/data/s1d/HARPN/MASTER/
 [STEP INFO] Normalisation master spectrum
 [STEP INFO] Normalisation frame...
 [STEP INFO] Normalisation clustering algorithm
Loading of the files, wait ... 

 Number of files to reduce 44
Extraction of the new continua, wait... 


Modification of file (1/9): /hpcstorage/cretigni/Yarara/HD110315/data/s1d/HARPN/MASTER/RASSINE_Master_spectrum_2021-08-06T12:00:17.p 
# of anchor before : 575 
# of anchor after out-of-cluster filtering : 462 
# of anchor after twin filtering : 448 
# of anchor after adding : 469

Modification of file (2/9): /hpcstorage/cretigni/Yarara/HD110315/data/s1d/HARPN/STACKED/RASSINE_Stacked_spectrum_bin_1.2012-12-07T06:07:06.519.p 
# of anchor before : 564 
# of anchor after out-of-cluster filtering : 400 
# of anchor after twin filtering : 395 
# of anchor after adding : 470

Modification of file (3/9): /hpcstorage/cretigni/Yarara/HD110315/data/s1d/HARPN/STACKED/RASSINE_Stacked_spectrum_bin_1.2013-01-18T05:05:51.444.p 
# of anchor before : 550 
# of anchor after out-of-cluster filtering : 415 
# of anchor after twin filtering : 413 
# of anchor after adding : 468

Modification of file (4/9): /hpcstorage/cretigni/Yarara/HD110315/data/s1d/HARPN/STACKED/RASSINE_Stacked_spectrum_bin_1.2014-01-11T06:02:38.430.p 
# of anchor before : 535 
# of anchor after out-of-cluster filtering : 391 
# of anchor after twin filtering : 383 
# of anchor after adding : 469

Modification of file (5/9): /hpcstorage/cretigni/Yarara/HD110315/data/s1d/HARPN/STACKED/RASSINE_Stacked_spectrum_bin_1.2014-04-17T01:54:10.742.p 
# of anchor before : 557 
# of anchor after out-of-cluster filtering : 384 
# of anchor after twin filtering : 376 
# of anchor after adding : 468

Modification of file (6/9): /hpcstorage/cretigni/Yarara/HD110315/data/s1d/HARPN/STACKED/RASSINE_Stacked_spectrum_bin_1.2014-05-24T23:35:58.502.p 
# of anchor before : 501 
# of anchor after out-of-cluster filtering : 342 
# of anchor after twin filtering : 339 
# of anchor after adding : 468

Modification of file (7/9): /hpcstorage/cretigni/Yarara/HD110315/data/s1d/HARPN/STACKED/RASSINE_Stacked_spectrum_bin_1.2015-01-23T05:30:12.713.p 
# of anchor before : 553 
# of anchor after out-of-cluster filtering : 392 
# of anchor after twin filtering : 390 
# of anchor after adding : 470

Modification of file (8/9): /hpcstorage/cretigni/Yarara/HD110315/data/s1d/HARPN/STACKED/RASSINE_Stacked_spectrum_bin_1.2017-02-06T05:30:36.953.p 
# of anchor before : 567 
# of anchor after out-of-cluster filtering : 413 
# of anchor after twin filtering : 404 
# of anchor after adding : 468

Modification of file (9/9): /hpcstorage/cretigni/Yarara/HD110315/data/s1d/HARPN/STACKED/RASSINE_Stacked_spectrum_bin_1.2019-04-11T00:10:32.398.p 
# of anchor before : 597 
# of anchor after out-of-cluster filtering : 420 
# of anchor after twin filtering : 406 
# of anchor after adding : 467
Extraction of the new continua, wait... 


Modification of file (2/8): /hpcstorage/cretigni/Yarara/HD110315/data/s1d/HARPN/STACKED/RASSINE_Stacked_spectrum_bin_1.2013-01-15T05:30:06.996.p 
# of anchor before : 617 
# of anchor after out-of-cluster filtering : 436 
# of anchor after twin filtering : 422 
# of anchor after adding : 470

Modification of file (3/8): /hpcstorage/cretigni/Yarara/HD110315/data/s1d/HARPN/STACKED/RASSINE_Stacked_spectrum_bin_1.2013-06-21T21:39:30.038.p 
# of anchor before : 556 
# of anchor after out-of-cluster filtering : 399 
# of anchor after twin filtering : 389 
# of anchor after adding : 469

Modification of file (4/8): /hpcstorage/cretigni/Yarara/HD110315/data/s1d/HARPN/STACKED/RASSINE_Stacked_spectrum_bin_1.2014-03-04T04:38:29.501.p 
# of anchor before : 544 
# of anchor after out-of-cluster filtering : 397 
# of anchor after twin filtering : 394 
# of anchor after adding : 470

Modification of file (5/8): /hpcstorage/cretigni/Yarara/HD110315/data/s1d/HARPN/STACKED/RASSINE_Stacked_spectrum_bin_1.2014-05-20T23:19:09.696.p 
# of anchor before : 562 
# of anchor after out-of-cluster filtering : 414 
# of anchor after twin filtering : 408 
# of anchor after adding : 470

Modification of file (6/8): /hpcstorage/cretigni/Yarara/HD110315/data/s1d/HARPN/STACKED/RASSINE_Stacked_spectrum_bin_1.2014-06-06T22:38:08.851.p 
# of anchor before : 554 
# of anchor after out-of-cluster filtering : 416 
# of anchor after twin filtering : 408 
# of anchor after adding : 469

Modification of file (7/8): /hpcstorage/cretigni/Yarara/HD110315/data/s1d/HARPN/STACKED/RASSINE_Stacked_spectrum_bin_1.2015-04-03T03:42:02.102.p 
# of anchor before : 532 
# of anchor after out-of-cluster filtering : 382 
# of anchor after twin filtering : 380 
# of anchor after adding : 469

Modification of file (8/8): /hpcstorage/cretigni/Yarara/HD110315/data/s1d/HARPN/STACKED/RASSINE_Stacked_spectrum_bin_1.2018-05-29T23:48:50.512.p 
# of anchor before : 586 
# of anchor after out-of-cluster filtering : 385 
# of anchor after twin filtering : 377 
# of anchor after adding : 470
Extraction of the new continua, wait... 


Modification of file (2/8): /hpcstorage/cretigni/Yarara/HD110315/data/s1d/HARPN/STACKED/RASSINE_Stacked_spectrum_bin_1.2013-01-17T05:34:56.244.p 
# of anchor before : 588 
# of anchor after out-of-cluster filtering : 431 
# of anchor after twin filtering : 422 
# of anchor after adding : 468

Modification of file (3/8): /hpcstorage/cretigni/Yarara/HD110315/data/s1d/HARPN/STACKED/RASSINE_Stacked_spectrum_bin_1.2014-01-08T04:56:40.560.p 
# of anchor before : 558 
# of anchor after out-of-cluster filtering : 380 
# of anchor after twin filtering : 376 
# of anchor after adding : 467

Modification of file (4/8): /hpcstorage/cretigni/Yarara/HD110315/data/s1d/HARPN/STACKED/RASSINE_Stacked_spectrum_bin_1.2014-04-15T01:49:04.973.p 
# of anchor before : 571 
# of anchor after out-of-cluster filtering : 418 
# of anchor after twin filtering : 409 
# of anchor after adding : 469

Modification of file (5/8): /hpcstorage/cretigni/Yarara/HD110315/data/s1d/HARPN/STACKED/RASSINE_Stacked_spectrum_bin_1.2014-05-23T23:36:36.864.p 
# of anchor before : 572 
# of anchor after out-of-cluster filtering : 406 
# of anchor after twin filtering : 399 
# of anchor after adding : 469

Modification of file (6/8): /hpcstorage/cretigni/Yarara/HD110315/data/s1d/HARPN/STACKED/RASSINE_Stacked_spectrum_bin_1.2014-06-24T21:50:16.051.p 
# of anchor before : 547 
# of anchor after out-of-cluster filtering : 362 
# of anchor after twin filtering : 358 
# of anchor after adding : 468

Modification of file (7/8): /hpcstorage/cretigni/Yarara/HD110315/data/s1d/HARPN/STACKED/RASSINE_Stacked_spectrum_bin_1.2016-05-22T00:05:03.814.p 
# of anchor before : 570 
# of anchor after out-of-cluster filtering : 376 
# of anchor after twin filtering : 373 
# of anchor after adding : 471

Modification of file (8/8): /hpcstorage/cretigni/Yarara/HD110315/data/s1d/HARPN/STACKED/RASSINE_Stacked_spectrum_bin_1.2019-03-17T05:10:13.930.p 
# of anchor before : 607 
# of anchor after out-of-cluster filtering : 399 
# of anchor after twin filtering : 394 
# of anchor after adding : 466
 Number of files to reduce 44
Modification of file (1/8) : /hpcstorage/cretigni/Yarara/HD110315/data/s1d/HARPN/STACKED/RASSINE_Stacked_spectrum_bin_1.2013-01-18T05:05:51.444.p (SNR : 389)
Modification of file (2/8) : /hpcstorage/cretigni/Yarara/HD110315/data/s1d/HARPN/STACKED/RASSINE_Stacked_spectrum_bin_1.2017-02-06T05:30:36.953.p (SNR : 253)
Modification of file (3/8) : /hpcstorage/cretigni/Yarara/HD110315/data/s1d/HARPN/STACKED/RASSINE_Stacked_spectrum_bin_1.2014-01-11T06:02:38.430.p (SNR : 229)
Modification of file (4/8) : /hpcstorage/cretigni/Yarara/HD110315/data/s1d/HARPN/STACKED/RASSINE_Stacked_spectrum_bin_1.2015-01-23T05:30:12.713.p (SNR : 222)
Modification of file (5/8) : /hpcstorage/cretigni/Yarara/HD110315/data/s1d/HARPN/STACKED/RASSINE_Stacked_spectrum_bin_1.2019-04-11T00:10:32.398.p (SNR : 217)
Modification of file (6/8) : /hpcstorage/cretigni/Yarara/HD110315/data/s1d/HARPN/STACKED/RASSINE_Stacked_spectrum_bin_1.2012-12-07T06:07:06.519.p (SNR : 214)
Modification of file (7/8) : /hpcstorage/cretigni/Yarara/HD110315/data/s1d/HARPN/STACKED/RASSINE_Stacked_spectrum_bin_1.2014-04-17T01:54:10.742.p (SNR : 159)
Modification of file (8/8) : /hpcstorage/cretigni/Yarara/HD110315/data/s1d/HARPN/STACKED/RASSINE_Stacked_spectrum_bin_1.2014-05-24T23:35:58.502.p (SNR : 129)
Modification of file (1/8) : /hpcstorage/cretigni/Yarara/HD110315/data/s1d/HARPN/STACKED/RASSINE_Stacked_spectrum_bin_1.2014-01-15T05:53:07.140.p (SNR : 312)
Modification of file (2/8) : /hpcstorage/cretigni/Yarara/HD110315/data/s1d/HARPN/STACKED/RASSINE_Stacked_spectrum_bin_1.2012-12-25T05:38:27.304.p (SNR : 274)
Modification of file (3/8) : /hpcstorage/cretigni/Yarara/HD110315/data/s1d/HARPN/STACKED/RASSINE_Stacked_spectrum_bin_1.2019-04-20T00:39:25.130.p (SNR : 262)
Modification of file (4/8) : /hpcstorage/cretigni/Yarara/HD110315/data/s1d/HARPN/STACKED/RASSINE_Stacked_spectrum_bin_1.2018-04-30T02:43:16.118.p (SNR : 232)
Modification of file (5/8) : /hpcstorage/cretigni/Yarara/HD110315/data/s1d/HARPN/STACKED/RASSINE_Stacked_spectrum_bin_1.2014-04-18T02:22:26.342.p (SNR : 225)
Modification of file (6/8) : /hpcstorage/cretigni/Yarara/HD110315/data/s1d/HARPN/STACKED/RASSINE_Stacked_spectrum_bin_1.2013-06-13T21:06:59.774.p (SNR : 212)
Modification of file (7/8) : /hpcstorage/cretigni/Yarara/HD110315/data/s1d/HARPN/STACKED/RASSINE_Stacked_spectrum_bin_1.2015-01-25T06:19:01.321.p (SNR : 211)
Modification of file (8/8) : /hpcstorage/cretigni/Yarara/HD110315/data/s1d/HARPN/STACKED/RASSINE_Stacked_spectrum_bin_1.2014-05-26T00:43:22.987.p (SNR : 164)
Modification of file (1/7) : /hpcstorage/cretigni/Yarara/HD110315/data/s1d/HARPN/STACKED/RASSINE_Stacked_spectrum_bin_1.2014-06-04T21:46:38.669.p (SNR : 295)
Modification of file (2/7) : /hpcstorage/cretigni/Yarara/HD110315/data/s1d/HARPN/STACKED/RASSINE_Stacked_spectrum_bin_1.2013-01-14T06:09:18.317.p (SNR : 276)
Modification of file (3/7) : /hpcstorage/cretigni/Yarara/HD110315/data/s1d/HARPN/STACKED/RASSINE_Stacked_spectrum_bin_1.2014-04-22T02:07:45.494.p (SNR : 241)
Modification of file (4/7) : /hpcstorage/cretigni/Yarara/HD110315/data/s1d/HARPN/STACKED/RASSINE_Stacked_spectrum_bin_1.2014-03-03T04:58:24.499.p (SNR : 240)
Modification of file (5/7) : /hpcstorage/cretigni/Yarara/HD110315/data/s1d/HARPN/STACKED/RASSINE_Stacked_spectrum_bin_1.2018-04-30T23:47:02.054.p (SNR : 193)
Modification of file (6/7) : /hpcstorage/cretigni/Yarara/HD110315/data/s1d/HARPN/STACKED/RASSINE_Stacked_spectrum_bin_1.2015-01-31T04:44:05.637.p (SNR : 152)
Modification of file (7/7) : /hpcstorage/cretigni/Yarara/HD110315/data/s1d/HARPN/STACKED/RASSINE_Stacked_spectrum_bin_1.2013-06-19T21:25:58.915.p (SNR : 150)
Modification of file (1/7) : /hpcstorage/cretigni/Yarara/HD110315/data/s1d/HARPN/STACKED/RASSINE_Stacked_spectrum_bin_1.2015-04-04T01:59:26.452.p (SNR : 343)
Modification of file (2/7) : /hpcstorage/cretigni/Yarara/HD110315/data/s1d/HARPN/STACKED/RASSINE_Stacked_spectrum_bin_1.2014-01-07T05:46:42.794.p (SNR : 319)
Modification of file (3/7) : /hpcstorage/cretigni/Yarara/HD110315/data/s1d/HARPN/STACKED/RASSINE_Stacked_spectrum_bin_1.2013-01-16T05:26:33.286.p (SNR : 313)
Modification of file (4/7) : /hpcstorage/cretigni/Yarara/HD110315/data/s1d/HARPN/STACKED/RASSINE_Stacked_spectrum_bin_1.2014-06-07T21:57:49.565.p (SNR : 258)
Modification of file (5/7) : /hpcstorage/cretigni/Yarara/HD110315/data/s1d/HARPN/STACKED/RASSINE_Stacked_spectrum_bin_1.2014-05-22T23:06:47.088.p (SNR : 231)
Modification of file (6/7) : /hpcstorage/cretigni/Yarara/HD110315/data/s1d/HARPN/STACKED/RASSINE_Stacked_spectrum_bin_1.2014-03-07T04:18:36.070.p (SNR : 167)
Modification of file (7/7) : /hpcstorage/cretigni/Yarara/HD110315/data/s1d/HARPN/STACKED/RASSINE_Stacked_spectrum_bin_1.2019-01-23T05:06:51.754.p (SNR : 134)
Modification of file (1/7) : /hpcstorage/cretigni/Yarara/HD110315/data/s1d/HARPN/STACKED/RASSINE_Stacked_spectrum_bin_1.2014-06-06T22:38:08.851.p (SNR : 286)
Modification of file (2/7) : /hpcstorage/cretigni/Yarara/HD110315/data/s1d/HARPN/STACKED/RASSINE_Stacked_spectrum_bin_1.2014-05-20T23:19:09.696.p (SNR : 277)
Modification of file (3/7) : /hpcstorage/cretigni/Yarara/HD110315/data/s1d/HARPN/STACKED/RASSINE_Stacked_spectrum_bin_1.2013-01-15T05:30:06.996.p (SNR : 264)
Modification of file (4/7) : /hpcstorage/cretigni/Yarara/HD110315/data/s1d/HARPN/STACKED/RASSINE_Stacked_spectrum_bin_1.2014-03-04T04:38:29.501.p (SNR : 248)
Modification of file (5/7) : /hpcstorage/cretigni/Yarara/HD110315/data/s1d/HARPN/STACKED/RASSINE_Stacked_spectrum_bin_1.2013-06-21T21:39:30.038.p (SNR : 211)
Modification of file (6/7) : /hpcstorage/cretigni/Yarara/HD110315/data/s1d/HARPN/STACKED/RASSINE_Stacked_spectrum_bin_1.2015-04-03T03:42:02.102.p (SNR : 186)
Modification of file (7/7) : /hpcstorage/cretigni/Yarara/HD110315/data/s1d/HARPN/STACKED/RASSINE_Stacked_spectrum_bin_1.2018-05-29T23:48:50.512.p (SNR : 132)
Modification of file (1/7) : /hpcstorage/cretigni/Yarara/HD110315/data/s1d/HARPN/STACKED/RASSINE_Stacked_spectrum_bin_1.2013-01-17T05:34:56.244.p (SNR : 331)
Modification of file (2/7) : /hpcstorage/cretigni/Yarara/HD110315/data/s1d/HARPN/STACKED/RASSINE_Stacked_spectrum_bin_1.2014-05-23T23:36:36.864.p (SNR : 250)
Modification of file (3/7) : /hpcstorage/cretigni/Yarara/HD110315/data/s1d/HARPN/STACKED/RASSINE_Stacked_spectrum_bin_1.2014-04-15T01:49:04.973.p (SNR : 237)
Modification of file (4/7) : /hpcstorage/cretigni/Yarara/HD110315/data/s1d/HARPN/STACKED/RASSINE_Stacked_spectrum_bin_1.2019-03-17T05:10:13.930.p (SNR : 173)
Modification of file (5/7) : /hpcstorage/cretigni/Yarara/HD110315/data/s1d/HARPN/STACKED/RASSINE_Stacked_spectrum_bin_1.2014-01-08T04:56:40.560.p (SNR : 154)
Modification of file (6/7) : /hpcstorage/cretigni/Yarara/HD110315/data/s1d/HARPN/STACKED/RASSINE_Stacked_spectrum_bin_1.2014-06-24T21:50:16.051.p (SNR : 138)
Modification of file (7/7) : /hpcstorage/cretigni/Yarara/HD110315/data/s1d/HARPN/STACKED/RASSINE_Stacked_spectrum_bin_1.2016-05-22T00:05:03.814.p (SNR : 129)
Computation of the intersection of the anchors points, wait ... 

 [STEP INFO] Normalisation diff continuum
 python Rassine_trigger.py -s HD110315 -i ESPRESSO -a 1 -b 1 -d HARPN -l 0.01 -o /hpcstorage/cretigni/Yarara/HD110315/data/s1d/HARPN/
------------------------
 STAR LOADED : HD110315 
------------------------

 [INFO] Complete analysis HARPN without reference spectrum launched...


Value after SIMBAD query
----------------

                          HD110315
Simbad_name               HD110315
Sp_type                      K4.5V
Ra                   12 41 06.4845
Dec                  +15 22 36.003
Pma                        107.744
Pmd                       -370.658
Rv_sys                        24.9
Mstar                         0.65
Rstar                         0.89
magU                         10.08
magB                          9.03
magV                          7.93
magR                           7.2
UB                            1.05
BV                             1.1
VR                            0.73
Dist_pc                      14.11
Teff                          4505
Log_g                         4.61
FeH                          -0.08
Vsini                          2.0
Vmicro                         1.0
Prot                            25
Pmag                            11
FWHM                           6.0
Contrast                       0.5
CCF_delta                        5
stellar_template  MARCS_T5750_g4.5

 [INFO] Summary table updated
[INFO] Both RV_sys match : 24.90/24.42 kms

 [INFO] RV range updated to : 18.0 kms

 [INFO] RV borders updated to : 12.0 kms

 [INFO] CCF mask selected : /hpcstorage/cretigni/Python/MASK_CCF/K5.txt 


 [INFO] RV sys : 24.42 [km/s] 


 [INFO] Nb lines in the mask : 4828 


 [INFO] Percentage of the spectrum used : 73.1 [%] (292737) 


 [INFO] CCF mask reduced for the first time, wait for the static mask producing...


 [INFO] CCF mask saved under : /hpcstorage/cretigni/Yarara/HD110315/data/s1d/HARPN/CCF_MASK/CCF_K5.fits

 Computing CCF (Current time 14h20m53s) 



 CCF computed (Current time 14h21m11s) 

 [INFO] SNR CCF continuum median : 1473

 [INFO] Photon noise RV median : 1.53 m/s
 
 [INFO] Photon noise RV from calibration : 1.26 m/s
 

 [INFO] Summary table updated

 [INFO] FWHM measured as 6.1 kms

 [INFO] RV range updated to : 18.0 kms

 [INFO] RV borders updated to : 12.0 kms

 [INFO] CCF mask selected : /hpcstorage/cretigni/Python/MASK_CCF/K5.txt 


 [INFO] RV sys : 24.42 [km/s] 


 [INFO] Nb lines in the mask : 4828 


 [INFO] Percentage of the spectrum used : 73.1 [%] (292737) 


 [INFO] CCF mask found : /hpcstorage/cretigni/Yarara/HD110315/data/s1d/HARPN/CCF_MASK/CCF_K5.fits

 Computing CCF (Current time 14h21m54s) 



 CCF computed (Current time 14h22m12s) 

 [INFO] SNR CCF continuum median : 1473

 [INFO] Photon noise RV median : 1.53 m/s
 
 [INFO] Photon noise RV from calibration : 1.26 m/s
 

 [INFO] Summary table updated
Modification of the files to cancel the secular acceleration

 [INFO] Summary table updated
Spectra under SNR 100 supressed
 [INFO] Zscale color scaled to : 0.016

 [INFO] Summary table updated

 [INFO] Star found in the SIMBAD table

Value after SIMBAD query
----------------

                          HD110315
Simbad_name               HD110315
Sp_type                      K4.5V
Ra                   12 41 06.4845
Dec                  +15 22 36.003
Pma                        107.744
Pmd                       -370.658
Rv_sys                        24.9
Mstar                         0.65
Rstar                         0.89
magU                         10.08
magB                          9.03
magV                          7.93
magR                           7.2
UB                            1.05
BV                             1.1
VR                            0.73
Dist_pc                      14.11
Teff                          4505
Log_g                         4.61
FeH                          -0.08
Vsini                          2.0
Vmicro                         1.0
Prot                            25
Pmag                            11
FWHM                           6.0
Contrast                       0.5
CCF_delta                        5
stellar_template  MARCS_T5750_g4.5

 Compute bolometric constant

 [INFO] Summary table updated

Maximum 2 orders overlapped

Encoding pixels and orders by R2 to R mapping


 Add flux errors


LLLLLLLLLLLLLLLLLLLLLLLLLLLLLLLLLLLLLLLLL

---- RECIPE : PRODUCE BERV SUMMARY ----

TTTTTTTTTTTTTTTTTTTTTTTTTTTTTTTTTTTTTTTTT


---- DICO matching_diff used ----
[INFO] Nb bins full : 13

 Compute activity proxy


LLLLLLLLLLLLLLLLLLLLLLLLLLLLLLLLLLLLLLLLLLLLLLLL

---- RECIPE : ACTIVITY PROXIES EXTRACTION ----

TTTTTTTTTTTTTTTTTTTTTTTTTTTTTTTTTTTTTTTTTTTTTTTT



 Saving activity proxies...

 [INFO] Summary table updated

 [INFO] Summary table updated

 Make SNR statistics figure
count     44.000000
mean     228.000000
std       63.822064
min      129.000000
25%      171.500000
50%      230.000000
75%      266.500000
max      389.000000
Name: snr, dtype: float64

 Make DRS RV summary figure

 [INFO] Summary table updated

 Crop spectra


LLLLLLLLLLLLLLLLLLLLLLLLLLLLLLLLLLLL

---- RECIPE : SPECTRA CROPING ----

TTTTTTTTTTTTTTTTTTTTTTTTTTTTTTTTTTTT



 [INFO] Summary table updated

 [INFO] Summary table updated

 [INFO] Summary table updated

 [INFO] Summary table updated
[31m ==============================================================================
 [INFO] Intermediate time : 0h 46m 5s 
 ==============================================================================
[37m
