<?xml version="1.0"?>
<svg xmlns="http://www.w3.org/2000/svg" xmlns:xlink="http://www.w3.org/1999/xlink" xmlns:svgjs="http://svgjs.com/svgjs" version="1.1" width="512" height="512" x="0" y="0" viewBox="0 0 368 368" style="enable-background:new 0 0 512 512" xml:space="preserve"><g>
<g xmlns="http://www.w3.org/2000/svg">
	<g>
		<g>
			<path d="M184,0C82.544,0,0,82.544,0,184s82.544,184,184,184c101.464,0,184-82.544,184-184S285.464,0,184,0z M184,352     c-92.64,0-168-75.36-168-168S91.36,16,184,16c92.632,0,168,75.36,168,168S276.632,352,184,352z" fill="#ff8300" data-original="#000000" style=""/>
			<path d="M144,152c0-13.232-10.768-24-24-24s-24,10.768-24,24s10.768,24,24,24S144,165.232,144,152z M112,152c0-4.408,3.592-8,8-8     s8,3.592,8,8s-3.592,8-8,8S112,156.408,112,152z" fill="#ff8300" data-original="#000000" style=""/>
			<path d="M248,128c-13.232,0-24,10.768-24,24c0,10.416,6.712,19.216,16,22.528V200c0,4.416,3.576,8,8,8s8-3.584,8-8v-25.472     c9.288-3.312,16-12.112,16-22.528C272,138.768,261.232,128,248,128z M248,160c-4.416,0-8-3.592-8-8s3.584-8,8-8     c4.416,0,8,3.592,8,8S252.416,160,248,160z" fill="#ff8300" data-original="#000000" style=""/>
			<path d="M184,224c-29.824,0-58.24,12.632-77.96,34.664c-2.944,3.296-2.664,8.352,0.624,11.296     c3.296,2.952,8.352,2.664,11.296-0.624C134.648,250.688,158.72,240,184,240c25.28,0,49.352,10.688,66.04,29.336     c1.576,1.768,3.768,2.664,5.96,2.664c1.896,0,3.816-0.672,5.336-2.04c3.288-2.944,3.568-8,0.624-11.296     C242.24,236.64,213.832,224,184,224z" fill="#ff8300" data-original="#000000" style=""/>
			<path d="M267.584,80.84l-32-16c-3.944-1.976-8.752-0.376-10.736,3.576c-1.984,3.96-0.376,8.76,3.576,10.744l32,16     c1.144,0.568,2.368,0.84,3.568,0.84c2.936,0,5.76-1.616,7.168-4.424C273.136,87.624,271.536,82.816,267.584,80.84z" fill="#ff8300" data-original="#000000" style=""/>
			<path d="M104.008,96c1.2,0,2.424-0.272,3.568-0.84l32-16c3.952-1.976,5.552-6.784,3.576-10.736     c-1.976-3.952-6.768-5.56-10.736-3.576l-32,16c-3.952,1.976-5.552,6.784-3.576,10.736C98.248,94.384,101.072,96,104.008,96z" fill="#ff8300" data-original="#000000" style=""/>
		</g>
	</g>
</g>
<g xmlns="http://www.w3.org/2000/svg">
</g>
<g xmlns="http://www.w3.org/2000/svg">
</g>
<g xmlns="http://www.w3.org/2000/svg">
</g>
<g xmlns="http://www.w3.org/2000/svg">
</g>
<g xmlns="http://www.w3.org/2000/svg">
</g>
<g xmlns="http://www.w3.org/2000/svg">
</g>
<g xmlns="http://www.w3.org/2000/svg">
</g>
<g xmlns="http://www.w3.org/2000/svg">
</g>
<g xmlns="http://www.w3.org/2000/svg">
</g>
<g xmlns="http://www.w3.org/2000/svg">
</g>
<g xmlns="http://www.w3.org/2000/svg">
</g>
<g xmlns="http://www.w3.org/2000/svg">
</g>
<g xmlns="http://www.w3.org/2000/svg">
</g>
<g xmlns="http://www.w3.org/2000/svg">
</g>
<g xmlns="http://www.w3.org/2000/svg">
</g>
</g></svg>
