%YAML 1.1
%TAG !u! tag:unity3d.com,2011:
--- !u!687078895 &4343727234628468602
SpriteAtlas:
  m_ObjectHideFlags: 0
  m_CorrespondingSourceObject: {fileID: 0}
  m_PrefabInstance: {fileID: 0}
  m_PrefabAsset: {fileID: 0}
  m_Name: 1
  m_EditorData:
    serializedVersion: 2
    textureSettings:
      serializedVersion: 2
      anisoLevel: 1
      compressionQuality: 50
      maxTextureSize: 2048
      textureCompression: 0
      filterMode: 1
      generateMipMaps: 0
      readable: 0
      crunchedCompression: 0
      sRGB: 1
    platformSettings: []
    packingSettings:
      serializedVersion: 2
      padding: 4
      blockOffset: 1
      allowAlphaSplitting: 0
      enableRotation: 1
      enableTightPacking: 1
    variantMultiplier: 1
    packables:
    - {fileID: 102900000, guid: 419cc4397247ca14fba3dcca01f2076e, type: 3}
    totalSpriteSurfaceArea: 4205178
    bindAsDefault: 1
  m_MasterAtlas: {fileID: 0}
  m_PackedSprites:
  - {fileID: 21300000, guid: cefe9240d71ee0249b4c437a1886933b, type: 3}
  - {fileID: 21300000, guid: f825f66087f1c4e4d810e40bcb5ff3aa, type: 3}
  - {fileID: 21300006, guid: 5cb91270455067d4290e4e4ba5199dc3, type: 3}
  - {fileID: 21300004, guid: 5cb91270455067d4290e4e4ba5199dc3, type: 3}
  - {fileID: 21300002, guid: 5cb91270455067d4290e4e4ba5199dc3, type: 3}
  - {fileID: 21300000, guid: 5cb91270455067d4290e4e4ba5199dc3, type: 3}
  - {fileID: 21300000, guid: 57134e7003e6dd94e8078aa295441f56, type: 3}
  - {fileID: 21300000, guid: 8b2945d079e52384e8e44389dbe0f29c, type: 3}
  - {fileID: 21300000, guid: 7b025211a8a08e744bad7d8e479ffdfd, type: 3}
  - {fileID: 21300000, guid: aeeccc11ed75fb149bbd9cd9299d2b47, type: 3}
  - {fileID: 21300000, guid: ed3a1921d82e63947bf4e35c5ca76199, type: 3}
  - {fileID: 21300000, guid: e98cf931fcd87a34fa340442a30e5def, type: 3}
  - {fileID: 21300000, guid: 52cdc84104c0d8643b18be85d05a1b31, type: 3}
  - {fileID: 21300002, guid: 52cdc84104c0d8643b18be85d05a1b31, type: 3}
  - {fileID: 21300002, guid: 4a0d1d5163a096c41b719f57c713a32d, type: 3}
  - {fileID: 21300000, guid: 4a0d1d5163a096c41b719f57c713a32d, type: 3}
  - {fileID: 21300000, guid: 7e7dd5817b4f2d0468517233297b4150, type: 3}
  - {fileID: 21300002, guid: 35169ef18dbf5ae4c85dbd976197c705, type: 3}
  - {fileID: 21300004, guid: 35169ef18dbf5ae4c85dbd976197c705, type: 3}
  - {fileID: 21300010, guid: 35169ef18dbf5ae4c85dbd976197c705, type: 3}
  - {fileID: 21300008, guid: 35169ef18dbf5ae4c85dbd976197c705, type: 3}
  - {fileID: 21300000, guid: 35169ef18dbf5ae4c85dbd976197c705, type: 3}
  - {fileID: 21300006, guid: 35169ef18dbf5ae4c85dbd976197c705, type: 3}
  - {fileID: 21300000, guid: 3a3aa7027861c194188fbce3acc02920, type: 3}
  - {fileID: 21300002, guid: 3a3aa7027861c194188fbce3acc02920, type: 3}
  - {fileID: 21300000, guid: dc336d223f2bf5c43a1a041cdf6c131e, type: 3}
  - {fileID: 21300002, guid: 456b2c426c106a644ad3fb07b1172e34, type: 3}
  - {fileID: 21300000, guid: 456b2c426c106a644ad3fb07b1172e34, type: 3}
  - {fileID: 21300000, guid: e80038d26d8377049b47e09bc429ce0b, type: 3}
  - {fileID: 21300000, guid: 0ec77f03f18c06449bff0bf28ea98331, type: 3}
  - {fileID: 21300000, guid: 4fc0eb23b35e3d643af0fb68fc878921, type: 3}
  - {fileID: 21300000, guid: 657f3eb3c51ef2647b2fe7d161bfb8bf, type: 3}
  - {fileID: 21300000, guid: 0fe58ff3a13d2b343a2b1ac68f3d67b3, type: 3}
  - {fileID: 21300000, guid: 27acc114ab1a17e4fbeaa53b09ab6489, type: 3}
  - {fileID: 21300000, guid: 895a18947d3a9d84d9614de8a092c30b, type: 3}
  - {fileID: 21300002, guid: e021fbc4e135f8e43bdf1f407b1fcfda, type: 3}
  - {fileID: 21300000, guid: e021fbc4e135f8e43bdf1f407b1fcfda, type: 3}
  - {fileID: 21300006, guid: e021fbc4e135f8e43bdf1f407b1fcfda, type: 3}
  - {fileID: 21300004, guid: e021fbc4e135f8e43bdf1f407b1fcfda, type: 3}
  - {fileID: 21300000, guid: 7a77ced4f6e83934da22a9f82cae7a57, type: 3}
  - {fileID: 21300000, guid: 64fd071552306d8478084f396b2673cc, type: 3}
  - {fileID: 21300004, guid: e3b21175076ce304eb0e3bbde1b42446, type: 3}
  - {fileID: 21300000, guid: e3b21175076ce304eb0e3bbde1b42446, type: 3}
  - {fileID: 21300002, guid: e3b21175076ce304eb0e3bbde1b42446, type: 3}
  - {fileID: 21300000, guid: 7d3785b5c1f72734d98ac7650c8aadb1, type: 3}
  - {fileID: 21300000, guid: a9931fe5abcaa2445b838c3a52c38fb5, type: 3}
  - {fileID: 21300002, guid: 07bc9066a993b0747a866b9722375206, type: 3}
  - {fileID: 21300000, guid: 07bc9066a993b0747a866b9722375206, type: 3}
  - {fileID: 21300000, guid: a279bd66000aca746aa244c4192aaa92, type: 3}
  - {fileID: 21300000, guid: 7ccff1c6488a2b447be4f4541c80be38, type: 3}
  - {fileID: 21300002, guid: 7ccff1c6488a2b447be4f4541c80be38, type: 3}
  - {fileID: 21300000, guid: ad49be2713f951f4d9f0d10b1dedd7b3, type: 3}
  - {fileID: 21300000, guid: f5114f77de0382e439ca70f3968b6e13, type: 3}
  - {fileID: 21300000, guid: bf6426f7566c6ef4ea3de314680d93f0, type: 3}
  - {fileID: 21300002, guid: bf6426f7566c6ef4ea3de314680d93f0, type: 3}
  - {fileID: 21300012, guid: a1653dd822dd0c94b8ff943e4863c762, type: 3}
  - {fileID: 21300004, guid: a1653dd822dd0c94b8ff943e4863c762, type: 3}
  - {fileID: 21300010, guid: a1653dd822dd0c94b8ff943e4863c762, type: 3}
  - {fileID: 21300002, guid: a1653dd822dd0c94b8ff943e4863c762, type: 3}
  - {fileID: 21300006, guid: a1653dd822dd0c94b8ff943e4863c762, type: 3}
  - {fileID: 21300000, guid: a1653dd822dd0c94b8ff943e4863c762, type: 3}
  - {fileID: 21300008, guid: a1653dd822dd0c94b8ff943e4863c762, type: 3}
  - {fileID: 21300014, guid: a1653dd822dd0c94b8ff943e4863c762, type: 3}
  - {fileID: 21300016, guid: a1653dd822dd0c94b8ff943e4863c762, type: 3}
  - {fileID: 21300000, guid: 65124dd85fc62b6428722ce6967c481c, type: 3}
  - {fileID: 21300000, guid: 4d9256e84cdf9d54c8f8d87120167783, type: 3}
  - {fileID: 21300004, guid: 4d9256e84cdf9d54c8f8d87120167783, type: 3}
  - {fileID: 21300006, guid: 4d9256e84cdf9d54c8f8d87120167783, type: 3}
  - {fileID: 21300002, guid: 4d9256e84cdf9d54c8f8d87120167783, type: 3}
  - {fileID: 21300000, guid: f6e00a29d9c8a9447819f8d6d5b6d67d, type: 3}
  - {fileID: 21300000, guid: 88c6dc69db2265d4787a3707908825bb, type: 3}
  - {fileID: 21300000, guid: 459e687990ca0ed42a8ecabeb37167a9, type: 3}
  - {fileID: 21300000, guid: 3c1b8c3a6a66c134db53cee985d2e25d, type: 3}
  - {fileID: 21300000, guid: 15c9417ab4977764e8afff25fc401636, type: 3}
  - {fileID: 21300002, guid: 15c9417ab4977764e8afff25fc401636, type: 3}
  - {fileID: 21300000, guid: ec837e8a5c1e8b4499afd95a8259a445, type: 3}
  - {fileID: 21300000, guid: 0ef08eda2e9f0a646b6901006c87299b, type: 3}
  - {fileID: 21300002, guid: 0ef08eda2e9f0a646b6901006c87299b, type: 3}
  - {fileID: 21300004, guid: 0ef08eda2e9f0a646b6901006c87299b, type: 3}
  - {fileID: 21300004, guid: 71ac5f4b513ed72468ab6745b9f763ba, type: 3}
  - {fileID: 21300002, guid: 71ac5f4b513ed72468ab6745b9f763ba, type: 3}
  - {fileID: 21300000, guid: 71ac5f4b513ed72468ab6745b9f763ba, type: 3}
  - {fileID: 21300000, guid: 9df566abd94e2d1499ef7aecbf0f7235, type: 3}
  - {fileID: 21300002, guid: 9df566abd94e2d1499ef7aecbf0f7235, type: 3}
  - {fileID: 21300000, guid: 822116eb5680b8042bdce70ca61ad0b7, type: 3}
  - {fileID: 21300000, guid: a317afeb329a6484fa75509cec4ebd39, type: 3}
  - {fileID: 21300000, guid: a4abae0c326c54141add007b3faed731, type: 3}
  - {fileID: 21300000, guid: 32863d2c0726c4b4cb40a649120294c1, type: 3}
  - {fileID: 21300000, guid: d1d6f78c1afb66244b1f3b323fdcd18a, type: 3}
  - {fileID: 21300000, guid: 2a2a7e0d0b6ae7348944ab474b3730e1, type: 3}
  - {fileID: 21300000, guid: a4f8cbad920e753488120e8b1bd63fd5, type: 3}
  - {fileID: 21300010, guid: aed04c2ecbb4adc41b976afe24cc6b5c, type: 3}
  - {fileID: 21300006, guid: aed04c2ecbb4adc41b976afe24cc6b5c, type: 3}
  - {fileID: 21300008, guid: aed04c2ecbb4adc41b976afe24cc6b5c, type: 3}
  - {fileID: 21300000, guid: ce5801ce79e162e4188c931d233acac8, type: 3}
  - {fileID: 21300000, guid: e89dee7fbf406e14c91398194e15eeb1, type: 3}
  - {fileID: 21300000, guid: 48b85bdfb57511f498a66aefb13d3004, type: 3}
  m_PackedSpriteNamesToIndex:
  - login_textfield
  - window_shadow_sidebar
  - stars_little_right_inactive
  - stars_little_left_inactive
  - stars_little_right_active
  - stars_little_left_active
  - window_bg_big 1
  - game_button_action
  - game_joystick_main
  - uie_pageind_inactive
  - game_button_pause
  - window_bg
  - window_shadow_scroll_top
  - window_shadow_scroll_bottom
  - icon_actions_1
  - icon_actions_0
  - character_tabs_bg
  - settings_list_item_bottom_inactive
  - settings_list_item_center_inactive
  - settings_list_item_up_inactive
  - settings_list_item_up_active
  - settings_list_item_bottom_active
  - settings_list_item_center_active
  - levelresult_exp_progressbar_filled
  - levelresult_exp_progressbar_empty
  - gen_frame_stroke
  - character_talentbar_number_bg
  - character_talentbar_bg
  - quests_bg_mask
  - quests_bg
  - uie_checkbox_tick
  - character_header
  - game_icon_pause
  - uie_checkbox_bg
  - window_header
  - game_healthbar_enemy_empty
  - game_healthbar_enemy_filled
  - game_healthbar_player_empty
  - game_healthbar_player_filled
  - shop_item_bg
  - Hook
  - levelresult_button_red
  - levelresult_button_blue
  - levelresult_button_green
  - game_joystick_moveable
  - gen_frame_empty
  - gen_frame_green_inactive
  - gen_frame_green_active
  - uie_seekbar_shape
  - levelresult_stars_center_inactive
  - levelresult_stars_center_active
  - uie_radio_bg
  - window_bg_big_mask
  - levelresult_text_victory
  - levelresult_text_fail
  - gen_icon_ok
  - gen_icon_play
  - gen_icon_return
  - gen_icon_achievements
  - gen_icon_about
  - gen_icon_shop
  - gen_icon_settings
  - gen_icon_refresh
  - gen_icon_signup
  - background
  - levelresult_stars_right_active
  - levelresult_stars_left_active
  - levelresult_stars_left_inactive
  - levelresult_stars_right_inactive
  - character_tabs_selected
  - uie_seekbar_bg
  - backgroundBlue
  - gen_frame_little
  - stars_little_center_active
  - stars_little_center_inactive
  - gen_frame_character_stroke
  - main_button_blue
  - main_button_green
  - main_button_red
  - icons_l_2
  - icons_l_1
  - icons_l_0
  - characters_illidan
  - characters_priest
  - window_close
  - window_contentmask
  - window_bg_big
  - uie_pageind_active
  - levelresult_rewards_bg
  - uie_radio_tick
  - icon_quest
  - gen_button_simple_2
  - gen_button_simple_0
  - gen_button_simple_1
  - levelresult_exp_bg
  - gen_frame_green_mask
  - gen_frame_mask
  m_Tag: 1
  m_IsVariant: 0
