%YAML 1.1
%TAG !u! tag:unity3d.com,2011:
--- !u!114 &11400000
MonoBehaviour:
  m_ObjectHideFlags: 0
  m_CorrespondingSourceObject: {fileID: 0}
  m_PrefabInstance: {fileID: 0}
  m_PrefabAsset: {fileID: 0}
  m_GameObject: {fileID: 0}
  m_Enabled: 1
  m_EditorHideFlags: 0
  m_Script: {fileID: 11500000, guid: b17231b3621bfe74997d9f1128acac53, type: 3}
  m_Name: 3
  m_EditorClassIdentifier: 
  Name: Samael
  Cost: 200
  IconSprite: {fileID: 21300000, guid: 92ce3e156a787e14ba9ece9a5d037fe7, type: 3}
  Number: 3
