%YAML 1.1
%TAG !u! tag:unity3d.com,2011:
--- !u!114 &11400000
MonoBehaviour:
  m_ObjectHideFlags: 0
  m_CorrespondingSourceObject: {fileID: 0}
  m_PrefabInstance: {fileID: 0}
  m_PrefabAsset: {fileID: 0}
  m_GameObject: {fileID: 0}
  m_Enabled: 1
  m_EditorHideFlags: 0
  m_Script: {fileID: 11500000, guid: 7796a40731b87ac4b8fdefbab25c3174, type: 3}
  m_Name: New Level_10
  m_EditorClassIdentifier: 
  SequenceMechanics: 000000000400000005000000
  TexturesEye:
  - {fileID: 2800000, guid: 6ebd0235f2b200b409e6b1d525d37bc0, type: 3}
  BrushProps: {fileID: 8631912002467920956, guid: 9b9f70561bf1d09478cfc662ac5d471b, type: 3}
  DiamondProps: {fileID: 1926052489092098461, guid: 9856eab64f3a81641a635aba3cc3ed27, type: 3}
  Lens:
  - {fileID: 2800000, guid: a362c1bfa476a7d47ad05bfbb5b33616, type: 3}
  - {fileID: 2800000, guid: 82c757d3eb112554593a640db870768c, type: 3}
  - {fileID: 2800000, guid: 9f25251792e014e4eb7a4413a3005f56, type: 3}
  LensSprite: []
  Lips: []
  EyeBrows:
  - serializedVersion: 2
    rgba: 4278190335
  - serializedVersion: 2
    rgba: 4278251775
  - serializedVersion: 2
    rgba: 4280286976
  EyeLashes: {fileID: 2800000, guid: 53f6a61b69d680b4094fddf8bf57e46b, type: 3}
