%YAML 1.1
%TAG !u! tag:unity3d.com,2011:
--- !u!1 &8756167019023105080
GameObject:
  m_ObjectHideFlags: 0
  m_CorrespondingSourceObject: {fileID: 0}
  m_PrefabInstance: {fileID: 0}
  m_PrefabAsset: {fileID: 0}
  serializedVersion: 6
  m_Component:
  - component: {fileID: 1286659055507463003}
  m_Layer: 0
  m_Name: Level_11
  m_TagString: Untagged
  m_Icon: {fileID: 0}
  m_NavMeshLayer: 0
  m_StaticEditorFlags: 0
  m_IsActive: 1
--- !u!4 &1286659055507463003
Transform:
  m_ObjectHideFlags: 0
  m_CorrespondingSourceObject: {fileID: 0}
  m_PrefabInstance: {fileID: 0}
  m_PrefabAsset: {fileID: 0}
  m_GameObject: {fileID: 8756167019023105080}
  m_LocalRotation: {x: 0, y: 0, z: 0, w: 1}
  m_LocalPosition: {x: 0.02, y: 0, z: 0}
  m_LocalScale: {x: 1, y: 1, z: 1}
  m_Children:
  - {fileID: 9170167990687660730}
  m_Father: {fileID: 0}
  m_RootOrder: 0
  m_LocalEulerAnglesHint: {x: 0, y: 0, z: 0}
--- !u!1001 &3546882441506001651
PrefabInstance:
  m_ObjectHideFlags: 0
  serializedVersion: 2
  m_Modification:
    m_TransformParent: {fileID: 1286659055507463003}
    m_Modifications:
    - target: {fileID: 578995021721629977, guid: 4c2b00e47a4de3e44b8aafb5ed39324d, type: 3}
      propertyPath: cooldown
      value: -274.7175
      objectReference: {fileID: 0}
    - target: {fileID: 3451083717701301230, guid: 4c2b00e47a4de3e44b8aafb5ed39324d, type: 3}
      propertyPath: CurrentMeshaniks
      value: 
      objectReference: {fileID: 11400000, guid: 2a11d7b344f500d4aa570f09291cd688, type: 2}
    - target: {fileID: 4941789300945151304, guid: 4c2b00e47a4de3e44b8aafb5ed39324d, type: 3}
      propertyPath: cooldown
      value: -254.10791
      objectReference: {fileID: 0}
    - target: {fileID: 4985525842674266867, guid: 4c2b00e47a4de3e44b8aafb5ed39324d, type: 3}
      propertyPath: m_Name
      value: Girl_1
      objectReference: {fileID: 0}
    - target: {fileID: 5328123977351220710, guid: 4c2b00e47a4de3e44b8aafb5ed39324d, type: 3}
      propertyPath: CurrentMeshaniks
      value: 
      objectReference: {fileID: 11400000, guid: 2a11d7b344f500d4aa570f09291cd688, type: 2}
    - target: {fileID: 5655384213291100233, guid: 4c2b00e47a4de3e44b8aafb5ed39324d, type: 3}
      propertyPath: m_RootOrder
      value: 0
      objectReference: {fileID: 0}
    - target: {fileID: 5655384213291100233, guid: 4c2b00e47a4de3e44b8aafb5ed39324d, type: 3}
      propertyPath: m_LocalPosition.x
      value: 0
      objectReference: {fileID: 0}
    - target: {fileID: 5655384213291100233, guid: 4c2b00e47a4de3e44b8aafb5ed39324d, type: 3}
      propertyPath: m_LocalPosition.y
      value: 0
      objectReference: {fileID: 0}
    - target: {fileID: 5655384213291100233, guid: 4c2b00e47a4de3e44b8aafb5ed39324d, type: 3}
      propertyPath: m_LocalPosition.z
      value: 0
      objectReference: {fileID: 0}
    - target: {fileID: 5655384213291100233, guid: 4c2b00e47a4de3e44b8aafb5ed39324d, type: 3}
      propertyPath: m_LocalRotation.w
      value: 1
      objectReference: {fileID: 0}
    - target: {fileID: 5655384213291100233, guid: 4c2b00e47a4de3e44b8aafb5ed39324d, type: 3}
      propertyPath: m_LocalRotation.x
      value: 0
      objectReference: {fileID: 0}
    - target: {fileID: 5655384213291100233, guid: 4c2b00e47a4de3e44b8aafb5ed39324d, type: 3}
      propertyPath: m_LocalRotation.y
      value: 0
      objectReference: {fileID: 0}
    - target: {fileID: 5655384213291100233, guid: 4c2b00e47a4de3e44b8aafb5ed39324d, type: 3}
      propertyPath: m_LocalRotation.z
      value: 0
      objectReference: {fileID: 0}
    - target: {fileID: 5655384213291100233, guid: 4c2b00e47a4de3e44b8aafb5ed39324d, type: 3}
      propertyPath: m_LocalEulerAnglesHint.x
      value: 0
      objectReference: {fileID: 0}
    - target: {fileID: 5655384213291100233, guid: 4c2b00e47a4de3e44b8aafb5ed39324d, type: 3}
      propertyPath: m_LocalEulerAnglesHint.y
      value: 0
      objectReference: {fileID: 0}
    - target: {fileID: 5655384213291100233, guid: 4c2b00e47a4de3e44b8aafb5ed39324d, type: 3}
      propertyPath: m_LocalEulerAnglesHint.z
      value: 0
      objectReference: {fileID: 0}
    - target: {fileID: 6384524222702540179, guid: 4c2b00e47a4de3e44b8aafb5ed39324d, type: 3}
      propertyPath: cooldown
      value: -282.97467
      objectReference: {fileID: 0}
    m_RemovedComponents: []
  m_SourcePrefab: {fileID: 100100000, guid: 4c2b00e47a4de3e44b8aafb5ed39324d, type: 3}
--- !u!4 &9170167990687660730 stripped
Transform:
  m_CorrespondingSourceObject: {fileID: 5655384213291100233, guid: 4c2b00e47a4de3e44b8aafb5ed39324d, type: 3}
  m_PrefabInstance: {fileID: 3546882441506001651}
  m_PrefabAsset: {fileID: 0}
