%YAML 1.1
%TAG !u! tag:unity3d.com,2011:
--- !u!114 &11400000
MonoBehaviour:
  m_ObjectHideFlags: 0
  m_CorrespondingSourceObject: {fileID: 0}
  m_PrefabInstance: {fileID: 0}
  m_PrefabAsset: {fileID: 0}
  m_GameObject: {fileID: 0}
  m_Enabled: 1
  m_EditorHideFlags: 0
  m_Script: {fileID: 11500000, guid: 7796a40731b87ac4b8fdefbab25c3174, type: 3}
  m_Name: New Level_9
  m_EditorClassIdentifier: 
  SequenceMechanics: 010000000600000005000000
  TexturesEye:
  - {fileID: 2800000, guid: 09fda03c1ec251a46b0f541b3e95da22, type: 3}
  BrushProps: {fileID: 7981844077098573888, guid: c3d113342cb06eb4396b4b136df2fdfc, type: 3}
  DiamondProps: {fileID: 7763470615287269070, guid: a1abb423cfb610941b34a00410c1a85d, type: 3}
  Lens:
  - {fileID: 2800000, guid: 92283c026b8496d478484cac8d27f0f4, type: 3}
  - {fileID: 2800000, guid: 0922a02dce8c56742ae98e1f44a59deb, type: 3}
  - {fileID: 2800000, guid: 27a1329f4768f414ebe434ecb8b3565d, type: 3}
  LensSprite:
  - {fileID: 21300000, guid: 65b5ad510d593ca41810bd5eda3b7a34, type: 3}
  - {fileID: 21300000, guid: 1fa60fbc8920bc149aadd6b296c44f98, type: 3}
  - {fileID: 21300000, guid: 3660ecaf404897a41bf1d58770f8169e, type: 3}
  Lips:
  - serializedVersion: 2
    rgba: 4294377216
  - serializedVersion: 2
    rgba: 4278255564
  - serializedVersion: 2
    rgba: 4294928789
  EyeBrows: []
  EyeLashes: {fileID: 2800000, guid: 53f6a61b69d680b4094fddf8bf57e46b, type: 3}
