%YAML 1.1
%TAG !u! tag:unity3d.com,2011:
--- !u!114 &11400000
MonoBehaviour:
  m_ObjectHideFlags: 0
  m_CorrespondingSourceObject: {fileID: 0}
  m_PrefabInstance: {fileID: 0}
  m_PrefabAsset: {fileID: 0}
  m_GameObject: {fileID: 0}
  m_Enabled: 1
  m_EditorHideFlags: 0
  m_Script: {fileID: 11500000, guid: 7796a40731b87ac4b8fdefbab25c3174, type: 3}
  m_Name: New Level_1
  m_EditorClassIdentifier: 
  SequenceMechanics: 0000000001000000
  TexturesEye:
  - {fileID: 2800000, guid: 2e750bb28f84a3746be30d03c19fc23f, type: 3}
  BrushProps: {fileID: 7981844077098573888, guid: c3d113342cb06eb4396b4b136df2fdfc, type: 3}
  DiamondProps: {fileID: 7763470615287269070, guid: a1abb423cfb610941b34a00410c1a85d, type: 3}
  Lens:
  - {fileID: 2800000, guid: a362c1bfa476a7d47ad05bfbb5b33616, type: 3}
  - {fileID: 2800000, guid: 82c757d3eb112554593a640db870768c, type: 3}
  - {fileID: 2800000, guid: 9f25251792e014e4eb7a4413a3005f56, type: 3}
  LensSprite: []
  Lips:
  - serializedVersion: 2
    rgba: 4278255399
  - serializedVersion: 2
    rgba: 4278208511
  - serializedVersion: 2
    rgba: 4294949632
  EyeBrows:
  - serializedVersion: 2
    rgba: 4278190335
  - serializedVersion: 2
    rgba: 4278251775
  - serializedVersion: 2
    rgba: 4280286976
  EyeLashes: {fileID: 2800000, guid: 53f6a61b69d680b4094fddf8bf57e46b, type: 3}
