%YAML 1.1
%TAG !u! tag:unity3d.com,2011:
--- !u!1 &1967202408112661239
GameObject:
  m_ObjectHideFlags: 0
  m_CorrespondingSourceObject: {fileID: 0}
  m_PrefabInstance: {fileID: 0}
  m_PrefabAsset: {fileID: 0}
  serializedVersion: 6
  m_Component:
  - component: {fileID: 1928334905735104867}
  - component: {fileID: 3756694760577115922}
  m_Layer: 0
  m_Name: PropContainer
  m_TagString: Untagged
  m_Icon: {fileID: 0}
  m_NavMeshLayer: 0
  m_StaticEditorFlags: 0
  m_IsActive: 1
--- !u!4 &1928334905735104867
Transform:
  m_ObjectHideFlags: 0
  m_CorrespondingSourceObject: {fileID: 0}
  m_PrefabInstance: {fileID: 0}
  m_PrefabAsset: {fileID: 0}
  m_GameObject: {fileID: 1967202408112661239}
  m_LocalRotation: {x: 0, y: 0, z: 0, w: 1}
  m_LocalPosition: {x: 0, y: 0, z: 0}
  m_LocalScale: {x: 1, y: 1, z: 1}
  m_Children:
  - {fileID: 7172193951357361324}
  m_Father: {fileID: 7399686872666509008}
  m_RootOrder: 2
  m_LocalEulerAnglesHint: {x: 0, y: 0, z: 0}
--- !u!114 &3756694760577115922
MonoBehaviour:
  m_ObjectHideFlags: 0
  m_CorrespondingSourceObject: {fileID: 0}
  m_PrefabInstance: {fileID: 0}
  m_PrefabAsset: {fileID: 0}
  m_GameObject: {fileID: 1967202408112661239}
  m_Enabled: 1
  m_EditorHideFlags: 0
  m_Script: {fileID: 11500000, guid: d819fc9cbe4033944b66557de72f0a74, type: 3}
  m_Name: 
  m_EditorClassIdentifier: 
  m_IsPlayBaseAnimation: 1
  m_MaxAngle: 35
--- !u!1 &7206455510916799841
GameObject:
  m_ObjectHideFlags: 0
  m_CorrespondingSourceObject: {fileID: 0}
  m_PrefabInstance: {fileID: 0}
  m_PrefabAsset: {fileID: 0}
  serializedVersion: 6
  m_Component:
  - component: {fileID: 7206455510916799840}
  - component: {fileID: 7206455510916799843}
  m_Layer: 0
  m_Name: GameObject
  m_TagString: Untagged
  m_Icon: {fileID: 0}
  m_NavMeshLayer: 0
  m_StaticEditorFlags: 0
  m_IsActive: 1
--- !u!4 &7206455510916799840
Transform:
  m_ObjectHideFlags: 0
  m_CorrespondingSourceObject: {fileID: 0}
  m_PrefabInstance: {fileID: 0}
  m_PrefabAsset: {fileID: 0}
  m_GameObject: {fileID: 7206455510916799841}
  m_LocalRotation: {x: 0.99998415, y: -0, z: -0, w: -0.005634274}
  m_LocalPosition: {x: 0.05221178, y: 0.017943636, z: -1.9989488}
  m_LocalScale: {x: 0.43043, y: 0.43043, z: 0.43043}
  m_Children: []
  m_Father: {fileID: 7399686872666509008}
  m_RootOrder: 0
  m_LocalEulerAnglesHint: {x: 180.646, y: 0, z: 0}
--- !u!212 &7206455510916799843
SpriteRenderer:
  m_ObjectHideFlags: 0
  m_CorrespondingSourceObject: {fileID: 0}
  m_PrefabInstance: {fileID: 0}
  m_PrefabAsset: {fileID: 0}
  m_GameObject: {fileID: 7206455510916799841}
  m_Enabled: 1
  m_CastShadows: 0
  m_ReceiveShadows: 0
  m_DynamicOccludee: 1
  m_MotionVectors: 1
  m_LightProbeUsage: 1
  m_ReflectionProbeUsage: 1
  m_RayTracingMode: 0
  m_RayTraceProcedural: 0
  m_RenderingLayerMask: 1
  m_RendererPriority: 0
  m_Materials:
  - {fileID: 10754, guid: 0000000000000000f000000000000000, type: 0}
  m_StaticBatchInfo:
    firstSubMesh: 0
    subMeshCount: 0
  m_StaticBatchRoot: {fileID: 0}
  m_ProbeAnchor: {fileID: 0}
  m_LightProbeVolumeOverride: {fileID: 0}
  m_ScaleInLightmap: 1
  m_ReceiveGI: 1
  m_PreserveUVs: 0
  m_IgnoreNormalsForChartDetection: 0
  m_ImportantGI: 0
  m_StitchLightmapSeams: 1
  m_SelectedEditorRenderState: 0
  m_MinimumChartSize: 4
  m_AutoUVMaxDistance: 0.5
  m_AutoUVMaxAngle: 89
  m_LightmapParameters: {fileID: 0}
  m_SortingLayerID: 0
  m_SortingLayer: 0
  m_SortingOrder: 0
  m_Sprite: {fileID: 21300000, guid: 5ff715664cfba124b8239abe7e7d3a06, type: 3}
  m_Color: {r: 1, g: 1, b: 1, a: 0.3137255}
  m_FlipX: 0
  m_FlipY: 0
  m_DrawMode: 0
  m_Size: {x: 2.56, y: 2.56}
  m_AdaptiveModeThreshold: 0.5
  m_SpriteTileMode: 0
  m_WasSpriteAssigned: 1
  m_MaskInteraction: 0
  m_SpriteSortPoint: 0
--- !u!1 &7206455512407363480
GameObject:
  m_ObjectHideFlags: 0
  m_CorrespondingSourceObject: {fileID: 0}
  m_PrefabInstance: {fileID: 0}
  m_PrefabAsset: {fileID: 0}
  serializedVersion: 6
  m_Component:
  - component: {fileID: 7206455512407363483}
  - component: {fileID: 7206455512407363476}
  - component: {fileID: 7206455512407363477}
  - component: {fileID: 7206455512407363482}
  m_Layer: 0
  m_Name: Cube
  m_TagString: Untagged
  m_Icon: {fileID: 0}
  m_NavMeshLayer: 0
  m_StaticEditorFlags: 0
  m_IsActive: 0
--- !u!4 &7206455512407363483
Transform:
  m_ObjectHideFlags: 0
  m_CorrespondingSourceObject: {fileID: 0}
  m_PrefabInstance: {fileID: 0}
  m_PrefabAsset: {fileID: 0}
  m_GameObject: {fileID: 7206455512407363480}
  m_LocalRotation: {x: 0.9928537, y: -0.11920474, z: -0.00067171047, w: -0.0055941697}
  m_LocalPosition: {x: -0.46, y: -1.85, z: -2.02}
  m_LocalScale: {x: 0.43043002, y: 2.2635026, z: 0.43043005}
  m_Children: []
  m_Father: {fileID: 7399686872666509008}
  m_RootOrder: 1
  m_LocalEulerAnglesHint: {x: 180.646, y: 0, z: 13.692993}
--- !u!33 &7206455512407363476
MeshFilter:
  m_ObjectHideFlags: 0
  m_CorrespondingSourceObject: {fileID: 0}
  m_PrefabInstance: {fileID: 0}
  m_PrefabAsset: {fileID: 0}
  m_GameObject: {fileID: 7206455512407363480}
  m_Mesh: {fileID: 10202, guid: 0000000000000000e000000000000000, type: 0}
--- !u!23 &7206455512407363477
MeshRenderer:
  m_ObjectHideFlags: 0
  m_CorrespondingSourceObject: {fileID: 0}
  m_PrefabInstance: {fileID: 0}
  m_PrefabAsset: {fileID: 0}
  m_GameObject: {fileID: 7206455512407363480}
  m_Enabled: 1
  m_CastShadows: 1
  m_ReceiveShadows: 1
  m_DynamicOccludee: 1
  m_MotionVectors: 1
  m_LightProbeUsage: 1
  m_ReflectionProbeUsage: 1
  m_RayTracingMode: 2
  m_RayTraceProcedural: 0
  m_RenderingLayerMask: 1
  m_RendererPriority: 0
  m_Materials:
  - {fileID: 10303, guid: 0000000000000000f000000000000000, type: 0}
  m_StaticBatchInfo:
    firstSubMesh: 0
    subMeshCount: 0
  m_StaticBatchRoot: {fileID: 0}
  m_ProbeAnchor: {fileID: 0}
  m_LightProbeVolumeOverride: {fileID: 0}
  m_ScaleInLightmap: 1
  m_ReceiveGI: 1
  m_PreserveUVs: 0
  m_IgnoreNormalsForChartDetection: 0
  m_ImportantGI: 0
  m_StitchLightmapSeams: 1
  m_SelectedEditorRenderState: 3
  m_MinimumChartSize: 4
  m_AutoUVMaxDistance: 0.5
  m_AutoUVMaxAngle: 89
  m_LightmapParameters: {fileID: 0}
  m_SortingLayerID: 0
  m_SortingLayer: 0
  m_SortingOrder: 0
  m_AdditionalVertexStreams: {fileID: 0}
--- !u!65 &7206455512407363482
BoxCollider:
  m_ObjectHideFlags: 0
  m_CorrespondingSourceObject: {fileID: 0}
  m_PrefabInstance: {fileID: 0}
  m_PrefabAsset: {fileID: 0}
  m_GameObject: {fileID: 7206455512407363480}
  m_Material: {fileID: 0}
  m_IsTrigger: 0
  m_Enabled: 1
  serializedVersion: 2
  m_Size: {x: 1, y: 1, z: 1}
  m_Center: {x: 0, y: 0, z: 0}
--- !u!1 &7399686872666509018
GameObject:
  m_ObjectHideFlags: 0
  m_CorrespondingSourceObject: {fileID: 0}
  m_PrefabInstance: {fileID: 0}
  m_PrefabAsset: {fileID: 0}
  serializedVersion: 6
  m_Component:
  - component: {fileID: 7399686872666509008}
  - component: {fileID: 7399686872666509009}
  - component: {fileID: 7399686872666509022}
  - component: {fileID: 7399686872666509012}
  - component: {fileID: 7399686872666509013}
  m_Layer: 0
  m_Name: LensMechanisk
  m_TagString: Untagged
  m_Icon: {fileID: 0}
  m_NavMeshLayer: 0
  m_StaticEditorFlags: 0
  m_IsActive: 1
--- !u!4 &7399686872666509008
Transform:
  m_ObjectHideFlags: 0
  m_CorrespondingSourceObject: {fileID: 0}
  m_PrefabInstance: {fileID: 0}
  m_PrefabAsset: {fileID: 0}
  m_GameObject: {fileID: 7399686872666509018}
  m_LocalRotation: {x: 0, y: 0, z: 0, w: 1}
  m_LocalPosition: {x: -0.102, y: 0.098, z: -0.7289529}
  m_LocalScale: {x: 0.064913124, y: 0.064913124, z: 0.064913124}
  m_Children:
  - {fileID: 7206455510916799840}
  - {fileID: 7206455512407363483}
  - {fileID: 1928334905735104867}
  m_Father: {fileID: 0}
  m_RootOrder: 0
  m_LocalEulerAnglesHint: {x: 0, y: 0, z: 0}
--- !u!33 &7399686872666509009
MeshFilter:
  m_ObjectHideFlags: 0
  m_CorrespondingSourceObject: {fileID: 0}
  m_PrefabInstance: {fileID: 0}
  m_PrefabAsset: {fileID: 0}
  m_GameObject: {fileID: 7399686872666509018}
  m_Mesh: {fileID: 10207, guid: 0000000000000000e000000000000000, type: 0}
--- !u!23 &7399686872666509022
MeshRenderer:
  m_ObjectHideFlags: 0
  m_CorrespondingSourceObject: {fileID: 0}
  m_PrefabInstance: {fileID: 0}
  m_PrefabAsset: {fileID: 0}
  m_GameObject: {fileID: 7399686872666509018}
  m_Enabled: 0
  m_CastShadows: 1
  m_ReceiveShadows: 1
  m_DynamicOccludee: 1
  m_MotionVectors: 1
  m_LightProbeUsage: 1
  m_ReflectionProbeUsage: 1
  m_RayTracingMode: 2
  m_RayTraceProcedural: 0
  m_RenderingLayerMask: 1
  m_RendererPriority: 0
  m_Materials:
  - {fileID: 2100000, guid: 2e1d9309bededbe49bf8702e57818744, type: 2}
  m_StaticBatchInfo:
    firstSubMesh: 0
    subMeshCount: 0
  m_StaticBatchRoot: {fileID: 0}
  m_ProbeAnchor: {fileID: 0}
  m_LightProbeVolumeOverride: {fileID: 0}
  m_ScaleInLightmap: 1
  m_ReceiveGI: 1
  m_PreserveUVs: 0
  m_IgnoreNormalsForChartDetection: 0
  m_ImportantGI: 0
  m_StitchLightmapSeams: 0
  m_SelectedEditorRenderState: 3
  m_MinimumChartSize: 4
  m_AutoUVMaxDistance: 0.5
  m_AutoUVMaxAngle: 89
  m_LightmapParameters: {fileID: 0}
  m_SortingLayerID: 0
  m_SortingLayer: 0
  m_SortingOrder: 0
  m_AdditionalVertexStreams: {fileID: 0}
--- !u!114 &7399686872666509012
MonoBehaviour:
  m_ObjectHideFlags: 0
  m_CorrespondingSourceObject: {fileID: 0}
  m_PrefabInstance: {fileID: 0}
  m_PrefabAsset: {fileID: 0}
  m_GameObject: {fileID: 7399686872666509018}
  m_Enabled: 1
  m_EditorHideFlags: 0
  m_Script: {fileID: 11500000, guid: b02afde17bb3ab945ae587a6e2ba800b, type: 3}
  m_Name: 
  m_EditorClassIdentifier: 
  m_MaxAngle: 5
--- !u!114 &7399686872666509013
MonoBehaviour:
  m_ObjectHideFlags: 0
  m_CorrespondingSourceObject: {fileID: 0}
  m_PrefabInstance: {fileID: 0}
  m_PrefabAsset: {fileID: 0}
  m_GameObject: {fileID: 7399686872666509018}
  m_Enabled: 1
  m_EditorHideFlags: 0
  m_Script: {fileID: 11500000, guid: daff9854d21aa584e94d050d1349e405, type: 3}
  m_Name: 
  m_EditorClassIdentifier: 
  Lens: {fileID: 8245225780322604091}
  Container: {fileID: 0}
  ColorBrows: []
--- !u!1001 &7206455512301386567
PrefabInstance:
  m_ObjectHideFlags: 0
  serializedVersion: 2
  m_Modification:
    m_TransformParent: {fileID: 1928334905735104867}
    m_Modifications:
    - target: {fileID: -8679921383154817045, guid: 4a89fb24313d636469e2d67c5790bcaa, type: 3}
      propertyPath: m_RootOrder
      value: 0
      objectReference: {fileID: 0}
    - target: {fileID: -8679921383154817045, guid: 4a89fb24313d636469e2d67c5790bcaa, type: 3}
      propertyPath: m_LocalScale.x
      value: 1.566892
      objectReference: {fileID: 0}
    - target: {fileID: -8679921383154817045, guid: 4a89fb24313d636469e2d67c5790bcaa, type: 3}
      propertyPath: m_LocalScale.y
      value: 1.5668919
      objectReference: {fileID: 0}
    - target: {fileID: -8679921383154817045, guid: 4a89fb24313d636469e2d67c5790bcaa, type: 3}
      propertyPath: m_LocalScale.z
      value: 1.566892
      objectReference: {fileID: 0}
    - target: {fileID: -8679921383154817045, guid: 4a89fb24313d636469e2d67c5790bcaa, type: 3}
      propertyPath: m_LocalPosition.x
      value: 0.040000036
      objectReference: {fileID: 0}
    - target: {fileID: -8679921383154817045, guid: 4a89fb24313d636469e2d67c5790bcaa, type: 3}
      propertyPath: m_LocalPosition.y
      value: -4.77
      objectReference: {fileID: 0}
    - target: {fileID: -8679921383154817045, guid: 4a89fb24313d636469e2d67c5790bcaa, type: 3}
      propertyPath: m_LocalPosition.z
      value: -0.5300004
      objectReference: {fileID: 0}
    - target: {fileID: -8679921383154817045, guid: 4a89fb24313d636469e2d67c5790bcaa, type: 3}
      propertyPath: m_LocalRotation.w
      value: 0.7071068
      objectReference: {fileID: 0}
    - target: {fileID: -8679921383154817045, guid: 4a89fb24313d636469e2d67c5790bcaa, type: 3}
      propertyPath: m_LocalRotation.x
      value: -0
      objectReference: {fileID: 0}
    - target: {fileID: -8679921383154817045, guid: 4a89fb24313d636469e2d67c5790bcaa, type: 3}
      propertyPath: m_LocalRotation.y
      value: 0.7071068
      objectReference: {fileID: 0}
    - target: {fileID: -8679921383154817045, guid: 4a89fb24313d636469e2d67c5790bcaa, type: 3}
      propertyPath: m_LocalRotation.z
      value: -0
      objectReference: {fileID: 0}
    - target: {fileID: -8679921383154817045, guid: 4a89fb24313d636469e2d67c5790bcaa, type: 3}
      propertyPath: m_LocalEulerAnglesHint.x
      value: 0
      objectReference: {fileID: 0}
    - target: {fileID: -8679921383154817045, guid: 4a89fb24313d636469e2d67c5790bcaa, type: 3}
      propertyPath: m_LocalEulerAnglesHint.y
      value: 90
      objectReference: {fileID: 0}
    - target: {fileID: -8679921383154817045, guid: 4a89fb24313d636469e2d67c5790bcaa, type: 3}
      propertyPath: m_LocalEulerAnglesHint.z
      value: 0
      objectReference: {fileID: 0}
    - target: {fileID: -4817869364308217, guid: 4a89fb24313d636469e2d67c5790bcaa, type: 3}
      propertyPath: m_LocalPosition.x
      value: -0.02
      objectReference: {fileID: 0}
    - target: {fileID: -4817869364308217, guid: 4a89fb24313d636469e2d67c5790bcaa, type: 3}
      propertyPath: m_LocalPosition.z
      value: -0
      objectReference: {fileID: 0}
    - target: {fileID: 919132149155446097, guid: 4a89fb24313d636469e2d67c5790bcaa, type: 3}
      propertyPath: m_Name
      value: propr_7
      objectReference: {fileID: 0}
    - target: {fileID: 1616392262590443388, guid: 4a89fb24313d636469e2d67c5790bcaa, type: 3}
      propertyPath: m_IsActive
      value: 1
      objectReference: {fileID: 0}
    m_RemovedComponents: []
  m_SourcePrefab: {fileID: 100100000, guid: 4a89fb24313d636469e2d67c5790bcaa, type: 3}
--- !u!4 &7172193951357361324 stripped
Transform:
  m_CorrespondingSourceObject: {fileID: -8679921383154817045, guid: 4a89fb24313d636469e2d67c5790bcaa, type: 3}
  m_PrefabInstance: {fileID: 7206455512301386567}
  m_PrefabAsset: {fileID: 0}
--- !u!1 &8245225780322604091 stripped
GameObject:
  m_CorrespondingSourceObject: {fileID: 1616392262590443388, guid: 4a89fb24313d636469e2d67c5790bcaa, type: 3}
  m_PrefabInstance: {fileID: 7206455512301386567}
  m_PrefabAsset: {fileID: 0}
