%YAML 1.1
%TAG !u! tag:unity3d.com,2011:
--- !u!114 &11400000
MonoBehaviour:
  m_ObjectHideFlags: 0
  m_CorrespondingSourceObject: {fileID: 0}
  m_PrefabInstance: {fileID: 0}
  m_PrefabAsset: {fileID: 0}
  m_GameObject: {fileID: 0}
  m_Enabled: 1
  m_EditorHideFlags: 0
  m_Script: {fileID: 11500000, guid: 7796a40731b87ac4b8fdefbab25c3174, type: 3}
  m_Name: New Level_5
  m_EditorClassIdentifier: 
  SequenceMechanics: 000000000600000001000000
  TexturesEye:
  - {fileID: 2800000, guid: f428366ad1a81af4780eb82c6ef8aa65, type: 3}
  - {fileID: 2800000, guid: 9250fa64e2377ae4aaaebc9ae16a2b55, type: 3}
  BrushProps: {fileID: 7981844077098573888, guid: c3d113342cb06eb4396b4b136df2fdfc, type: 3}
  DiamondProps: {fileID: 7763470615287269070, guid: a1abb423cfb610941b34a00410c1a85d, type: 3}
  Lens:
  - {fileID: 2800000, guid: 811ecc6177e2e974d9a3ac3b6005f096, type: 3}
  - {fileID: 2800000, guid: c5f4564205c59c449a2d6a3e2790cd02, type: 3}
  - {fileID: 2800000, guid: 30b9baa6557d52946a29bfcfbe5ca48f, type: 3}
  LensSprite:
  - {fileID: 21300000, guid: bd944c172b446b641b81fed29cf1aa11, type: 3}
  - {fileID: 21300000, guid: bbe725bf41fb59d41939981ce6009e6d, type: 3}
  - {fileID: 21300000, guid: 167597d9c00ab6a45a6a233893ad2a2e, type: 3}
  Lips:
  - serializedVersion: 2
    rgba: 4289855743
  - serializedVersion: 2
    rgba: 4278236159
  - serializedVersion: 2
    rgba: 4294901939
  EyeBrows:
  - serializedVersion: 2
    rgba: 4289855743
  - serializedVersion: 2
    rgba: 4278236159
  - serializedVersion: 2
    rgba: 4294901939
  EyeLashes: {fileID: 2800000, guid: 53f6a61b69d680b4094fddf8bf57e46b, type: 3}
