%YAML 1.1
%TAG !u! tag:unity3d.com,2011:
--- !u!1 &3040819256476750395
GameObject:
  m_ObjectHideFlags: 0
  m_CorrespondingSourceObject: {fileID: 0}
  m_PrefabInstance: {fileID: 0}
  m_PrefabAsset: {fileID: 0}
  serializedVersion: 6
  m_Component:
  - component: {fileID: 4786252293981205848}
  m_Layer: 0
  m_Name: Level_1
  m_TagString: Untagged
  m_Icon: {fileID: 0}
  m_NavMeshLayer: 0
  m_StaticEditorFlags: 0
  m_IsActive: 1
--- !u!4 &4786252293981205848
Transform:
  m_ObjectHideFlags: 0
  m_CorrespondingSourceObject: {fileID: 0}
  m_PrefabInstance: {fileID: 0}
  m_PrefabAsset: {fileID: 0}
  m_GameObject: {fileID: 3040819256476750395}
  m_LocalRotation: {x: 0, y: 0, z: 0, w: 1}
  m_LocalPosition: {x: 0.02, y: 0, z: 0}
  m_LocalScale: {x: 1, y: 1, z: 1}
  m_Children:
  - {fileID: 3239765651500455097}
  m_Father: {fileID: 0}
  m_RootOrder: 0
  m_LocalEulerAnglesHint: {x: 0, y: 0, z: 0}
--- !u!1001 &7101613986959015152
PrefabInstance:
  m_ObjectHideFlags: 0
  serializedVersion: 2
  m_Modification:
    m_TransformParent: {fileID: 4786252293981205848}
    m_Modifications:
    - target: {fileID: 578995021721629977, guid: 4c2b00e47a4de3e44b8aafb5ed39324d, type: 3}
      propertyPath: cooldown
      value: -250.7879
      objectReference: {fileID: 0}
    - target: {fileID: 4941789300945151304, guid: 4c2b00e47a4de3e44b8aafb5ed39324d, type: 3}
      propertyPath: cooldown
      value: -230.17905
      objectReference: {fileID: 0}
    - target: {fileID: 4985525842674266867, guid: 4c2b00e47a4de3e44b8aafb5ed39324d, type: 3}
      propertyPath: m_Name
      value: Girl_1
      objectReference: {fileID: 0}
    - target: {fileID: 5655384213291100233, guid: 4c2b00e47a4de3e44b8aafb5ed39324d, type: 3}
      propertyPath: m_RootOrder
      value: 0
      objectReference: {fileID: 0}
    - target: {fileID: 5655384213291100233, guid: 4c2b00e47a4de3e44b8aafb5ed39324d, type: 3}
      propertyPath: m_LocalPosition.x
      value: 0
      objectReference: {fileID: 0}
    - target: {fileID: 5655384213291100233, guid: 4c2b00e47a4de3e44b8aafb5ed39324d, type: 3}
      propertyPath: m_LocalPosition.y
      value: 0
      objectReference: {fileID: 0}
    - target: {fileID: 5655384213291100233, guid: 4c2b00e47a4de3e44b8aafb5ed39324d, type: 3}
      propertyPath: m_LocalPosition.z
      value: 0
      objectReference: {fileID: 0}
    - target: {fileID: 5655384213291100233, guid: 4c2b00e47a4de3e44b8aafb5ed39324d, type: 3}
      propertyPath: m_LocalRotation.w
      value: 1
      objectReference: {fileID: 0}
    - target: {fileID: 5655384213291100233, guid: 4c2b00e47a4de3e44b8aafb5ed39324d, type: 3}
      propertyPath: m_LocalRotation.x
      value: 0
      objectReference: {fileID: 0}
    - target: {fileID: 5655384213291100233, guid: 4c2b00e47a4de3e44b8aafb5ed39324d, type: 3}
      propertyPath: m_LocalRotation.y
      value: 0
      objectReference: {fileID: 0}
    - target: {fileID: 5655384213291100233, guid: 4c2b00e47a4de3e44b8aafb5ed39324d, type: 3}
      propertyPath: m_LocalRotation.z
      value: 0
      objectReference: {fileID: 0}
    - target: {fileID: 5655384213291100233, guid: 4c2b00e47a4de3e44b8aafb5ed39324d, type: 3}
      propertyPath: m_LocalEulerAnglesHint.x
      value: 0
      objectReference: {fileID: 0}
    - target: {fileID: 5655384213291100233, guid: 4c2b00e47a4de3e44b8aafb5ed39324d, type: 3}
      propertyPath: m_LocalEulerAnglesHint.y
      value: 0
      objectReference: {fileID: 0}
    - target: {fileID: 5655384213291100233, guid: 4c2b00e47a4de3e44b8aafb5ed39324d, type: 3}
      propertyPath: m_LocalEulerAnglesHint.z
      value: 0
      objectReference: {fileID: 0}
    - target: {fileID: 6384524222702540179, guid: 4c2b00e47a4de3e44b8aafb5ed39324d, type: 3}
      propertyPath: cooldown
      value: -259.04483
      objectReference: {fileID: 0}
    - target: {fileID: 7098798784267003041, guid: 4c2b00e47a4de3e44b8aafb5ed39324d, type: 3}
      propertyPath: m_Materials.Array.data[0]
      value: 
      objectReference: {fileID: 2100000, guid: 842dd9a692140234fb44939c22291929, type: 2}
    m_RemovedComponents: []
  m_SourcePrefab: {fileID: 100100000, guid: 4c2b00e47a4de3e44b8aafb5ed39324d, type: 3}
--- !u!4 &3239765651500455097 stripped
Transform:
  m_CorrespondingSourceObject: {fileID: 5655384213291100233, guid: 4c2b00e47a4de3e44b8aafb5ed39324d, type: 3}
  m_PrefabInstance: {fileID: 7101613986959015152}
  m_PrefabAsset: {fileID: 0}
