%YAML 1.1
%TAG !u! tag:unity3d.com,2011:
--- !u!1045 &1
EditorBuildSettings:
  m_ObjectHideFlags: 0
  serializedVersion: 2
  m_Scenes:
  - enabled: 1
    path: Assets/Scenes/Menu.unity
    guid: 071450a274b0312448ceda75579bf79e
  - enabled: 1
    path: Assets/Scenes/SampleScene.unity
    guid: f4a0a8172bccdb446a91454dbfee8cb1
  m_configObjects: {}
