  0.30339190571092E-002  0.13029645496777E-006 -0.40869927629983E-008  0.13471001322272E-005  0.42946582461538E-004  0.13029645496777E-006 -0.40869927629983E-008
  0.60678381142184E-002  0.52005370331477E-006 -0.32657050833571E-007  0.53819911175692E-005  0.85706588331050E-004  0.52005370331477E-006 -0.32657050833571E-007
  0.91017571713275E-002  0.11658828008811E-005 -0.10999900131815E-006  0.12085468690010E-004  0.12809425465161E-003  0.11658828008811E-005 -0.10999900131815E-006
  0.12135676228437E-001  0.20621601601362E-005 -0.26001421210079E-006  0.21425605562178E-004  0.16992544307536E-003  0.20621601601362E-005 -0.26001421210079E-006
  0.15169595285546E-001  0.32010644163606E-005 -0.50602540132415E-006  0.33357870912107E-004  0.21101844552245E-003  0.32010644163606E-005 -0.50602540132415E-006
  0.18203514342655E-001  0.45726278148543E-005 -0.87058848299238E-006  0.47825297170909E-004  0.25119478188558E-003  0.45726278148543E-005 -0.87058848299238E-006
  0.21237433399764E-001  0.61648018946433E-005 -0.13753084427909E-005  0.64758693619076E-004  0.29027998716228E-003  0.61648018946433E-005 -0.13753084427909E-005
  0.24271352456873E-001  0.79635371813238E-005 -0.20406602229084E-005  0.84076906160640E-004  0.32810438542614E-003  0.79635371813238E-005 -0.20406602229084E-005
  0.27305271513983E-001  0.99528765398220E-005 -0.28858155755996E-005  0.10568712250753E-003  0.36450384808389E-003  0.99528765398220E-005 -0.28858155755996E-005
  0.30339190571092E-001  0.12115061777185E-004 -0.39284768225004E-005  0.12948522187153E-003  0.39932053390800E-003  0.12115061777185E-004 -0.39284768225004E-005
  0.33373109628201E-001  0.14430653026250E-004 -0.51847184303756E-005  0.15535616812868E-003  0.43240360838463E-003  0.14430653026250E-004 -0.51847184303756E-005
  0.36407028685310E-001  0.16878660383382E-004 -0.66688372841221E-005  0.18317444529091E-003  0.46360993997272E-003  0.16878660383382E-004 -0.66688372841221E-005
  0.39440947742419E-001  0.19436687217608E-004 -0.83932125045602E-005  0.21280453399281E-003  0.49280477093362E-003  0.19436687217608E-004 -0.83932125045602E-005
  0.42474866799529E-001  0.22081084514627E-004 -0.10368175621934E-004  0.24410142757762E-003  0.51986236046001E-003  0.22081084514627E-004 -0.10368175621934E-004
  0.45508785856638E-001  0.24787115567492E-004 -0.12601891876212E-004  0.27691118624678E-003  0.54466659790873E-003  0.24787115567492E-004 -0.12601891876212E-004
  0.48542704913747E-001  0.27529130276471E-004 -0.15100253372365E-004  0.31107152762081E-003  0.56711158402455E-003  0.27529130276471E-004 -0.15100253372365E-004
  0.51576623970856E-001  0.30280748273840E-004 -0.17866784772939E-004  0.34641245194790E-003  0.58710217812920E-003  0.30280748273840E-004 -0.17866784772939E-004
  0.54610543027965E-001  0.33015050045305E-004 -0.20902562161565E-004  0.38275690008908E-003  0.60455450934444E-003  0.33015050045305E-004 -0.20902562161565E-004
  0.57644462085074E-001  0.35704775178595E-004 -0.24206145659731E-004  0.41992144230623E-003  0.61939645001631E-003  0.35704775178595E-004 -0.24206145659731E-004
  0.60678381142184E-001  0.38322526831629E-004 -0.27773526325316E-004  0.45771699578202E-003  0.63156804961277E-003  0.38322526831629E-004 -0.27773526325316E-004
  0.63712300199293E-001  0.40840981477660E-004 -0.31598087805277E-004  0.49594956870868E-003  0.64102192747569E-003  0.40840981477660E-004 -0.31598087805277E-004
  0.66746219256402E-001  0.43233102953155E-004 -0.35670583156585E-004  0.53442102869615E-003  0.64772362292278E-003  0.43233102953155E-004 -0.35670583156585E-004
  0.69780138313511E-001  0.45472359805893E-004 -0.39979127189306E-004  0.57292989316940E-003  0.65165190131313E-003  0.45472359805893E-004 -0.39979127189306E-004
  0.72814057370620E-001  0.47532944916074E-004 -0.44509204623718E-004  0.61127213935034E-003  0.65279901481294E-003  0.47532944916074E-004 -0.44509204623718E-004
  0.75847976427729E-001  0.49389996342140E-004 -0.49243694289835E-004  0.64924203135144E-003  0.65117091672446E-003  0.49389996342140E-004 -0.49243694289835E-004
  0.78881895484839E-001  0.51019818325691E-004 -0.54162909532787E-004  0.68663296184607E-003  0.64678742837128E-003  0.51019818325691E-004 -0.54162909532787E-004
  0.81915814541948E-001  0.52400101376331E-004 -0.59244654921471E-004  0.72323830572585E-003  0.63968235766609E-003  0.52400101376331E-004 -0.59244654921471E-004
  0.84949733599057E-001  0.53510140347677E-004 -0.64464299290930E-004  0.75885228310646E-003  0.62990356862368E-003  0.53510140347677E-004 -0.64464299290930E-004
  0.87983652656166E-001  0.54331049410018E-004 -0.69794865081196E-004  0.79327082900217E-003  0.61751300122012E-003  0.54331049410018E-004 -0.69794865081196E-004
  0.91017571713275E-001  0.54845972823448E-004 -0.75207133867196E-004  0.82629246695479E-003  0.60258664114029E-003  0.54845972823448E-004 -0.75207133867196E-004
  0.94051490770385E-001  0.55040290417569E-004 -0.80669767905873E-004  0.85771918387577E-003  0.58521443909851E-003  0.55040290417569E-004 -0.80669767905873E-004
  0.97085409827494E-001  0.54901816690237E-004 -0.86149447458178E-004  0.88735730333994E-003  0.56550017956137E-003  0.54901816690237E-004 -0.86149447458178E-004
  0.10011932888460       0.54420992448229E-004 -0.91611023575350E-004  0.91501835455710E-003  0.54356129884724E-003  0.54420992448229E-004 -0.91611023575350E-004
  0.10315324794171       0.53591067927139E-004 -0.97017685971020E-004  0.94051993424231E-003  0.51952865272280E-003  0.53591067927139E-004 -0.97017685971020E-004
  0.10618716699882       0.52408276346341E-004 -0.10233114553346E-003  0.96368655860827E-003  0.49354623376403E-003  0.52408276346341E-004 -0.10233114553346E-003
  0.10922108605593       0.50871996877300E-004 -0.10751183096599E-003  0.98435050271275E-003  0.46577083889505E-003  0.50871996877300E-004 -0.10751183096599E-003
  0.11225500511304       0.48984906030007E-004 -0.11251909897838E-003  0.10023526244114E-002  0.43637168766488E-003  0.48984906030007E-004 -0.11251909897838E-003
  0.11528892417015       0.46753116492658E-004 -0.11731145738806E-003  0.10175431701915E-002  0.40552999196746E-003  0.46753116492658E-004 -0.11731145738806E-003
  0.11832284322726       0.44186302493904E-004 -0.12184680042790E-003  0.10297825601932E-002  0.37343847805480E-003  0.44186302493904E-004 -0.12184680042790E-003
  0.12135676228437       0.41297810794987E-004 -0.12608265549639E-003  0.10389421497662E-002  0.34030086183592E-003  0.41297810794987E-004 -0.12608265549639E-003
  0.12439068134148       0.38104756460718E-004 -0.12997644052795E-003  0.10449049649559E-002  0.30633127859565E-003  0.38104756460718E-004 -0.12997644052795E-003
  0.12742460039859       0.34628102603468E-004 -0.13348573110445E-003  0.10475664093661E-002  0.27175366840587E-003  0.34628102603468E-004 -0.13348573110445E-003
  0.13045851945569       0.30892723343034E-004 -0.13656853637514E-003  0.10468349399099E-002  0.23680111863852E-003  0.30892723343034E-004 -0.13656853637514E-003
  0.13349243851280       0.26927449277255E-004 -0.13918358280102E-003  0.10426327090255E-002  0.20171516512280E-003  0.26927449277255E-004 -0.13918358280102E-003
  0.13652635756991       0.22765094813447E-004 -0.14129060469114E-003  0.10348961710107E-002  0.16674505361933E-003  0.22765094813447E-004 -0.14129060469114E-003
  0.13956027662702       0.18442466768992E-004 -0.14285064045268E-003  0.10235766502129E-002  0.13214696341051E-003  0.18442466768992E-004 -0.14285064045268E-003
  0.14259419568413       0.14000353710564E-004 -0.14382633343460E-003  0.10086408688976E-002  0.98183194928754E-004  0.14000353710564E-004 -0.14382633343460E-003
  0.14562811474124       0.94834955653198E-005 -0.14418223620545E-003  0.99007143271502E-003  0.65121323462647E-004  0.94834955653198E-005 -0.14418223620545E-003
  0.14866203379835       0.49405331038081E-005 -0.14388511707071E-003  0.96786727178699E-003  0.33233321094676E-004  0.49405331038081E-005 -0.14388511707071E-003
  0.15169595285546       0.42393696308793E-006 -0.14290426760307E-003  0.94204403554022E-003  0.27946491327417E-005  0.42393696308793E-006 -0.14290426760307E-003
  0.15472987191257      -0.40100840505247E-005 -0.14121180993117E-003  0.91263443952802E-003 -0.25916676598754E-004 -0.40100840505247E-005 -0.14121180993117E-003
  0.15776379096968      -0.83016955668097E-005 -0.13878300250838E-003  0.87968856259962E-003 -0.52621045144670E-004 -0.83016955668097E-005 -0.13878300250838E-003
  0.16079771002679      -0.12387571278219E-004 -0.13559654306322E-003  0.84327409289992E-003 -0.77038231926034E-004 -0.12387571278219E-004 -0.13559654306322E-003
  0.16383162908390      -0.16201047624682E-004 -0.13163486741713E-003  0.80347652131155E-003 -0.98888399726441E-004 -0.16201047624682E-004 -0.13163486741713E-003
  0.16686554814100      -0.19672299496250E-004 -0.12688444284409E-003  0.76039928108389E-003 -0.11789311643663E-003 -0.19672299496250E-004 -0.12688444284409E-003
  0.16989946719811      -0.22728536834705E-004 -0.12133605463927E-003  0.71416383253154E-003 -0.13377638676290E-003 -0.22728536834705E-004 -0.12133605463927E-003
  0.17293338625522      -0.25294221936025E-004 -0.11498508456141E-003  0.66490969182615E-003 -0.14626569503875E-003 -0.25294221936025E-004 -0.11498508456141E-003
  0.17596730531233      -0.27291307175691E-004 -0.10783177981532E-003  0.61279440305076E-003 -0.15509305622002E-003 -0.27291307175691E-004 -0.10783177981532E-003
  0.17900122436944      -0.28639492798707E-004 -0.99881511247494E-004  0.55799345283442E-003 -0.15999607209165E-003 -0.28639492798707E-004 -0.99881511247494E-004
  0.18203514342655      -0.29256504335915E-004 -0.91145019438770E-004  0.50070012703644E-003 -0.16071898966981E-003 -0.29256504335915E-004 -0.91145019438770E-004
  0.18506906248366      -0.29058389128154E-004 -0.81638647393621E-004  0.44112530910362E-003 -0.15701375874598E-003 -0.29058389128154E-004 -0.81638647393621E-004
  0.18810298154077      -0.27959831360182E-004 -0.71384558545948E-004  0.37949721988047E-003 -0.14864108549030E-003 -0.27959831360182E-004 -0.71384558545948E-004
  0.19113690059788      -0.25874484927346E-004 -0.60410938826205E-004  0.31606109881053E-003 -0.13537147901013E-003 -0.25874484927346E-004 -0.60410938826205E-004
  0.19417081965499      -0.22715323380056E-004 -0.48752181564153E-004  0.25107882662687E-003 -0.11698628774611E-003 -0.22715323380056E-004 -0.48752181564153E-004
  0.19720473871210      -0.18395006114324E-004 -0.36449054035671E-004  0.18482848979042E-003 -0.93278722582725E-004 -0.18395006114324E-004 -0.36449054035671E-004
  0.20023865776921      -0.12826259901398E-004 -0.23548844500685E-004  0.11760388709670E-003 -0.64054863552780E-004 -0.12826259901398E-004 -0.23548844500685E-004
  0.20327257682632      -0.59222747759651E-005 -0.10105488622385E-004  0.49713979033283E-004 -0.29134647026320E-004 -0.59222747759651E-005 -0.10105488622385E-004
  0.20630649588342       0.24028867691560E-005  0.38203257946179E-005 -0.18517719368258E-004  0.11647169706735E-004  0.24028867691560E-005  0.38203257946179E-005
  0.20934041494053       0.12233868403223E-004  0.18161076757695E-004 -0.86753801280338E-004  0.58440069523597E-004  0.12233868403223E-004  0.18161076757695E-004
  0.21237433399764       0.23653587580890E-004  0.32842349685672E-004 -0.15464368536189E-003  0.11137686525318E-003  0.23653587580890E-004  0.32842349685672E-004
  0.21540825305475       0.36742793420953E-004  0.47782803548780E-004 -0.22182438635086E-003  0.17057282114262E-003  0.36742793420953E-004  0.47782803548780E-004
  0.21844217211186       0.51579616153966E-004  0.62894162379380E-004 -0.28792133758482E-003  0.23612480893823E-003  0.51579616153966E-004  0.62894162379380E-004
  0.22147609116897       0.68239109510093E-004  0.78081232915952E-004 -0.35254926391301E-003  0.30811050145377E-003  0.68239109510093E-004  0.78081232915952E-004
  0.22451001022608       0.86792787473069E-004  0.93241949071216E-004 -0.41531310331028E-003  0.38658760643087E-003  0.86792787473069E-004  0.93241949071216E-004
  0.22754392928319       0.10730815687701E-003  0.10826744384029E-003 -0.47580897535416E-003  0.47159314342094E-003  0.10730815687701E-003  0.10826744384029E-003
  0.23057784834030       0.12984824736980E-003  0.12304214918641E-003 -0.53362519457993E-003  0.56314276633447E-003  0.12984824736980E-003  0.12304214918641E-003
  0.23361176739741       0.15447114030978E-003  0.13744392436028E-003 -0.58834332658623E-003  0.66123013421238E-003  0.15447114030978E-003  0.13744392436028E-003
  0.23664568645452       0.18122949820107E-003  0.15134421302479E-003 -0.63953928462533E-003  0.76582633267605E-003  0.18122949820107E-003  0.15134421302479E-003
  0.23967960551163       0.21017009630735E-003  0.16460822946981E-003 -0.68678446427860E-003  0.87687934840645E-003  0.21017009630735E-003  0.16460822946981E-003
  0.24271352456873       0.24133335811333E-003  0.17709517411210E-003 -0.72964691368877E-003  0.99431359889049E-003  0.24133335811333E-003  0.17709517411210E-003
  0.24574744362584       0.27475289632834E-003  0.18865847838387E-003 -0.76769253669677E-003  0.11180295195528E-002  0.27475289632834E-003  0.18865847838387E-003
  0.24878136268295       0.31045506114626E-003  0.19914607901957E-003 -0.80048632611342E-003  0.12479032102654E-002  0.31045506114626E-003  0.19914607901957E-003
  0.25181528174006       0.34845849749136E-003  0.20840072165517E-003 -0.82759362424356E-003  0.13837861430946E-002  0.34845849749136E-003  0.20840072165517E-003
  0.25484920079717       0.38877371298891E-003  0.21626029355731E-003 -0.84858140767501E-003  0.15255049330067E-002  0.38877371298891E-003  0.21626029355731E-003
  0.25788311985428       0.43140265840470E-003  0.22255818520144E-003 -0.86301959324518E-003  0.16728611731100E-002  0.43140265840470E-003  0.22255818520144E-003
  0.26091703891139       0.47633832229620E-003  0.22712368031923E-003 -0.87048236200614E-003  0.18256313358591E-002  0.47633832229620E-003  0.22712368031923E-003
  0.26395095796850       0.52356434161220E-003  0.22978237393593E-003 -0.87054949792359E-003  0.19835667414955E-002  0.52356434161220E-003  0.22978237393593E-003
  0.26698487702561       0.57305462996614E-003  0.23035661781812E-003 -0.86280773796798E-003  0.21463935948371E-002  0.57305462996614E-003  0.23035661781812E-003
  0.27001879608272       0.62477302529084E-003  0.22866599265280E-003 -0.84685213018562E-003  0.23138130913651E-002  0.62477302529084E-003  0.22866599265280E-003
  0.27305271513983       0.67867295855958E-003  0.22452780617844E-003 -0.82228739627608E-003  0.24855015933903E-002  0.67867295855958E-003  0.22452780617844E-003
  0.27608663419694       0.73469714523027E-003  0.21775761639000E-003 -0.78872929514825E-003  0.26611108769076E-002  0.73469714523027E-003  0.21775761639000E-003
  0.27912055325404       0.79277730103505E-003  0.20816977884135E-003 -0.74580598388212E-003  0.28402684495738E-002  0.79277730103505E-003  0.20816977884135E-003
  0.28215447231115       0.85283388369846E-003  0.19557801697145E-003 -0.69315937248646E-003  0.30225779400653E-002  0.85283388369846E-003  0.19557801697145E-003
  0.28518839136826       0.91477586212177E-003  0.17979601428508E-003 -0.63044646881475E-003  0.32076195588919E-002  0.91477586212177E-003  0.17979601428508E-003
  0.28822231042537       0.97850051452068E-003  0.16063802712520E-003 -0.55734070998224E-003  0.33949506305621E-002  0.97850051452068E-003  0.16063802712520E-003
  0.29125622948248       0.10438932569475E-002  0.13791951668203E-003 -0.47353327661726E-003  0.35841061968094E-002  0.10438932569475E-002  0.13791951668203E-003
  0.29429014853959       0.11108275035673E-002  0.11145779879494E-003 -0.37873438627846E-003  0.37745996904067E-002  0.11108275035673E-002  0.11145779879494E-003
  0.29732406759670       0.11791645599909E-002  0.81072710016467E-004 -0.27267456237830E-003  0.39659236789076E-002  0.11791645599909E-002  0.81072710016467E-004
  0.30035798665381       0.12487535508959E-002  0.46587288324198E-004 -0.15510587497010E-003  0.41575506774694E-002  0.12487535508959E-002  0.46587288324198E-004
  0.30339190571092       0.13194313830901E-002  0.78284667860572E-005 -0.25803149783160E-004  0.43489340297274E-002  0.13194313830901E-002  0.78284667860572E-005
  0.30642582476803       0.13910227450892E-002 -0.35372221592259E-004  0.11543485807385E-003  0.45395088555027E-002  0.13910227450892E-002 -0.35372221592259E-004
  0.30945974382514       0.14633401441960E-002 -0.83177929681743E-004  0.26878432927529E-003  0.47286930639445E-002  0.14633401441960E-002 -0.83177929681743E-004
  0.31249366288225       0.15361839819752E-002 -0.13574577461916E-003  0.43439528778641E-003  0.49158884305249E-002  0.15361839819752E-002 -0.13574577461916E-003
  0.31552758193935       0.16093426689248E-002 -0.19322611074782E-003  0.61239055413215E-003  0.51004817361232E-002  0.16093426689248E-002 -0.19322611074782E-003
  0.31856150099646       0.16825927790440E-002 -0.25576179914659E-003  0.80286474776948E-003  0.52818459662604E-002  0.16825927790440E-002 -0.25576179914659E-003
  0.32159542005357       0.17556992448958E-002 -0.32348747583866E-003  0.10058833418236E-002  0.54593415683698E-002  0.17556992448958E-002 -0.32348747583866E-003
  0.32462933911068       0.18284155936542E-002 -0.39652882082072E-003  0.12214817733573E-002  0.56323177648181E-002  0.18284155936542E-002 -0.39652882082072E-003
  0.32766325816779       0.19004842245172E-002 -0.47500183009795E-003  0.14496646122426E-002  0.58001139192238E-002  0.19004842245172E-002 -0.47500183009795E-003
  0.33069717722490       0.19716367277518E-002 -0.55901209294819E-003  0.16904047915958E-002  0.59620609534594E-002  0.19716367277518E-002 -0.55901209294819E-003
  0.33373109628201       0.20415942455225E-002 -0.64865407667209E-003  0.19436429026199E-002  0.61174828125615E-002  0.20415942455225E-002 -0.64865407667209E-003
  0.33676501533912       0.21100678745351E-002 -0.74401042111241E-003  0.22092865565718E-002  0.62656979746257E-002  0.21100678745351E-002 -0.74401042111241E-003
  0.33979893439623       0.21767591104066E-002 -0.84515124524667E-003  0.24872098164415E-002  0.64060210026097E-002  0.21767591104066E-002 -0.84515124524667E-003
  0.34283285345334       0.22413603335500E-002 -0.95213346817158E-003  0.27772527007864E-002  0.65377641348340E-002  0.22413603335500E-002 -0.95213346817158E-003
  0.34586677251045       0.23035553362368E-002 -0.10650001468058E-002  0.30792207620165E-002  0.66602389108286E-002  0.23035553362368E-002 -0.10650001468058E-002
  0.34890069156756       0.23630198903753E-002 -0.11837798326388E-002  0.33928847412719E-002  0.67727578290506E-002  0.23630198903753E-002 -0.11837798326388E-002
  0.35193461062466       0.24194223554163E-002 -0.13084859498486E-002  0.37179803018695E-002  0.68746360328754E-002  0.24194223554163E-002 -0.13084859498486E-002
  0.35496852968177       0.24724243256680E-002 -0.14391161970995E-002  0.40542078431280E-002  0.69651930211519E-002  0.24724243256680E-002 -0.14391161970995E-002
  0.35800244873888       0.25216813161788E-002 -0.15756519753103E-002  0.44012323962050E-002  0.70437543795072E-002  0.25216813161788E-002 -0.15756519753103E-002
  0.36103636779599       0.25668434862135E-002 -0.17180578436612E-002  0.47586836033983E-002  0.71096535284886E-002  0.25668434862135E-002 -0.17180578436612E-002
  0.36407028685310       0.26075563992272E-002 -0.18662810060715E-002  0.51261557821786E-002  0.71622334845449E-002  0.26075563992272E-002 -0.18662810060715E-002
  0.36710420591021       0.26434618181102E-002 -0.20202508303419E-002  0.55032080750282E-002  0.72008486297670E-002  0.26434618181102E-002 -0.20202508303419E-002
  0.37013812496732       0.26741985343564E-002 -0.21798784021113E-002  0.58893646859635E-002  0.72248664862407E-002  0.26741985343564E-002 -0.21798784021113E-002
  0.37317204402443       0.26994032296796E-002 -0.23450561157193E-002  0.62841152044223E-002  0.72336694908017E-002  0.26994032296796E-002 -0.23450561157193E-002
  0.37620596308154       0.27187113684875E-002 -0.25156573040109E-002  0.66869150169895E-002  0.72266567659328E-002  0.27187113684875E-002 -0.25156573040109E-002
  0.37923988213865       0.27317581194958E-002 -0.26915359090497E-002  0.70971858072293E-002  0.72032458825021E-002  0.27317581194958E-002 -0.26915359090497E-002
  0.38227380119576       0.27381793046574E-002 -0.28725261956326E-002  0.75143161436837E-002  0.71628746100109E-002  0.27381793046574E-002 -0.28725261956326E-002
  0.38530772025287       0.27376123734607E-002 -0.30584425094201E-002  0.79376621558814E-002  0.71050026499963E-002  0.27376123734607E-002 -0.30584425094201E-002
  0.38834163930997       0.27296974005463E-002 -0.32490790814085E-002  0.83665482979924E-002  0.70291133482274E-002  0.27296974005463E-002 -0.32490790814085E-002
  0.39137555836708       0.27140781044843E-002 -0.34442098803766E-002  0.88002681995440E-002  0.69347153813287E-002  0.27140781044843E-002 -0.34442098803766E-002
  0.39440947742419       0.26904028854514E-002 -0.36435885148425E-002  0.92380856023999E-002  0.68213444134807E-002  0.26904028854514E-002 -0.36435885148425E-002
  0.39744339648130       0.26583258794500E-002 -0.38469481859578E-002  0.96792353829906E-002  0.66885647188632E-002  0.26583258794500E-002 -0.38469481859578E-002
  0.40047731553841       0.26175080266221E-002 -0.40540016926588E-002  0.10122924658563E-001  0.65359707655427E-002  0.26175080266221E-002 -0.40540016926588E-002
  0.40351123459552       0.25676181511186E-002 -0.42644414902751E-002  0.10568333976004E-001  0.63631887565470E-002  0.25676181511186E-002 -0.42644414902751E-002
  0.40654515365263       0.25083340499073E-002 -0.44779398036753E-002  0.11014618581584E-001  0.61698781239205E-002  0.25083340499073E-002 -0.44779398036753E-002
  0.40957907270974       0.24393435878243E-002 -0.46941487959032E-002  0.11460909769748E-001  0.59557329716233E-002  0.24393435878243E-002 -0.46941487959032E-002
  0.41261299176685       0.23603457961058E-002 -0.49127007931246E-002  0.11906316308868E-001  0.57204834632050E-002  0.23603457961058E-002 -0.49127007931246E-002
  0.41564691082396       0.22710519715716E-002 -0.51332085665696E-002  0.12349925941694E-001  0.54638971502750E-002  0.22710519715716E-002 -0.51332085665696E-002
  0.41868082988107       0.21711867735772E-002 -0.53552656720157E-002  0.12790806957980E-001  0.51857802378819E-002  0.21711867735772E-002 -0.53552656720157E-002
  0.42171474893818       0.20604893158006E-002 -0.55784468472108E-002  0.13228009836641E-001  0.48859787830248E-002  0.20604893158006E-002 -0.55784468472108E-002
  0.42474866799529       0.19387142498863E-002 -0.58023084674895E-002  0.13660568954519E-001  0.45643798226291E-002  0.19387142498863E-002 -0.58023084674895E-002
  0.42778258705239       0.18056328379370E-002 -0.60263890596832E-002  0.14087504358716E-001  0.42209124274521E-002  0.18056328379370E-002 -0.60263890596832E-002
  0.43081650610950       0.16610340108117E-002 -0.62502098742741E-002  0.14507823599232E-001  0.38555486785122E-002  0.16610340108117E-002 -0.62502098742741E-002
  0.43385042516661       0.15047254091720E-002 -0.64732755155820E-002  0.14920523618471E-001  0.34683045627861E-002  0.15047254091720E-002 -0.64732755155820E-002
  0.43688434422372       0.13365344042065E-002 -0.66950746296206E-002  0.15324592694015E-001  0.30592407850670E-002  0.13365344042065E-002 -0.66950746296206E-002
  0.43991826328083       0.11563090949573E-002 -0.69150806490954E-002  0.15719012430909E-001  0.26284634930446E-002  0.11563090949573E-002 -0.69150806490954E-002
  0.44295218233794       0.96391927917995E-003 -0.71327525948577E-002  0.16102759799512E-001  0.21761249128344E-002  0.96391927917995E-003 -0.71327525948577E-002
  0.44598610139505       0.75925739467857E-003 -0.73475359329657E-002  0.16474809214867E-001  0.17024238923671E-002  0.75925739467857E-003 -0.73475359329657E-002
  0.44902002045216       0.54223942808019E-003 -0.75588634863422E-002  0.16834134653351E-001  0.12076063502339E-002  0.54223942808019E-003 -0.75588634863422E-002
  0.45205393950927       0.31280578804275E-003 -0.77661563998572E-002  0.17179711802286E-001  0.69196562777955E-003  0.31280578804275E-003 -0.77661563998572E-002
  0.45508785856638       0.70922139928070E-004 -0.79688251575007E-002  0.17510520238013E-001  0.15584274243547E-003  0.70922139928070E-004 -0.79688251575007E-002
  0.45812177762349      -0.18341980098112E-003 -0.81662706501533E-002  0.17825545627881E-001 -0.40037345950374E-003 -0.18341980098112E-003 -0.81662706501533E-002
  0.46115569668060      -0.45020152058595E-003 -0.83578852922998E-002  0.18123781951432E-001 -0.97624625224518E-003 -0.45020152058595E-003 -0.83578852922998E-002
  0.46418961573770      -0.72937700419981E-003 -0.85430541858768E-002  0.18404233736035E-001 -0.15712910833661E-002 -0.72937700419981E-003 -0.85430541858768E-002
  0.46722353479481      -0.10208720846302E-002 -0.87211563292892E-002  0.18665918302080E-001 -0.21849757313243E-002 -0.10208720846302E-002 -0.87211563292892E-002
  0.47025745385192      -0.13245838427628E-002 -0.88915658694790E-002  0.18907868012824E-001 -0.28167205685162E-002 -0.13245838427628E-002 -0.88915658694790E-002
  0.47329137290903      -0.16403800632072E-002 -0.90536533947814E-002  0.19129132523870E-001 -0.34658989305568E-002 -0.16403800632072E-002 -0.90536533947814E-002
  0.47632529196614      -0.19680987474681E-002 -0.92067872661563E-002  0.19328781027254E-001 -0.41318375922141E-002 -0.19680987474681E-002 -0.92067872661563E-002
  0.47935921102325      -0.23075476869979E-002 -0.93503349842457E-002  0.19505904485044E-001 -0.48138173501916E-002 -0.23075476869979E-002 -0.93503349842457E-002
  0.48239313008036      -0.26585040983768E-002 -0.94836645895683E-002  0.19659617847353E-001 -0.55110737127080E-002 -0.26585040983768E-002 -0.94836645895683E-002
  0.48542704913747      -0.30207143227432E-002 -0.96061460930333E-002  0.19789062249625E-001 -0.62227976955765E-002 -0.30207143227432E-002 -0.96061460930333E-002
  0.48846096819458      -0.33938935914698E-002 -0.97171529338263E-002  0.19893407184083E-001 -0.69481367242385E-002 -0.33938935914698E-002 -0.97171529338263E-002
  0.49149488725169      -0.37777258599479E-002 -0.98160634616058E-002  0.19971852640207E-001 -0.76861956409597E-002 -0.37777258599479E-002 -0.98160634616058E-002
  0.49452880630880      -0.41718637111951E-002 -0.99022624398285E-002  0.20023631209150E-001 -0.84360378161472E-002 -0.41718637111951E-002 -0.99022624398285E-002
  0.49756272536591      -0.45759283308589E-002 -0.99751425669193E-002  0.20048010147030E-001 -0.91966863624959E-002 -0.45759283308589E-002 -0.99751425669193E-002
  0.50059664442301      -0.49895095550281E-002 -0.10034106011898E-001  0.20044293392065E-001 -0.99671254504293E-002 -0.49895095550281E-002 -0.10034106011898E-001
  0.50363056348012      -0.54121659921074E-002 -0.10078565960987E-001  0.20011823530613E-001 -0.10746301723051E-001 -0.54121659921074E-002 -0.10078565960987E-001
  0.50666448253723      -0.58434252198394E-002 -0.10107948171630E-001  0.19949983707191E-001 -0.11533125808577E-001 -0.58434252198394E-002 -0.10107948171630E-001
  0.50969840159434      -0.62827840583901E-002 -0.10121692530286E-001  0.19858199473699E-001 -0.12326473927989E-001 -0.62827840583901E-002 -0.10121692530286E-001
  0.51273232065145      -0.67297089202348E-002 -0.10119254610285E-001  0.19735940573101E-001 -0.13125189595390E-001 -0.67297089202348E-002 -0.10119254610285E-001
  0.51576623970856      -0.71836362374002E-002 -0.10100107225978E-001  0.19582722652970E-001 -0.13928085408342E-001 -0.71836362374002E-002 -0.10100107225978E-001
  0.51880015876567      -0.76439729664340E-002 -0.10063741979354E-001  0.19398108904396E-001 -0.14733944925192E-001 -0.76439729664340E-002 -0.10063741979354E-001
  0.52183407782278      -0.81100971712828E-002 -0.10009670795268E-001  0.19181711621883E-001 -0.15541524626219E-001 -0.81100971712828E-002 -0.10009670795268E-001
  0.52486799687989      -0.85813586840682E-002 -0.99374274413735E-002  0.18933193680025E-001 -0.16349555955175E-001 -0.85813586840682E-002 -0.99374274413735E-002
  0.52790191593700      -0.90570798435555E-002 -0.98465690288551E-002  0.18652269922866E-001 -0.17156747437599E-001 -0.90570798435555E-002 -0.98465690288551E-002
  0.53093583499411      -0.95365563109121E-002 -0.97366774900102E-002  0.18338708462047E-001 -0.17961786872077E-001 -0.95365563109121E-002 -0.97366774900102E-002
  0.53396975405122      -0.10019057962154E-001 -0.96073610287574E-002  0.17992331879974E-001 -0.18763343590419E-001 -0.10019057962154E-001 -0.96073610287574E-002
  0.53700367310832      -0.10503829856481E-001 -0.94582555401362E-002  0.17613018334473E-001 -0.19560070782537E-001 -0.10503829856481E-001 -0.94582555401362E-002
  0.54003759216543      -0.10990093279493E-001 -0.92890259948854E-002  0.17200702561535E-001 -0.20350607881619E-001 -0.10990093279493E-001 -0.92890259948854E-002
  0.54307151122254      -0.11477046860089E-001 -0.90993677852170E-002  0.16755376773002E-001 -0.21133583005030E-001 -0.11477046860089E-001 -0.90993677852170E-002
  0.54610543027965      -0.11963867759648E-001 -0.88890080279354E-002  0.16277091446213E-001 -0.21907615446200E-001 -0.11963867759648E-001 -0.88890080279354E-002
  0.54913934933676      -0.12449712931879E-001 -0.86577068211021E-002  0.15765956002896E-001 -0.22671318212610E-001 -0.12449712931879E-001 -0.86577068211021E-002
  0.55217326839387      -0.12933720451544E-001 -0.84052584505055E-002  0.15222139374755E-001 -0.23423300604836E-001 -0.12933720451544E-001 -0.84052584505055E-002
  0.55520718745098      -0.13415010910059E-001 -0.81314925422601E-002  0.14645870453502E-001 -0.24162170831485E-001 -0.13415010910059E-001 -0.81314925422601E-002
  0.55824110650809      -0.13892688875775E-001 -0.78362751579413E-002  0.14037438423263E-001 -0.24886538654733E-001 -0.13892688875775E-001 -0.78362751579413E-002
  0.56127502556520      -0.14365844416561E-001 -0.75195098287515E-002  0.13397192973586E-001 -0.25595018061055E-001 -0.14365844416561E-001 -0.75195098287515E-002
  0.56430894462231      -0.14833554682118E-001 -0.71811385253077E-002  0.12725544391493E-001 -0.26286229951655E-001 -0.14833554682118E-001 -0.71811385253077E-002
  0.56734286367942      -0.15294885543270E-001 -0.68211425597561E-002  0.12022963531292E-001 -0.26958804846998E-001 -0.15294885543270E-001 -0.68211425597561E-002
  0.57037678273653      -0.15748893285303E-001 -0.64395434170332E-002  0.11289981661136E-001 -0.27611385599785E-001 -0.15748893285303E-001 -0.64395434170332E-002
  0.57341070179363      -0.16194626352242E-001 -0.60364035122224E-002  0.10527190185569E-001 -0.28242630110644E-001 -0.16194626352242E-001 -0.60364035122224E-002
  0.57644462085074      -0.16631127138805E-001 -0.56118268710953E-002  0.97352402435694E-002 -0.28851214040752E-001 -0.16631127138805E-001 -0.56118268710953E-002
  0.57947853990785      -0.17057433826585E-001 -0.51659597310693E-002  0.89148421818878E-002 -0.29435833515591E-001 -0.17057433826585E-001 -0.51659597310693E-002
  0.58251245896496      -0.17472582260890E-001 -0.46989910599729E-002  0.80667649037453E-002 -0.29995207813987E-001 -0.17472582260890E-001 -0.46989910599729E-002
  0.58554637802207      -0.17875607864483E-001 -0.42111529901715E-002  0.71918350932276E-002 -0.30528082036585E-001 -0.17875607864483E-001 -0.42111529901715E-002
  0.58858029707918      -0.18265547584363E-001 -0.37027211657799E-002  0.62909363160040E-002 -0.31033229747930E-001 -0.18265547584363E-001 -0.37027211657799E-002
  0.59161421613629      -0.18641441867577E-001 -0.31740150008687E-002  0.53650079972682E-002 -0.31509455586311E-001 -0.18641441867577E-001 -0.31740150008687E-002
  0.59464813519340      -0.19002336661917E-001 -0.26253978467574E-002  0.44150442780815E-002 -0.31955597835579E-001 -0.19002336661917E-001 -0.26253978467574E-002
  0.59768205425051      -0.19347285437276E-001 -0.20572770666829E-002  0.34420927515763E-002 -0.32370530953180E-001 -0.19347285437276E-001 -0.20572770666829E-002
  0.60071597330762      -0.19675351223294E-001 -0.14701040163344E-002  0.24472530807526E-002 -0.32753168048719E-001 -0.19675351223294E-001 -0.14701040163344E-002
  0.60374989236473      -0.19985608658854E-001 -0.86437392895058E-003  0.14316754998747E-002 -0.33102463307407E-001 -0.19985608658854E-001 -0.86437392895058E-003
  0.60678381142184      -0.20277146048900E-001 -0.24062570389110E-003  0.39655920174807E-003 -0.33417414352874E-001 -0.20277146048900E-001 -0.24062570389110E-003
  0.60981773047895      -0.20549067423955E-001  0.40055840219000E-003 -0.65684938657885E-003 -0.33697064543885E-001 -0.20549067423955E-001  0.40055840219000E-003
  0.61285164953605      -0.20800494597680E-001  0.10585531822161E-002 -0.17272584368786E-002 -0.33940505199629E-001 -0.20800494597680E-001  0.10585531822161E-002
  0.61588556859316      -0.21030569217740E-001  0.17326909840260E-002 -0.28133326585065E-002 -0.34146877748376E-001 -0.21030569217740E-001  0.17326909840260E-002
  0.61891948765027      -0.21238454805208E-001  0.24222623143678E-002 -0.39136953395407E-002 -0.34315375794418E-001 -0.21238454805208E-001  0.24222623143678E-002
  0.62195340670738      -0.21423338777707E-001  0.31265165415046E-002 -0.50269304867327E-002 -0.34445247098368E-001 -0.21423338777707E-001  0.31265165415046E-002
  0.62498732576449      -0.21584434451479E-001  0.38446626961519E-002 -0.61515850604635E-002 -0.34535795466055E-001 -0.21584434451479E-001  0.38446626961519E-002
  0.62802124482160      -0.21720983017535E-001  0.45758703702264E-002 -0.72861713006639E-002 -0.34586382541413E-001 -0.21720983017535E-001  0.45758703702264E-002
  0.63105516387871      -0.21832255487083E-001  0.53192707126489E-002 -0.84291691394372E-002 -0.34596429498958E-001 -0.21832255487083E-001  0.53192707126489E-002
  0.63408908293582      -0.21917554601420E-001  0.60739575212015E-002 -0.95790286959037E-002 -0.34565418631625E-001 -0.21917554601420E-001  0.60739575212015E-002
  0.63712300199293      -0.21976216701499E-001  0.68389884291992E-002 -0.10734172848582E-001 -0.34492894829973E-001 -0.21976216701499E-001  0.68389884291992E-002
  0.64015692105004      -0.22007613552454E-001  0.76133861854968E-002 -0.11892999880418E-001 -0.34378466948941E-001 -0.22007613552454E-001  0.76133861854968E-002
  0.64319084010715      -0.22011154118383E-001  0.83961400261117E-002 -0.13053886191403E-001 -0.34221809058593E-001 -0.22011154118383E-001  0.83961400261117E-002
  0.64622475916426      -0.21986286282772E-001  0.91862071355083E-002 -0.14215189073518E-001 -0.34022661575527E-001 -0.21986286282772E-001  0.91862071355083E-002
  0.64925867822136      -0.21932498510025E-001  0.99825141953517E-002 -0.15375249542599E-001 -0.33780832271828E-001 -0.21932498510025E-001  0.99825141953517E-002
  0.65229259727847      -0.21849321443633E-001  0.10783959018309E-001 -0.16532395221566E-001 -0.33496197158751E-001 -0.21849321443633E-001  0.10783959018309E-001
  0.65532651633558      -0.21736329436649E-001  0.11589412264252E-001 -0.17684943269283E-001 -0.33168701242539E-001 -0.21736329436649E-001  0.11589412264252E-001
  0.65836043539269      -0.21593142010202E-001  0.12397719235974E-001 -0.18831203349239E-001 -0.32798359150064E-001 -0.21593142010202E-001  0.12397719235974E-001
  0.66139435444980      -0.21419425235967E-001  0.13207701751349E-001 -0.19969480632075E-001 -0.32385255622246E-001 -0.21419425235967E-001  0.13207701751349E-001
  0.66442827350691      -0.21214893038584E-001  0.14018160088608E-001 -0.21098078825903E-001 -0.31929545873492E-001 -0.21214893038584E-001  0.14018160088608E-001
  0.66746219256402      -0.20979308414209E-001  0.14827875001220E-001 -0.22215303228277E-001 -0.31431455815674E-001 -0.20979308414209E-001  0.14827875001220E-001
  0.67049611162113      -0.20712484561520E-001  0.15635609798679E-001 -0.23319463793571E-001 -0.30891282145456E-001 -0.20712484561520E-001  0.15635609798679E-001
  0.67353003067824      -0.20414285921665E-001  0.16440112489265E-001 -0.24408878209498E-001 -0.30309392294073E-001 -0.20414285921665E-001  0.16440112489265E-001
  0.67656394973535      -0.20084629123839E-001  0.17240117980703E-001 -0.25481874976411E-001 -0.29686224238958E-001 -0.20084629123839E-001  0.17240117980703E-001
  0.67959786879246      -0.19723483833327E-001  0.18034350334441E-001 -0.26536796483023E-001 -0.29022286176931E-001 -0.19723483833327E-001  0.18034350334441E-001
  0.68263178784957      -0.19330873499103E-001  0.18821525069105E-001 -0.27572002072152E-001 -0.28318156058919E-001 -0.19330873499103E-001  0.18821525069105E-001
  0.68566570690667      -0.18906875998222E-001  0.19600351508532E-001 -0.28585871090093E-001 -0.27574480986541E-001 -0.18906875998222E-001  0.19600351508532E-001
  0.68869962596378      -0.18451624174503E-001  0.20369535169636E-001 -0.29576805913216E-001 -0.26791976471137E-001 -0.18451624174503E-001  0.20369535169636E-001
  0.69173354502089      -0.17965306269208E-001  0.21127780185214E-001 -0.30543234945438E-001 -0.25971425556159E-001 -0.17965306269208E-001  0.21127780185214E-001
  0.69476746407800      -0.17448166241642E-001  0.21873791756678E-001 -0.31483615580222E-001 -0.25113677804122E-001 -0.17448166241642E-001  0.21873791756678E-001
  0.69780138313511      -0.16900503977860E-001  0.22606278631576E-001 -0.32396437120845E-001 -0.24219648149634E-001 -0.16900503977860E-001  0.22606278631576E-001
  0.70083530219222      -0.16322675385903E-001  0.23323955600664E-001 -0.33280223652700E-001 -0.23290315620297E-001 -0.16322675385903E-001  0.23323955600664E-001
  0.70386922124933      -0.15715092376214E-001  0.24025546009204E-001 -0.34133536861521E-001 -0.22326721927577E-001 -0.15715092376214E-001  0.24025546009204E-001
  0.70690314030644      -0.15078222726191E-001  0.24709784277051E-001 -0.34954978791492E-001 -0.21329969930046E-001 -0.15078222726191E-001  0.24709784277051E-001
  0.70993705936355      -0.14412589828040E-001  0.25375418422074E-001 -0.35743194537306E-001 -0.20301221971650E-001 -0.14412589828040E-001  0.25375418422074E-001
  0.71297097842066      -0.13718772319391E-001  0.26021212581353E-001 -0.36496874864380E-001 -0.19241698097979E-001 -0.13718772319391E-001  0.26021212581353E-001
  0.71600489747777      -0.12997403596405E-001  0.26645949524569E-001 -0.37214758751558E-001 -0.18152674153753E-001 -0.12997403596405E-001  0.26645949524569E-001
  0.71903881653488      -0.12249171209356E-001  0.27248433153985E-001 -0.37895635850784E-001 -0.17035479765037E-001 -0.12249171209356E-001  0.27248433153985E-001
  0.72207273559198      -0.11474816140957E-001  0.27827490985381E-001 -0.38538348858397E-001 -0.15891496209934E-001 -0.11474816140957E-001  0.27827490985381E-001
  0.72510665464909      -0.10675131967980E-001  0.28381976604317E-001 -0.39141795792857E-001 -0.14722154181782E-001 -0.10675131967980E-001  0.28381976604317E-001
  0.72814057370620      -0.98509639069830E-002  0.28910772092099E-001 -0.39704932173940E-001 -0.13528931449105E-001 -0.98509639069830E-002  0.28910772092099E-001
  0.73117449276331      -0.90032077452390E-002  0.29412790415854E-001 -0.40226773098573E-001 -0.12313350416825E-001 -0.90032077452390E-002  0.29412790415854E-001
  0.73420841182042      -0.81328086582403E-002  0.29886977777165E-001 -0.40706395208770E-001 -0.11076975593450E-001 -0.81328086582403E-002  0.29886977777165E-001
  0.73724233087753      -0.72407599154221E-002  0.30332315913745E-001 -0.41142938547276E-001 -0.98214109691769E-002 -0.72407599154221E-002  0.30332315913745E-001
  0.74027624993464      -0.63281014760235E-002  0.30747824348731E-001 -0.41535608296829E-001 -0.85482973100680E-002 -0.63281014760235E-002  0.30747824348731E-001
  0.74331016899175      -0.53959184772721E-002  0.31132562582228E-001 -0.41883676399123E-001 -0.72593093736243E-002 -0.53959184772721E-002  0.31132562582228E-001
  0.74634408804886      -0.44453396173475E-002  0.31485632219842E-001 -0.42186483049868E-001 -0.59561530512941E-002 -0.44453396173475E-002  0.31485632219842E-001
  0.74937800710597      -0.34775354358377E-002  0.31806179033048E-001 -0.42443438066565E-001 -0.46405624436026E-002 -0.34775354358377E-002  0.31806179033048E-001
  0.75241192616308      -0.24937164946633E-002  0.32093394946347E-001 -0.42654022125895E-001 -0.33142968737617E-002 -0.24937164946633E-002  0.32093394946347E-001
  0.75544584522019      -0.14951314626941E-002  0.32346519946322E-001 -0.42817787867897E-001 -0.19791378457556E-002 -0.14951314626941E-002  0.32346519946322E-001
  0.75847976427729      -0.48306510752873E-003  0.32564843907826E-001 -0.42934360864400E-001 -0.63688595303397E-003 -0.48306510752873E-003  0.32564843907826E-001
  0.76151368333440       0.54116380185095E-003  0.32747708332703E-001 -0.43003440449437E-001  0.71064225593607E-003  0.54116380185095E-003  0.32747708332703E-001
  0.76454760239151       0.15762046776099E-002  0.32894507996621E-001 -0.43024800409714E-001  0.20616174489064E-002  0.15762046776099E-002  0.32894507996621E-001
  0.76758152144862       0.26206773766089E-002  0.33004692499770E-001 -0.42998289533444E-001  0.34142007114280E-002  0.26206773766089E-002  0.33004692499770E-001
  0.77061544050573       0.36731745405910E-002  0.33077767717371E-001 -0.42923832016217E-001  0.47665467722531E-002  0.36731745405910E-002  0.33077767717371E-001
  0.77364935956284       0.47322640084212E-002  0.33113297146156E-001 -0.42801427722847E-001  0.61168072459793E-002  0.47322640084212E-002  0.33113297146156E-001
  0.77668327861995       0.57964912955952E-002  0.33110903143183E-001 -0.42631152304471E-001  0.74631338863052E-002  0.57964912955952E-002  0.33110903143183E-001
  0.77971719767706       0.68643821360526E-002  0.33070268053593E-001 -0.42413157170467E-001  0.88036818432414E-002  0.68643821360526E-002  0.33070268053593E-001
  0.78275111673417       0.79344450811513E-002  0.32991135224135E-001 -0.42147669315097E-001  0.10136612917597E-001  0.79344450811513E-002  0.32991135224135E-001
  0.78578503579128       0.90051741504991E-002  0.32873309899527E-001 -0.41834990999064E-001  0.11460098806070E-001  0.90051741504991E-002  0.32873309899527E-001
  0.78881895484839       0.10075051529187E-001  0.32716659999012E-001 -0.41475499286525E-001  0.12772324330268E-001  0.10075051529187E-001  0.32716659999012E-001
  0.79185287390550       0.11142550305829E-001  0.32521116770658E-001 -0.41069645438376E-001  0.14071490643044E-001  0.11142550305829E-001  0.32521116770658E-001
  0.79488679296261       0.12206137245692E-001  0.32286675321305E-001 -0.40617954162970E-001  0.15355818405535E-001  0.12206137245692E-001  0.32286675321305E-001
  0.79792071201971       0.13264275593073E-001  0.32013395020263E-001 -0.40121022725717E-001  0.16623550928386E-001  0.13264275593073E-001  0.32013395020263E-001
  0.80095463107682       0.14315427897010E-001  0.31701399775186E-001 -0.39579519919331E-001  0.17872957270705E-001  0.14315427897010E-001  0.31701399775186E-001
  0.80398855013393       0.15358058854280E-001  0.31350878178827E-001 -0.38994184896792E-001  0.19102335290374E-001  0.15358058854280E-001  0.31350878178827E-001
  0.80702246919104       0.16390638163631E-001  0.30962083525665E-001 -0.38365825869386E-001  0.20310014639444E-001  0.16390638163631E-001  0.30962083525665E-001
  0.81005638824815       0.17411643385068E-001  0.30535333697690E-001 -0.37695318672477E-001  0.21494359698494E-001  0.17411643385068E-001  0.30535333697690E-001
  0.81309030730526       0.18419562798033E-001  0.30071010918924E-001 -0.36983605201968E-001  0.22653772443899E-001  0.18419562798033E-001  0.30071010918924E-001
  0.81612422636237       0.19412898252237E-001  0.29569561378584E-001 -0.36231691724655E-001  0.23786695242174E-001  0.19412898252237E-001  0.29569561378584E-001
  0.81915814541948       0.20390168004940E-001  0.29031494723045E-001 -0.35440647065993E-001  0.24891613565655E-001  0.20390168004940E-001  0.29031494723045E-001
  0.82219206447659       0.21349909538440E-001  0.28457383417128E-001 -0.34611600679027E-001  0.25967058623987E-001  0.21349909538440E-001  0.28457383417128E-001
  0.82522598353370       0.22290682351561E-001  0.27847861975475E-001 -0.33745740598505E-001  0.27011609906065E-001  0.22290682351561E-001  0.27847861975475E-001
  0.82825990259081       0.23211070718967E-001  0.27203626065124E-001 -0.32844311284454E-001  0.28023897627258E-001  0.23211070718967E-001  0.27203626065124E-001
  0.83129382164792       0.24109686412180E-001  0.26525431480688E-001 -0.31908611359706E-001  0.29002605076970E-001  0.24109686412180E-001  0.26525431480688E-001
  0.83432774070502       0.24985171376221E-001  0.25814092993811E-001 -0.30939991246123E-001  0.29946470861808E-001  0.24985171376221E-001  0.25814092993811E-001
  0.83736165976213       0.25836200355905E-001  0.25070483078921E-001 -0.29939850704465E-001  0.30854291039841E-001  0.25836200355905E-001  0.25070483078921E-001
  0.84039557881924       0.26661483465871E-001  0.24295530517551E-001 -0.28909636283054E-001  0.31724921141696E-001  0.26661483465871E-001  0.24295530517551E-001
  0.84342949787635       0.27459768698576E-001  0.23490218883796E-001 -0.27850838680579E-001  0.32557278074476E-001  0.27459768698576E-001  0.23490218883796E-001
  0.84646341693346       0.28229844364584E-001  0.22655584913788E-001 -0.26764990028588E-001  0.33350341904738E-001  0.28229844364584E-001  0.22655584913788E-001
  0.84949733599057       0.28970541459599E-001  0.21792716762292E-001 -0.25653661099337E-001  0.34103157517048E-001  0.28970541459599E-001  0.21792716762292E-001
  0.85253125504768       0.29680735952889E-001  0.20902752149849E-001 -0.24518458444882E-001  0.34814836144897E-001  0.29680735952889E-001  0.20902752149849E-001
  0.85556517410479       0.30359350991844E-001  0.19986876404136E-001 -0.23361021473378E-001  0.35484556771037E-001  0.30359350991844E-001  0.19986876404136E-001
  0.85859909316190       0.31005359017663E-001  0.19046320399447E-001 -0.22183019468733E-001  0.36111567394605E-001  0.31005359017663E-001  0.19046320399447E-001
  0.86163301221901       0.31617783787281E-001  0.18082358398488E-001 -0.20986148559837E-001  0.36695186162673E-001  0.31617783787281E-001  0.18082358398488E-001
  0.86466693127612       0.32195702296905E-001  0.17096305800885E-001 -0.19772128645713E-001  0.37234802364176E-001  0.32195702296905E-001  0.17096305800885E-001
  0.86770085033323       0.32738246602696E-001  0.16089516803035E-001 -0.18542700283003E-001  0.37729877284462E-001  0.32738246602696E-001  0.16089516803035E-001
  0.87073476939033       0.33244605534409E-001  0.15063381974166E-001 -0.17299621542290E-001  0.38179944919032E-001  0.33244605534409E-001  0.15063381974166E-001
  0.87376868844744       0.33714026297977E-001  0.14019325753651E-001 -0.16044664839800E-001  0.38584612545320E-001  0.33714026297977E-001  0.14019325753651E-001
  0.87680260750455       0.34145815963330E-001  0.12958803874842E-001 -0.14779613751063E-001  0.38943561151707E-001  0.34145815963330E-001  0.12958803874842E-001
  0.87983652656166       0.34539342833943E-001  0.11883300720851E-001 -0.13506259813161E-001  0.39256545723238E-001  0.34539342833943E-001  0.11883300720851E-001
  0.88287044561877       0.34894037694926E-001  0.10794326617884E-001 -0.12226399322177E-001  0.39523395383872E-001  0.34894037694926E-001  0.10794326617884E-001
  0.88590436467588       0.35209394936682E-001  0.96934150718878E-002 -0.10941830132459E-001  0.39744013395355E-001  0.35209394936682E-001  0.96934150718878E-002
  0.88893828373299       0.35484973551489E-001  0.85821199544226E-002 -0.96543484643085E-002  0.39918377013165E-001  0.35484973551489E-001  0.85821199544226E-002
  0.89197220279010       0.35720398000623E-001  0.74620126437764E-002 -0.83657457266439E-002  0.40046537200251E-001  0.35720398000623E-001  0.74620126437764E-002
  0.89500612184721       0.35915358949940E-001  0.63346791274823E-002 -0.70778053611612E-002  0.40128618199633E-001  0.35915358949940E-001  0.63346791274823E-002
  0.89804004090432       0.36069613872138E-001  0.52017170724784E-002 -0.57922997144318E-002  0.40164816967199E-001  0.36069613872138E-001  0.52017170724784E-002
  0.90107395996143       0.36182987514215E-001  0.40647328692437E-002 -0.45109869443100E-002  0.40155402466368E-001  0.36182987514215E-001  0.40647328692437E-002
  0.90410787901854       0.36255372228962E-001  0.29253386563091E-002 -0.32356079669217E-002  0.40100714826553E-001  0.36255372228962E-001  0.29253386563091E-002
  0.90714179807564       0.36286728169625E-001  0.17851493316021E-002 -0.19678834504032E-002  0.40001164367690E-001  0.36286728169625E-001  0.17851493316021E-002
  0.91017571713275       0.36277083347202E-001  0.64577955711648E-003 -0.70951086143104E-003  0.39857230493341E-001  0.36277083347202E-001  0.64577955711648E-003
  0.91320963618986       0.36226533550138E-001 -0.49115923657459E-003  0.53783842954596E-003  0.39669460455196E-001  0.36226533550138E-001 -0.49115923657459E-003
  0.91624355524697       0.36135242126522E-001 -0.16240618394376E-002  0.17725219786128E-002  0.39438467992041E-001  0.36135242126522E-001 -0.16240618394376E-002
  0.91927747430408       0.36003439629186E-001 -0.27513322382139E-002  0.29929290286339E-002  0.39164931846548E-001  0.36003439629186E-001 -0.27513322382139E-002
  0.92231139336119       0.35831423324434E-001 -0.38713865732798E-002  0.41974831940125E-002  0.38849594163477E-001  0.35831423324434E-001 -0.38713865732798E-002
  0.92534531241830       0.35619556565441E-001 -0.49826560696792E-002  0.53846450647246E-002  0.38493258773152E-001  0.35619556565441E-001 -0.49826560696792E-002
  0.92837923147541       0.35368268031685E-001 -0.60835899359340E-002  0.65529147245848E-002  0.38096789364274E-001  0.35368268031685E-001 -0.60835899359340E-002
  0.93141315053252       0.35078050836064E-001 -0.71726582243061E-002  0.77008341789089E-002  0.37661107550402E-001  0.35078050836064E-001 -0.71726582243061E-002
  0.93444706958963       0.34749461501682E-001 -0.82483546462757E-002  0.88269896869580E-002  0.37187190834621E-001  0.34749461501682E-001 -0.82483546462757E-002
  0.93748098864674       0.34383118810572E-001 -0.93091993370980E-002  0.99300139947754E-002  0.36676070477125E-001  0.34383118810572E-001 -0.93091993370980E-002
  0.94051490770385       0.33979702526931E-001 -0.10353741563420E-001  0.11008588464267E-001  0.36128829270648E-001  0.33979702526931E-001 -0.10353741563420E-001
  0.94354882676095       0.33539951997722E-001 -0.11380562368071E-001  0.12061445094621E-001  0.35546599228849E-001  0.33539951997722E-001 -0.11380562368071E-001
  0.94658274581806       0.33064664633797E-001 -0.12388277146287E-001  0.13087368432414E-001  0.34930559192923E-001  0.33064664633797E-001 -0.12388277146287E-001
  0.94961666487517       0.32554694274958E-001 -0.13375538147782E-001  0.14085197367024E-001  0.34281932361873E-001  0.32554694274958E-001 -0.13375538147782E-001
  0.95265058393228       0.32010949442647E-001 -0.14341036899268E-001  0.15053826808222E-001  0.33601983752023E-001  0.32010949442647E-001 -0.14341036899268E-001
  0.95568450298939       0.31434391484211E-001 -0.15283506542194E-001  0.15992209243099E-001  0.32892017591458E-001  0.31434391484211E-001 -0.15283506542194E-001
  0.95871842204650       0.30826032612949E-001 -0.16201724080686E-001  0.16899356169773E-001  0.32153374655247E-001  0.30826032612949E-001 -0.16201724080686E-001
  0.96175234110361       0.30186933848368E-001 -0.17094512534888E-001  0.17774339405582E-001  0.31387429547329E-001  0.30186933848368E-001 -0.17094512534888E-001
  0.96478626016072       0.29518202861325E-001 -0.17960742995096E-001  0.18616292267786E-001  0.30595587935102E-001  0.29518202861325E-001 -0.17960742995096E-001
  0.96782017921783       0.28820991728930E-001 -0.18799336572359E-001  0.19424410625073E-001  0.29779283742795E-001  0.28820991728930E-001 -0.18799336572359E-001
  0.97085409827494       0.28096494604300E-001 -0.19609266241418E-001  0.20197953818459E-001  0.28939976309749E-001  0.28096494604300E-001 -0.19609266241418E-001
  0.97388801733205       0.27345945306447E-001 -0.20389558572158E-001  0.20936245450493E-001  0.28079147519816E-001  0.27345945306447E-001 -0.20389558572158E-001
  0.97692193638916       0.26570614835767E-001 -0.21139295345949E-001  0.21638674041943E-001  0.27198298908074E-001  0.26570614835767E-001 -0.21139295345949E-001
  0.97995585544626       0.25771808820731E-001 -0.21857615053602E-001  0.22304693555454E-001  0.26298948751109E-001  0.25771808820731E-001 -0.21857615053602E-001
  0.98298977450337       0.24950864901595E-001 -0.22543714271876E-001  0.22933823785975E-001  0.25382629147084E-001  0.24950864901595E-001 -0.22543714271876E-001
  0.98602369356048       0.24109150057008E-001 -0.23196848915806E-001  0.23525650618032E-001  0.24450883091816E-001  0.24109150057008E-001 -0.23196848915806E-001
  0.98905761261759       0.23248057879584E-001 -0.23816335364395E-001  0.24079826150231E-001  0.23505261557066E-001  0.23248057879584E-001 -0.23816335364395E-001
  0.99209153167470       0.22369005806571E-001 -0.24401551457518E-001  0.24596068687661E-001  0.22547320577176E-001  0.22369005806571E-001 -0.24401551457518E-001
  0.99512545073181       0.21473432311867E-001 -0.24951937362196E-001  0.25074162603164E-001  0.21578618350154E-001  0.21473432311867E-001 -0.24951937362196E-001
  0.99815936978892       0.20562794065694E-001 -0.25466996306698E-001  0.25513958068724E-001  0.20600712359232E-001  0.20562794065694E-001 -0.25466996306698E-001
   1.0011932888460       0.19638563068323E-001 -0.25946295181245E-001  0.25915370658498E-001  0.19615156520834E-001  0.19638563068323E-001 -0.25946295181245E-001
   1.0042272079031       0.18702223764268E-001 -0.26389465004412E-001  0.26278380825306E-001  0.18623498364796E-001  0.18702223764268E-001 -0.26389465004412E-001
   1.0072611269602       0.17755270143404E-001 -0.26796201254627E-001  0.26603033252651E-001  0.17627276252571E-001  0.17755270143404E-001 -0.26796201254627E-001
   1.0102950460174       0.16799202835503E-001 -0.27166264066496E-001  0.26889436084624E-001  0.16628016639027E-001  0.16799202835503E-001 -0.27166264066496E-001
   1.0133289650745       0.15835526204630E-001 -0.27499478291997E-001  0.27137760036274E-001  0.15627231383311E-001  0.15835526204630E-001 -0.27499478291997E-001
   1.0163628841316       0.14865745449885E-001 -0.27795733426892E-001  0.27348237387321E-001  0.14626415114112E-001  0.14865745449885E-001 -0.27795733426892E-001
   1.0193968031887       0.13891363718885E-001 -0.28054983403046E-001  0.27521160862276E-001  0.13627042654473E-001  0.13891363718885E-001 -0.28054983403046E-001
   1.0224307222458       0.12913879240385E-001 -0.28277246247623E-001  0.27656882400317E-001  0.12630566511166E-001  0.12913879240385E-001 -0.28277246247623E-001
   1.0254646413029       0.11934782482325E-001 -0.28462603610480E-001  0.27755811818452E-001  0.11638414433443E-001  0.11934782482325E-001 -0.28462603610480E-001
   1.0284985603600       0.10955553341549E-001 -0.28611200161333E-001  0.27818415371742E-001  0.10651987045771E-001  0.10955553341549E-001 -0.28611200161333E-001
   1.0315324794171       0.99776583713207E-002 -0.28723242858630E-001  0.27845214214545E-001  0.96726555589977E-002  0.99776583713207E-002 -0.28723242858630E-001
   1.0345663984742       0.90025480526695E-002 -0.28799000092308E-001  0.27836782766945E-001  0.87017595641482E-002  0.90025480526695E-002 -0.28799000092308E-001
   1.0376003175313       0.80316541154598E-002 -0.28838800702941E-001  0.27793746990705E-001  0.77406049128519E-002  0.80316541154598E-002 -0.28838800702941E-001
   1.0406342365884       0.70663869149509E-002 -0.28843032880048E-001  0.27716782579252E-001  0.67904616881690E-002  0.70663869149509E-002 -0.28843032880048E-001
   1.0436681556456       0.61081328694561E-002 -0.28812142942606E-001  0.27606613066376E-001  0.58525622693527E-002  0.61081328694561E-002 -0.28812142942606E-001
   1.0467020747027       0.51582519645451E-002 -0.28746634005093E-001  0.27464007858453E-001  0.49280994938415E-002  0.51582519645451E-002 -0.28746634005093E-001
   1.0497359937598       0.42180753290563E-002 -0.28647064532630E-001  0.27289780195139E-001  0.40182249195330E-002  0.42180753290563E-002 -0.28647064532630E-001
   1.0527699128169       0.32889028879909E-002 -0.28514046789042E-001  0.27084785043626E-001  0.31240471901318E-002  0.32889028879909E-002 -0.28514046789042E-001
   1.0558038318740       0.23720010971621E-002 -0.28348245181911E-001  0.26849916931627E-001  0.22466305061158E-002  0.23720010971621E-002 -0.28348245181911E-001
   1.0588377509311       0.14686007642537E-002 -0.28150374508889E-001  0.26586107724375E-001  0.13869932035973E-002  0.14686007642537E-002 -0.28150374508889E-001
   1.0618716699882       0.57989496072010E-003 -0.27921198109800E-001  0.26294324350993E-001  0.54610644309452E-003  0.57989496072010E-003 -0.27921198109800E-001
   1.0649055890453      -0.29296297127867E-003 -0.27661525929218E-001  0.25975566485679E-001 -0.27510699003966E-003 -0.29296297127867E-003 -0.27661525929218E-001
   1.0679395081024      -0.11488613129564E-002 -0.27372212494428E-001  0.25630864189175E-001 -0.10757737720536E-002 -0.11488613129564E-002 -0.27372212494428E-001
   1.0709734271595      -0.19867317602994E-002 -0.27054154813850E-001  0.25261275516054E-001 -0.18550710128903E-002 -0.19867317602994E-002 -0.27054154813850E-001
   1.0740073462166      -0.28055511093534E-002 -0.26708290201173E-001  0.24867884093397E-001 -0.26122271130047E-002 -0.28055511093534E-002 -0.26708290201173E-001
   1.0770412652738      -0.36043428322332E-002 -0.26335594030577E-001  0.24451796676409E-001 -0.33465225042394E-002 -0.36043428322332E-002 -0.26335594030577E-001
   1.0800751843309      -0.43821785409720E-002 -0.25937077428596E-001  0.24014140686571E-001 -0.40572902743681E-002 -0.43821785409720E-002 -0.25937077428596E-001
   1.0831091033880      -0.51381793366067E-002 -0.25513784908268E-001  0.23556061737881E-001 -0.47439166751848E-002 -0.51381793366067E-002 -0.25513784908268E-001
   1.0861430224451      -0.58715170411843E-002 -0.25066791951333E-001  0.23078721156725E-001 -0.54058415142847E-002 -0.58715170411843E-002 -0.25066791951333E-001
   1.0891769415022      -0.65814153106691E-002 -0.24597202544340E-001  0.22583293500885E-001 -0.60425584309487E-002 -0.65814153106691E-002 -0.24597202544340E-001
   1.0922108605593      -0.72671506270250E-002 -0.24106146674608E-001  0.22070964083129E-001 -0.66536150568065E-002 -0.72671506270250E-002 -0.24106146674608E-001
   1.0952447796164      -0.79280531680488E-002 -0.23594777792023E-001  0.21542926504782E-001 -0.72386130622101E-002 -0.79280531680488E-002 -0.23594777792023E-001
   1.0982786986735      -0.85635075538307E-002 -0.23064270242737E-001  0.21000380204582E-001 -0.77972080895073E-002 -0.85635075538307E-002 -0.23064270242737E-001
   1.1013126177306      -0.91729534690226E-002 -0.22515816680838E-001  0.20444528028049E-001 -0.83291095746496E-002 -0.91729534690226E-002 -0.22515816680838E-001
   1.1043465367877      -0.97558861603981E-002 -0.21950625464090E-001  0.19876573822505E-001 -0.88340804588163E-002 -0.97558861603981E-002 -0.21950625464090E-001
   1.1073804558449      -0.10311856809495E-001 -0.21369918039853E-001  0.19297720062749E-001 -0.93119367919740E-002 -0.10311856809495E-001 -0.21369918039853E-001
   1.1104143749020      -0.10840472780423E-001 -0.20774926327252E-001  0.18709165512276E-001 -0.97625472305146E-002 -0.10840472780423E-001 -0.20774926327252E-001
   1.1134482939591      -0.11341397743244E-001 -0.20166890101669E-001  0.18112102924836E-001 -0.10185832431354E-001 -0.11341397743244E-001 -0.20166890101669E-001
   1.1164822130162      -0.11814351673600E-001 -0.19547054387564E-001  0.17507716790900E-001 -0.10581764345070E-001 -0.11814351673600E-001 -0.19547054387564E-001
   1.1195161320733      -0.12259110729581E-001 -0.18916666865575E-001  0.16897181133551E-001 -0.10950365410883E-001 -0.12259110729581E-001 -0.18916666865575E-001
   1.1225500511304      -0.12675507007116E-001 -0.18276975299787E-001  0.16281657358068E-001 -0.11291707656466E-001 -0.12675507007116E-001 -0.18276975299787E-001
   1.1255839701875      -0.13063428175442E-001 -0.17629224990964E-001  0.15662292159355E-001 -0.11605911705784E-001 -0.13063428175442E-001 -0.17629224990964E-001
   1.1286178892446      -0.13422816994499E-001 -0.16974656261419E-001  0.15040215491162E-001 -0.11893145698304E-001 -0.13422816994499E-001 -0.16974656261419E-001
   1.1316518083017      -0.13753670716377E-001 -0.16314501977123E-001  0.14416538600868E-001 -0.12153624123145E-001 -0.13753670716377E-001 -0.16314501977123E-001
   1.1346857273588      -0.14056040373187E-001 -0.15649985112470E-001  0.13792352133394E-001 -0.12387606571826E-001 -0.14056040373187E-001 -0.15649985112470E-001
   1.1377196464159      -0.14330029954029E-001 -0.14982316363020E-001  0.13168724307625E-001 -0.12595396413494E-001 -0.14330029954029E-001 -0.14982316363020E-001
   1.1407535654731      -0.14575795473923E-001 -0.14312691811367E-001  0.12546699168485E-001 -0.12777339396594E-001 -0.14575795473923E-001 -0.14312691811367E-001
   1.1437874845302      -0.14793543937882E-001 -0.13642290651100E-001  0.11927294917643E-001 -0.12933822181101E-001 -0.14793543937882E-001 -0.13642290651100E-001
   1.1468214035873      -0.14983532203474E-001 -0.12972272973664E-001  0.11311502325547E-001 -0.13065270805554E-001 -0.14983532203474E-001 -0.12972272973664E-001
   1.1498553226444      -0.15146065745489E-001 -0.12303777622737E-001  0.10700283227321E-001 -0.13172149093207E-001 -0.15146065745489E-001 -0.12303777622737E-001
   1.1528892417015      -0.15281497326526E-001 -0.11637920120528E-001  0.10094569104793E-001 -0.13254957001744E-001 -0.15281497326526E-001 -0.11637920120528E-001
   1.1559231607586      -0.15390225577498E-001 -0.10975790670192E-001  0.94952597567029E-002 -0.13314228921062E-001 -0.15390225577498E-001 -0.10975790670192E-001
   1.1589570798157      -0.15472693492283E-001 -0.10318452238344E-001  0.89032220589092E-002 -0.13350531923705E-001 -0.15472693492283E-001 -0.10318452238344E-001
   1.1619909988728      -0.15529386840889E-001 -0.96669387214281E-002  0.83192888161831E-002 -0.13364463972573E-001 -0.15529386840889E-001 -0.96669387214281E-002
   1.1650249179299      -0.15560832505690E-001 -0.90222531994399E-002  0.77442577069262E-002 -0.13356652090618E-001 -0.15560832505690E-001 -0.90222531994399E-002
   1.1680588369870      -0.15567596745433E-001 -0.83853662802850E-002  0.71788903219248E-002 -0.13327750497217E-001 -0.15567596745433E-001 -0.83853662802850E-002
   1.1710927560441      -0.15550283391863E-001 -0.77572145377815E-002  0.66239112980126E-002 -0.13278438715983E-001 -0.15550283391863E-001 -0.77572145377815E-002
   1.1741266751013      -0.15509531983935E-001 -0.71386990460699E-002  0.60800075472728E-002 -0.13209419658741E-001 -0.15509531983935E-001 -0.71386990460699E-002
   1.1771605941584      -0.15446015844691E-001 -0.65306840129269E-002  0.55478275821798E-002 -0.13121417690450E-001 -0.15446015844691E-001 -0.65306840129269E-002
   1.1801945132155      -0.15360440105993E-001 -0.59339955142120E-002  0.50279809368412E-002 -0.13015176679769E-001 -0.15360440105993E-001 -0.59339955142120E-002
   1.1832284322726      -0.15253539686377E-001 -0.53494203314074E-002  0.45210376842728E-002 -0.12891458040000E-001 -0.15253539686377E-001 -0.53494203314074E-002
   1.1862623513297      -0.15126077227355E-001 -0.47777048939345E-002  0.40275280494058E-002 -0.12751038765076E-001 -0.15126077227355E-001 -0.47777048939345E-002
   1.1892962703868      -0.14978840993579E-001 -0.42195543276551E-002  0.35479421173017E-002 -0.12594709465210E-001 -0.14978840993579E-001 -0.42195543276551E-002
   1.1923301894439      -0.14812642742290E-001 -0.36756316106891E-002  0.30827296358263E-002 -0.12423272406781E-001 -0.14812642742290E-001 -0.36756316106891E-002
   1.1953641085010      -0.14628315567520E-001 -0.31465568373967E-002  0.26322999118172E-002 -0.12237539560949E-001 -0.14628315567520E-001 -0.31465568373967E-002
   1.1983980275581      -0.14426711724524E-001 -0.26329065910999E-002  0.21970217995642E-002 -0.12038330665414E-001 -0.14426711724524E-001 -0.26329065910999E-002
   1.2014319466152      -0.14208700439928E-001 -0.21352134258351E-002  0.17772237802154E-002 -0.11826471303646E-001 -0.14208700439928E-001 -0.21352134258351E-002
   1.2044658656723      -0.13975165713037E-001 -0.16539654571540E-002  0.13731941305208E-002 -0.11602791005817E-001 -0.13975165713037E-001 -0.16539654571540E-002
   1.2074997847295      -0.13727004113750E-001 -0.11896060617138E-002  0.98518117912569E-003 -0.11368121375546E-001 -0.13727004113750E-001 -0.11896060617138E-002
   1.2105337037866      -0.13465122582470E-001 -0.74253368512692E-003  0.61339364844140E-003 -0.11123294246456E-001 -0.13465122582470E-001 -0.74253368512692E-003
   1.2135676228437      -0.13190436237331E-001 -0.31310175727023E-003  0.25800107993699E-003 -0.10869139872423E-001 -0.13190436237331E-001 -0.31310175727023E-003
   1.2166015419008      -0.12903866194017E-001  0.98381286008535E-004 -0.80865659478638E-004 -0.10606485155244E-001 -0.12903866194017E-001  0.98381286008535E-004
   1.2196354609579      -0.12606337403334E-001  0.49165187611069E-003 -0.40311379248071E-003 -0.10336151913321E-001 -0.12606337403334E-001  0.49165187611069E-003
   1.2226693800150      -0.12298776511633E-001  0.86649108140824E-003 -0.70868797041242E-003 -0.10058955194807E-001 -0.12298776511633E-001  0.86649108140824E-003
   1.2257032990721      -0.11982109749053E-001  0.12227242752916E-002 -0.99756953923290E-003 -0.97757016384991E-002 -0.11982109749053E-001  0.12227242752916E-002
   1.2287372181292      -0.11657260850415E-001  0.15602207046075E-002 -0.12697757352731E-002 -0.94871878855947E-002 -0.11657260850415E-001  0.15602207046075E-002
   1.2317711371863      -0.11325149013516E-001  0.18788929607842E-002 -0.15253588138752E-002 -0.91941990452753E-002 -0.11325149013516E-001  0.18788929607842E-002
   1.2348050562434      -0.10986686899373E-001  0.21786963561672E-002 -0.17644051141119E-002 -0.88975072168859E-002 -0.10986686899373E-001  0.21786963561672E-002
   1.2378389753005      -0.10642778678842E-001  0.24596282083025E-002 -0.19870340628960E-002 -0.85978700713134E-002 -0.10642778678842E-001  0.24596282083025E-002
   1.2408728943577      -0.10294318129867E-001  0.27217270351159E-002 -0.21933971218904E-002 -0.82960294939761E-002 -0.10294318129867E-001  0.27217270351159E-002
   1.2439068134148      -0.99421867894348E-002  0.29650716641299E-002 -0.23836766807235E-002 -0.79927102916508E-002 -0.99421867894348E-002  0.29650716641299E-002
   1.2469407324719      -0.95872521641297E-002  0.31897802590497E-002 -0.25580849000950E-002 -0.76886189651728E-002 -0.95872521641297E-002  0.31897802590497E-002
   1.2499746515290      -0.92303660029820E-002  0.33960092672282E-002 -0.27168625084310E-002 -0.73844425498479E-002 -0.92303660029820E-002  0.33960092672282E-002
   1.2530085705861      -0.88723626361177E-002  0.35839522916820E-002 -0.28602775558076E-002 -0.70808475252230E-002 -0.88723626361177E-002  0.35839522916820E-002
   1.2560424896432      -0.85140573824937E-002  0.37538388914885E-002 -0.29886241289137E-002 -0.67784787956594E-002 -0.85140573824937E-002  0.37538388914885E-002
   1.2590764087003      -0.81562450297931E-002  0.39059333145365E-002 -0.31022210308654E-002 -0.64779587429586E-002 -0.81562450297931E-002  0.39059333145365E-002
   1.2621103277574      -0.77996983893343E-002  0.40405331667330E-002 -0.32014104297145E-002 -0.61798863520856E-002 -0.77996983893343E-002  0.40405331667330E-002
   1.2651442468145      -0.74451669286194E-002  0.41579680218879E-002 -0.32865564795138E-002 -0.58848364108404E-002 -0.74451669286194E-002  0.41579680218879E-002
   1.2681781658716      -0.70933754839130E-002  0.42585979766074E-002 -0.33580439178121E-002 -0.55933587841245E-002 -0.70933754839130E-002  0.42585979766074E-002
   1.2712120849287      -0.67450230550104E-002  0.43428121546159E-002 -0.34162766434519E-002 -0.53059777632530E-002 -0.67450230550104E-002  0.43428121546159E-002
   1.2742460039859      -0.64007816841106E-002  0.44110271650128E-002 -0.34616762785326E-002 -0.50231914905669E-002 -0.64007816841106E-002  0.44110271650128E-002
   1.2772799230430      -0.60612954204692E-002  0.44636855190347E-002 -0.34946807183820E-002 -0.47454714594032E-002 -0.60612954204692E-002  0.44636855190347E-002
   1.2803138421001      -0.57271793722593E-002  0.45012540099499E-002 -0.35157426733484E-002 -0.44732620892899E-002 -0.57271793722593E-002  0.45012540099499E-002
   1.2833477611572      -0.53990188468263E-002  0.45242220607559E-002 -0.35253282061882E-002 -0.42069803760424E-002 -0.53990188468263E-002  0.45242220607559E-002
   1.2863816802143      -0.50773685802691E-002  0.45331000443781E-002 -0.35239152687739E-002 -0.39470156162542E-002 -0.50773685802691E-002  0.45331000443781E-002
   1.2894155992714      -0.47627520570409E-002  0.45284175810828E-002 -0.35119922417889E-002 -0.36937292054882E-002 -0.47627520570409E-002  0.45284175810828E-002
   1.2924495183285      -0.44556609200096E-002  0.45107218178247E-002 -0.34900564810131E-002 -0.34474545093042E-002 -0.44556609200096E-002  0.45107218178247E-002
   1.2954834373856      -0.41565544711774E-002  0.44805756942362E-002 -0.34586128737225E-002 -0.32084968060770E-002 -0.41565544711774E-002  0.44805756942362E-002
   1.2985173564427      -0.38658592630132E-002  0.44385561999437E-002 -0.34181724086485E-002 -0.29771333004002E-002 -0.38658592630132E-002  0.44385561999437E-002
   1.3015512754998      -0.35839687801138E-002  0.43852526278637E-002 -0.33692507628481E-002 -0.27536132057013E-002 -0.35839687801138E-002  0.43852526278637E-002
   1.3045851945569      -0.33112432106689E-002  0.43212648280814E-002 -0.33123669087391E-002 -0.25381578945432E-002 -0.33112432106689E-002  0.43212648280814E-002
   1.3076191136141      -0.30480093069773E-002  0.42472014668568E-002 -0.32480417444482E-002 -0.23309611149328E-002 -0.30480093069773E-002  0.42472014668568E-002
   1.3106530326712      -0.27945603340255E-002  0.41636782952325E-002 -0.31767967505075E-002 -0.21321892708172E-002 -0.27945603340255E-002  0.41636782952325E-002
   1.3136869517283      -0.25511561049252E-002  0.40713164316340E-002 -0.30991526758165E-002 -0.19419817648100E-002 -0.25511561049252E-002  0.40713164316340E-002
   1.3167208707854      -0.23180231017796E-002  0.39707406627596E-002 -0.30156282556615E-002 -0.17604514010604E-002 -0.23180231017796E-002  0.39707406627596E-002
   1.3197547898425      -0.20953546803445E-002  0.38625777669544E-002 -0.29267389644522E-002 -0.15876848460573E-002 -0.20953546803445E-002  0.38625777669544E-002
   1.3227887088996      -0.18833113566398E-002  0.37474548641440E-002 -0.28329958057031E-002 -0.14237431450458E-002 -0.18833113566398E-002  0.37474548641440E-002
   1.3258226279567      -0.16820211734729E-002  0.36259977962837E-002 -0.27349041416437E-002 -0.12686622916258E-002 -0.16820211734729E-002  0.36259977962837E-002
   1.3288565470138      -0.14915801446448E-002  0.34988295421408E-002 -0.26329625646977E-002 -0.11224538480069E-002 -0.14915801446448E-002  0.34988295421408E-002
   1.3318904660709      -0.13120527744281E-002  0.33665686700844E-002 -0.25276618129235E-002 -0.98510561330069E-003 -0.13120527744281E-002  0.33665686700844E-002
   1.3349243851280      -0.11434726497345E-002  0.32298278324085E-002 -0.24194837313566E-002 -0.85658233715226E-003 -0.11434726497345E-002  0.32298278324085E-002
   1.3379583041851      -0.98584310222434E-003  0.30892123045485E-002 -0.23089002810367E-002 -0.73682647593771E-003 -0.98584310222434E-003  0.30892123045485E-002
   1.3409922232423      -0.83913793745887E-003  0.29453185723896E-002 -0.21963725973506E-002 -0.62575898869122E-003 -0.83913793745887E-003  0.29453185723896E-002
   1.3440261422994      -0.70330222804934E-003  0.27987329706850E-002 -0.20823500991557E-002 -0.52328016986792E-003 -0.70330222804934E-003  0.27987329706850E-002
   1.3470600613565      -0.57825316762494E-003  0.26500303754260E-002 -0.19672696499943E-002 -0.42927051600256E-003 -0.57825316762494E-003  0.26500303754260E-002
   1.3500939804136      -0.46388098231683E-003  0.24997729528157E-002 -0.18515547725425E-002 -0.34359162328442E-003 -0.46388098231683E-003  0.24997729528157E-002
   1.3531278994707      -0.36004989634313E-003  0.23485089673068E-002 -0.17356149172783E-002 -0.26608711303933E-003 -0.36004989634313E-003  0.23485089673068E-002
   1.3561618185278      -0.26659914817737E-003  0.21967716509677E-002 -0.16198447861867E-002 -0.19658358208815E-003 -0.26659914817737E-003  0.21967716509677E-002
   1.3591957375849      -0.18334405369216E-003  0.20450781362405E-002 -0.15046237121626E-002 -0.13489157493823E-003 -0.18334405369216E-003  0.20450781362405E-002
   1.3622296566420      -0.11007711258994E-003  0.18939284539475E-002 -0.13903150946046E-002 -0.80806574760149E-004 -0.11007711258994E-003  0.18939284539475E-002
   1.3652635756991      -0.46569154364198E-004  0.17438045981998E-002 -0.12772658915381E-002 -0.34110010105815E-004 -0.46569154364198E-004  0.17438045981998E-002
   1.3682974947562       0.74294800221525E-005  0.15951696596493E-002 -0.11658061684411E-002  0.54297256631871E-005  0.74294800221525E-005  0.15951696596493E-002
   1.3713314138133       0.52187724600589E-004  0.14484670283146E-002 -0.10562487037956E-002  0.38056245248161E-004  0.52187724600589E-004  0.14484670283146E-002
   1.3743653328705       0.87992546895872E-004  0.13041196670018E-002 -0.94888865122789E-003  0.64024131569219E-004  0.87992546895872E-004  0.13041196670018E-002
   1.3773992519276       0.11514768237588E-003  0.11625294561261E-002 -0.84400325795101E-003  0.83597898150985E-004  0.11514768237588E-003  0.11625294561261E-002
   1.3804331709847       0.13397234877932E-003  0.10240766105301E-002 -0.74185163907621E-003  0.97050948640823E-004  0.13397234877932E-003  0.10240766105301E-002
   1.3834670900418       0.14479994424807E-003  0.88911916868320E-003 -0.64267460721190E-003  0.10466453831128E-003  0.14479994424807E-003  0.88911916868320E-003
   1.3865010090989       0.14797673317971E-003  0.75799255443682E-003 -0.54669455663033E-003  0.10672674034034E-003  0.14797673317971E-003  0.75799255443682E-003
   1.3895349281560       0.14386052369348E-003  0.63100921130345E-003 -0.45411540114421E-003  0.10353141959835E-003  0.14386052369348E-003  0.63100921130345E-003
   1.3925688472131       0.13281934056940E-003  0.50845830902144E-003 -0.36512256470407E-003  0.95377216598809E-004  0.13281934056940E-003  0.50845830902144E-003
   1.3956027662702       0.11523009747682E-003  0.39060552196751E-003 -0.27988302359948E-003  0.82566544192781E-004  0.11523009747682E-003  0.39060552196751E-003
   1.3986366853273       0.91477272254088E-004  0.27769287878032E-003 -0.19854539902571E-003  0.65404599503036E-004  0.91477272254088E-004  0.27769287878032E-003
   1.4016706043844       0.61951588936713E-004  0.16993868236521E-003 -0.12124009866059E-003  0.44198393504813E-004  0.61951588936713E-004  0.16993868236521E-003
   1.4047045234416       0.27048710157076E-004  0.67537499261785E-004 -0.48079505785542E-004  0.19255800565664E-004  0.27048710157076E-004  0.67537499261785E-004
   1.4077384424987      -0.12832056544886E-004 -0.29339782827311E-004  0.20841785619802E-004 -0.91153698425043E-005 -0.12832056544886E-004 -0.29339782827311E-004
   1.4107723615558      -0.57289035053789E-004 -0.12054583072540E-003  0.85446691479312E-004 -0.40608277150122E-004 -0.57289035053789E-004 -0.12054583072540E-003
   1.4138062806129      -0.10591943630899E-003 -0.20595667623876E-003  0.14567531568008E-003 -0.74917927414407E-004 -0.10591943630899E-003 -0.20595667623876E-003
   1.4168401996700      -0.15832058999844E-003 -0.28547146309629E-003  0.20148458743815E-003 -0.11174202287267E-003 -0.15832058999844E-003 -0.28547146309629E-003
   1.4198741187271      -0.21409114919987E-003 -0.35901213224366E-003  0.25284785989726E-003 -0.15078178155103E-003 -0.21409114919987E-003 -0.35901213224366E-003
   1.4229080377842      -0.27283226497863E-003 -0.42652304751382E-003  0.29975447196012E-003 -0.19174272527372E-003 -0.27283226497863E-003 -0.42652304751382E-003
   1.4259419568413      -0.33414872808428E-003 -0.48797056383768E-003  0.34220927541722E-003 -0.23433543453934E-003 -0.33414872808428E-003 -0.48797056383768E-003
   1.4289758758984      -0.39765007502758E-003 -0.54334254029252E-003  0.38023212949687E-003 -0.27827626885414E-003 -0.39765007502758E-003 -0.54334254029252E-003
   1.4320097949555      -0.46295165596473E-003 -0.59264780041097E-003  0.41385736501151E-003 -0.32328805123788E-003 -0.46295165596473E-003 -0.59264780041097E-003
   1.4350437140126      -0.52967566196722E-003 -0.63591554229018E-003  0.44313322031985E-003 -0.36910071574485E-003 -0.52967566196722E-003 -0.63591554229018E-003
   1.4380776330698      -0.59745210941176E-003 -0.67319470114815E-003  0.46812125136189E-003 -0.41545191697087E-003 -0.59745210941176E-003 -0.67319470114815E-003
   1.4411115521269      -0.66591977938566E-003 -0.70455326707251E-003  0.48889571805368E-003 -0.46208760064609E-003 -0.66591977938566E-003 -0.70455326707251E-003
   1.4441454711840      -0.73472711016796E-003 -0.73007756079619E-003  0.50554294935236E-003 -0.50876253454273E-003 -0.73472711016796E-003 -0.73007756079619E-003
   1.4471793902411      -0.80353304101528E-003 -0.74987147041359E-003  0.51816068931763E-003 -0.55524079905631E-003 -0.80353304101528E-003 -0.74987147041359E-003
   1.4502133092982      -0.87200780565260E-003 -0.76405565202047E-003  0.52685742650523E-003 -0.60129623694779E-003 -0.87200780565260E-003 -0.76405565202047E-003
   1.4532472283553      -0.93983367404318E-003 -0.77276669732095E-003  0.53175170902994E-003 -0.64671286186235E-003 -0.93983367404318E-003 -0.77276669732095E-003
   1.4562811474124      -0.10067056411878E-002 -0.77615627129468E-003  0.53297144763138E-003 -0.69128522536777E-003 -0.10067056411878E-002 -0.77615627129468E-003
   1.4593150664695      -0.10723320618804E-002 -0.77439022305766E-003  0.53065320906411E-003 -0.73481874238076E-003 -0.10723320618804E-002 -0.77439022305766E-003
   1.4623489855266      -0.11364352305253E-002 -0.76764767308031E-003  0.52494150211611E-003 -0.77712997497382E-003 -0.11364352305253E-002 -0.76764767308031E-003
   1.4653829045837      -0.11987519052992E-002 -0.75612007994677E-003  0.51598805853516E-003 -0.81804687467660E-003 -0.11987519052992E-002 -0.75612007994677E-003
   1.4684168236408      -0.12590337761201E-002 -0.74001028984997E-003  0.50395111111241E-003 -0.85740898350535E-003 -0.12590337761201E-002 -0.74001028984997E-003
   1.4714507426980      -0.13170478760594E-002 -0.71953157201795E-003  0.48899467113569E-003 -0.89506759407017E-003 -0.13170478760594E-002 -0.71953157201795E-003
   1.4744846617551      -0.13725769360147E-002 -0.69490664325804E-003  0.47128780738275E-003 -0.93088586922361E-003 -0.13725769360147E-002 -0.69490664325804E-003
   1.4775185808122      -0.14254196826275E-002 -0.66636668478723E-003  0.45100392877695E-003 -0.96473892182391E-003 -0.14254196826275E-002 -0.66636668478723E-003
   1.4805524998693      -0.14753910796083E-002 -0.63415035448964E-003  0.42832007277393E-003 -0.99651385529291E-003 -0.14753910796083E-002 -0.63415035448964E-003
   1.4835864189264      -0.15223225127958E-002 -0.59850279770517E-003  0.40341620148982E-003 -0.10261097657509E-002 -0.15223225127958E-002 -0.59850279770517E-003
   1.4866203379835      -0.15660619194445E-002 -0.55967465960807E-003  0.37647450751766E-003 -0.10534377066096E-002 -0.15660619194445E-002 -0.55967465960807E-003
   1.4896542570406      -0.16064738623955E-002 -0.51792110217974E-003  0.34767873131089E-003 -0.10784206165979E-002 -0.16064738623955E-002 -0.51792110217974E-003
   1.4926881760977      -0.16434395499422E-002 -0.47350082871759E-003  0.31721349194006E-003 -0.11009932122854E-002 -0.16434395499422E-002 -0.47350082871759E-003
   1.4957220951548      -0.16768568023581E-002 -0.42667511875132E-003  0.28526363295259E-003 -0.11211018462521E-002 -0.16768568023581E-002 -0.42667511875132E-003
   1.4987560142119      -0.17066399661967E-002 -0.37770687615920E-003  0.25201358498488E-003 -0.11387043321351E-002 -0.17066399661967E-002 -0.37770687615920E-003
   1.5017899332690      -0.17327197776197E-002 -0.32685969319139E-003  0.21764674669239E-003 -0.11537697378541E-002 -0.17327197776197E-002 -0.32685969319139E-003
   1.5048238523262      -0.17550431761442E-002 -0.27439693301434E-003  0.18234488547625E-003 -0.11662781483901E-002 -0.17550431761442E-002 -0.27439693301434E-003
   1.5078577713833      -0.17735730703300E-002 -0.22058083329043E-003  0.14628755939499E-003 -0.11762203995560E-002 -0.17735730703300E-002 -0.22058083329043E-003
   1.5108916904404      -0.17882880570506E-002 -0.16567163320152E-003  0.10965156155782E-003 -0.11835977842524E-002 -0.17882880570506E-002 -0.16567163320152E-003
   1.5139256094975      -0.17991820961103E-002 -0.10992672621275E-003  0.72610388200804E-004 -0.11884217327610E-002 -0.17991820961103E-002 -0.10992672621275E-003
   1.5169595285546      -0.18062641420780E-002 -0.53599840755918E-004  0.35333731551157E-004 -0.11907134686705E-002 -0.18062641420780E-002 -0.53599840755918E-004
   1.5199934476117      -0.18095577353102E-002  0.30597491109962E-005 -0.20130015137920E-005 -0.11905036420739E-002 -0.18095577353102E-002  0.30597491109962E-005
   1.5230273666688      -0.18091005542320E-002  0.59807981138255E-004 -0.39269144105446E-004 -0.11878319417128E-002 -0.18091005542320E-002  0.59807981138255E-004
   1.5260612857259      -0.18049439310310E-002  0.11640672861438E-003 -0.76279196453767E-004 -0.11827466877731E-002 -0.18049439310310E-002  0.11640672861438E-003
   1.5290952047830      -0.17971523329974E-002  0.17262448872821E-003 -0.11289322482226E-003 -0.11753044070610E-002 -0.17971523329974E-002  0.17262448872821E-003
   1.5321291238401      -0.17858028118161E-002  0.22823703403765E-003 -0.14896723160356E-003 -0.11655693923108E-002 -0.17858028118161E-002  0.22823703403765E-003
   1.5351630428972      -0.17709844231781E-002  0.28302802566057E-003 -0.18436349609252E-003 -0.11536132473824E-002 -0.17709844231781E-002  0.28302802566057E-003
   1.5381969619544      -0.17527976191338E-002  0.33678958694699E-003 -0.21895088553489E-003 -0.11395144201213E-002 -0.17527976191338E-002  0.33678958694699E-003
   1.5412308810115      -0.17313536156555E-002  0.38932283653621E-003 -0.25260513614982E-003 -0.11233577246514E-002 -0.17313536156555E-002  0.38932283653621E-003
   1.5442648000686      -0.17067737379176E-002  0.44043837984950E-003 -0.28520910392437E-003 -0.11052338548685E-002 -0.17067737379176E-002  0.44043837984950E-003
   1.5472987191257      -0.16791887458261E-002  0.48995675821589E-003 -0.31665298507630E-003 -0.10852388908943E-002 -0.16791887458261E-002  0.48995675821589E-003
   1.5503326381828      -0.16487381423581E-002  0.53770885497660E-003 -0.34683450617854E-003 -0.10634738002360E-002 -0.16487381423581E-002  0.53770885497660E-003
   1.5533665572399      -0.16155694672763E-002  0.58353625806110E-003 -0.37565908403356E-003 -0.10400439353779E-002 -0.16155694672763E-002  0.58353625806110E-003
   1.5564004762970      -0.15798375787938E-002  0.62729157867492E-003 -0.40303995547944E-003 -0.10150585295068E-002 -0.15798375787938E-002  0.62729157867492E-003
   1.5594343953541      -0.15417039257583E-002  0.66883872588568E-003 -0.42889827739999E-003 -0.98863019204359E-003 -0.15417039257583E-002  0.66883872588568E-003
   1.5624683144112      -0.15013358129120E-002  0.70805313703815E-003 -0.45316319729975E-003 -0.96087440562131E-003 -0.15013358129120E-002  0.70805313703815E-003
   1.5655022334683      -0.14589056617647E-002  0.74482196407221E-003 -0.47577189489029E-003 -0.93190902611012E-003 -0.14589056617647E-002  0.74482196407221E-003
   1.5685361525254      -0.14145902695902E-002  0.77904421595806E-003 -0.49666959521701E-003 -0.90185378724780E-003 -0.14145902695902E-002  0.77904421595806E-003
   1.5715700715826      -0.13685700690196E-002  0.81063085760067E-003 -0.51580955393505E-003 -0.87082981138822E-003 -0.13685700690196E-002  0.81063085760067E-003
   1.5746039906397      -0.13210283906635E-002  0.83950486570042E-003 -0.53315301541906E-003 -0.83895912782924E-003 -0.13210283906635E-002  0.83950486570042E-003
   1.5776379096968      -0.12721507311438E-002  0.86560124218760E-003 -0.54866914446419E-003 -0.80636420012771E-003 -0.12721507311438E-002  0.86560124218760E-003
   1.5806718287539      -0.12221240288614E-002  0.88886698597623E-003 -0.56233493240464E-003 -0.77316746375169E-003 -0.12221240288614E-002  0.88886698597623E-003
   1.5837057478110      -0.11711359497601E-002  0.90926102390526E-003 -0.57413507854097E-003 -0.73949087535918E-003 -0.11711359497601E-002  0.90926102390526E-003
   1.5867396668681      -0.11193741852795E-002  0.92675410185393E-003 -0.58406184782861E-003 -0.70545547492925E-003 -0.11193741852795E-002  0.92675410185393E-003
   1.5897735859252      -0.10670257646121E-002  0.94132863713157E-003 -0.59211490583657E-003 -0.67118096190481E-003 -0.10670257646121E-002  0.94132863713157E-003
   1.5928075049823      -0.10142763833001E-002  0.95297853335039E-003 -0.59830113203853E-003 -0.63678528643761E-003 -0.10142763833001E-002  0.95297853335039E-003
   1.5958414240394      -0.96130975011891E-003  0.96170895909286E-003 -0.60263441254618E-003 -0.60238425675505E-003 -0.96130975011891E-003  0.96170895909286E-003
   1.5988753430965      -0.90830695410368E-003  0.96753609178230E-003 -0.60513541343910E-003 -0.56809116359538E-003 -0.90830695410368E-003  0.96753609178230E-003
   1.6019092621536      -0.85544585347835E-003  0.97048682825659E-003 -0.60583133588468E-003 -0.53401642258331E-003 -0.85544585347835E-003  0.97048682825659E-003
   1.6049431812108      -0.80290048814508E-003  0.97059846362975E-003 -0.60475565427652E-003 -0.50026723534186E-003 -0.80290048814508E-003  0.97059846362975E-003
