{
    "categories": [
        { "id": "common-pizza", "text": "Пицца", "url": "/commin-pizza" },        
        { "id": "zakuski", "text": "Закуски", "url":"/zakuski" },
        { "id": "vafli", "text": "Гонконгские вафли", "url":"/gonkongskie-vafli" },        
        { "id": "supy", "text": "Супы", "url":"/supy" },
        { "id": "salaty", "text": "Салаты", "url": "/salaty" },
        { "id": "deserty", "text": "Десерты", "url": "/deserty" },
        { "id": "sousy", "text": "Соусы", "url": "sousy" },        
        { "id": "napitki", "text": "Напитки", "url": "/napitki" }
    ]
}