^C:\USERS\АДМИНИСТРАТОР\SOURCE\REPOS\LAB-11\LAB-11\DEBUG\LAB-11.OBJ
C:\USERS\Администратор\SOURCE\REPOS\LAB-11\DEBUG\LAB-11.EXE
C:\USERS\Администратор\SOURCE\REPOS\LAB-11\DEBUG\LAB-11.ILK
C:\USERS\АДМИНИСТРАТОР\SOURCE\REPOS\LAB-11\DEBUG\LAB-11.PDB
