[
  {
    "position": [
      49.79148,
      24.10934
    ],
    "distance": 1532,
    "title": "Tartak-Resort",
    "averageRating": 0,
    "category": {
      "id": "hotel",
      "title": "Hotel",
      "href": "https://places.ls.hereapi.com/places/v1/categories/places/hotel?app_id=M2DqFK8YuFBVjVZjKyiP&app_code=U99SL4Y7_meHIDbZbv5rew",
      "type": "urn:nlp-types:category",
      "system": "places"
    },
    "icon": "https://download.vcdn.data.here.com/p/d/places2/icons/categories/01.icon",
    "vicinity": "Pustomytivs'kyy rayon<br/>81192",
    "having": [],
    "type": "urn:nlp-types:place",
    "href": "https://places.ls.hereapi.com/places/v1/places/804u8c56-cd9b3093661f4b4e8f524f7e92c24daa;context=Zmxvdy1pZD0zM2E0MjBhMy1lNDYyLTUxYzctYjFlZi02ZDFhMGI3OWZmMTZfMTYwMDQxOTQxMDU2OF80ODk1XzQzMDAmcmFuaz0w?app_id=M2DqFK8YuFBVjVZjKyiP&app_code=U99SL4Y7_meHIDbZbv5rew",
    "id": "804u8c56-cd9b3093661f4b4e8f524f7e92c24daa"
  },
  {
    "position": [
      49.81377,
      24.12746
    ],
    "distance": 1727,
    "title": "Semillon Club",
    "averageRating": 0,
    "category": {
      "id": "hotel",
      "title": "Hotel",
      "href": "https://places.ls.hereapi.com/places/v1/categories/places/hotel?app_id=M2DqFK8YuFBVjVZjKyiP&app_code=U99SL4Y7_meHIDbZbv5rew",
      "type": "urn:nlp-types:category",
      "system": "places"
    },
    "icon": "https://download.vcdn.data.here.com/p/d/places2/icons/categories/01.icon",
    "vicinity": "L'vivs'ka vulytsya, 3<br/>L'viv<br/>79495",
    "having": [],
    "type": "urn:nlp-types:place",
    "href": "https://places.ls.hereapi.com/places/v1/places/804u8c5m-ca92fccc12d6489096b02960d13b8c95;context=Zmxvdy1pZD0zM2E0MjBhMy1lNDYyLTUxYzctYjFlZi02ZDFhMGI3OWZmMTZfMTYwMDQxOTQxMDU2OF80ODk1XzQzMDAmcmFuaz0x?app_id=M2DqFK8YuFBVjVZjKyiP&app_code=U99SL4Y7_meHIDbZbv5rew",
    "id": "804u8c5m-ca92fccc12d6489096b02960d13b8c95"
  },
  {
    "position": [
      49.81418,
      24.13114
    ],
    "distance": 1976,
    "title": "Rus'Ka STR. Hostel",
    "averageRating": 0,
    "category": {
      "id": "hotel",
      "title": "Hotel",
      "href": "https://places.ls.hereapi.com/places/v1/categories/places/hotel?app_id=M2DqFK8YuFBVjVZjKyiP&app_code=U99SL4Y7_meHIDbZbv5rew",
      "type": "urn:nlp-types:category",
      "system": "places"
    },
    "icon": "https://download.vcdn.data.here.com/p/d/places2/icons/categories/01.icon",
    "vicinity": "Rus'ka vulytsya<br/>L'viv<br/>79495",
    "having": [],
    "type": "urn:nlp-types:place",
    "href": "https://places.ls.hereapi.com/places/v1/places/804u8c5m-9aad3075c7e34f899582cd1a0bcae20f;context=Zmxvdy1pZD0zM2E0MjBhMy1lNDYyLTUxYzctYjFlZi02ZDFhMGI3OWZmMTZfMTYwMDQxOTQxMDU2OF80ODk1XzQzMDAmcmFuaz0y?app_id=M2DqFK8YuFBVjVZjKyiP&app_code=U99SL4Y7_meHIDbZbv5rew",
    "id": "804u8c5m-9aad3075c7e34f899582cd1a0bcae20f"
  },
  {
    "position": [
      49.81092,
      24.13467
    ],
    "distance": 2059,
    "title": "LC Hostel",
    "averageRating": 0,
    "category": {
      "id": "hotel",
      "title": "Hotel",
      "href": "https://places.ls.hereapi.com/places/v1/categories/places/hotel?app_id=M2DqFK8YuFBVjVZjKyiP&app_code=U99SL4Y7_meHIDbZbv5rew",
      "type": "urn:nlp-types:category",
      "system": "places"
    },
    "icon": "https://download.vcdn.data.here.com/p/d/places2/icons/categories/01.icon",
    "vicinity": "Tarasa Shevchenka vulytsya<br/>L'viv<br/>79495",
    "having": [],
    "type": "urn:nlp-types:place",
    "href": "https://places.ls.hereapi.com/places/v1/places/804u8c5d-53f5e75eaa3643d3a48ae66b37137392;context=Zmxvdy1pZD0zM2E0MjBhMy1lNDYyLTUxYzctYjFlZi02ZDFhMGI3OWZmMTZfMTYwMDQxOTQxMDU2OF80ODk1XzQzMDAmcmFuaz0z?app_id=M2DqFK8YuFBVjVZjKyiP&app_code=U99SL4Y7_meHIDbZbv5rew",
    "id": "804u8c5d-53f5e75eaa3643d3a48ae66b37137392"
  },
  {
    "position": [
      49.81667,
      24.13289
    ],
    "distance": 2231,
    "title": "Happy Hostel",
    "averageRating": 0,
    "category": {
      "id": "hotel",
      "title": "Hotel",
      "href": "https://places.ls.hereapi.com/places/v1/categories/places/hotel?app_id=M2DqFK8YuFBVjVZjKyiP&app_code=U99SL4Y7_meHIDbZbv5rew",
      "type": "urn:nlp-types:category",
      "system": "places"
    },
    "icon": "https://download.vcdn.data.here.com/p/d/places2/icons/categories/01.icon",
    "vicinity": "Solomiyi Krushel'nyts'koyi vulytsya, 1<br/>L'viv<br/>79495",
    "having": [],
    "type": "urn:nlp-types:place",
    "href": "https://places.ls.hereapi.com/places/v1/places/804u8c5m-b5317fe590e0408d8d49506ceb23c464;context=Zmxvdy1pZD0zM2E0MjBhMy1lNDYyLTUxYzctYjFlZi02ZDFhMGI3OWZmMTZfMTYwMDQxOTQxMDU2OF80ODk1XzQzMDAmcmFuaz00?app_id=M2DqFK8YuFBVjVZjKyiP&app_code=U99SL4Y7_meHIDbZbv5rew",
    "id": "804u8c5m-b5317fe590e0408d8d49506ceb23c464"
  }
]