{
   "latitude":[-26.70331940],
   "longitude":[116.67081524],
   "altitude":[400],
   "offsets":
      [[1529,7194],
    [5976,2223],
    [6640,11907],
    [2952,4302],
    [644,11068],
    [11637,3302],
    [2784,2390],
    [11867,10227],
    [1173,13215],
    [9819,13135],
    [6833,7248],
    [2611,3170],
    [8025,12933],
    [12072,781],
    [6963,11661],
    [13083,9869],
    [12034,5207],
    [8918,6507],
    [8722,2556],
    [12612,2831],
    [9833,4049],
    [12773,13067],
    [7951,8537],
    [6315,22],
    [11577,12351],
    [2341,13007],
    [12364,11461],
    [8548,9789],
    [10498,898],
    [6049,3269],
    [8073,9488],
    [11818,6336],
    [13821,3388],
    [7215,13298],
    [9119,3530],
    [13474,1397],
    [9840,5262],
    [13262,13943],
    [5975,10317],
    [3592,5433],
    [6781,12887],
    [11340,12098],
    [3049,8068],
    [8386,1532],
    [4018,2163],
    [4776,8234],
    [91,10612],
    [3759,195],
    [4172,11126],
    [9039,2236],
    [1918,747],
    [10336,13787],
    [7466,1527],
    [10513,4174],
    [5657,2904],
    [3881,1141],
    [10031,4045],
    [11316,4538],
    [13491,6739],
    [6723,6568],
    [9679,9681],
    [834,5056],
    [2888,10931],
    [6580,13590]]
}