{
   "SNR" : [101],
   "time" : [0],
   "runtime" : [10],
   "configuration" : [65, 66],
   "runCorrelator" : [1],
   "runPSS" : [0],
   "runPST" : [0],
   "delayUpdatePeriod" : [1],
   "useLocalDoppler" : [0],
   "forceDelayZero" : [0]
}
