{
   "global":{
      "PSSMode":[1]
   },
   
   "stations":[
      {
         "stationType":["300MHz"],
         "location":[1,2,3,4,5,6,7,8,9,10,11,12,13,14,15,16,17,18,19,20,21],
         "logicalIDs":[1],
         "polarisationOffsets":[2]
      }
   ],

   "subArray":[
      {
         "index":[1],
         "stationType":["300MHz"],
         "logicalIDs":[1,2,3,4,5,6,7,8,9,10,11,12,13,14,15,16]
      },
      {
         "index":[2],
         "stationType":["300MHz"],
         "logicalIDs":[17,18,19,20,21]
      }
   ],

   "stationBeam":[
      {
         "index":[1],
         "subArray":[1],
         "skyIndex":[1],
         "channels":[0],
         "doppler":[0]
      },
      {
         "index":[2],
         "subArray":[2],
         "skyIndex":[1],
         "channels":[0],
         "doppler":[0]
      }
   ],

   "correlator":[
      {
         "subArray":[1],
         "mode":["SPECTRAL_LINE"],
         "coarseStart":65,
         "fineStart":100,
         "NFine":512,
         "fineIntegration":16,
         "timeIntegration":192,
         "stationBeam":[1],
         "correlatorCell":0
      },
      {
         "subArray":[2],
         "mode":["SPECTRAL_LINE"],
         "stationBeam":[2],
         "correlatorCell":0
      }
   ]

}
