{
   "global":{
      "PSSMode":[1]
   },
   
   "stations":[
      {
         "stationType":["300MHz"],
         "location":[1,2,3,4,5,6,7,8,9,10,11,12,13,14,15,16,17,18,19,20,21,22,23,24,25,26,27,28,29,30,31,32,33,34,35,36,37,38,39,40,41,42,43,44,45,46,47,48,49,50,51,52,53,54,55,56,57,58,59,60,61,62,63,64],
         "logicalIDs":[1],
         "polarisationOffsets":[2]
      }
   ],

   "subArray":[
      {
         "index":[1],
         "stationType":["300MHz"],
         "logicalIDs": [1, 2, 3, 4, 5, 6, 7, 8, 9, 10,11,12,13,14,15,16,17,18,19,20,21,22,23,24,25,26,27,28,29,30,31,32,33,34,35,36,37,38,39,40,41,42,43,44,45,46,47,48,49,50,51,52,53,54,55,56,57,58,59,60,61,62,63,64]
      }
   ],

   "stationBeam":[
      {
         "index":[1],
         "subArray":[1],
         "skyIndex":[1],
         "channels":[0],
         "doppler":[0]
      }
   ],

   "correlator":[
      {
         "subArray":[1],
         "mode":["SPECTRAL_LINE"],
         "stationBeam":[1]
      }
   ],

   "PSTBeam":[
    {
    "index":[1],
    "skySubIndex":[1],
    "subArray":[1],
    "weights":[0.95, 0.95, 0.95, 0.95, 0.95, 0.95, 0.95, 0.95, 0.95, 0.95, 0.95, 0.95, 0.95, 0.95, 0.95, 0.95, 0.95, 0.95, 0.95, 0.95, 0.95, 0.95, 0.95, 0.95, 0.95, 0.95, 0.95, 0.95, 0.95, 0.95, 0.95, 0.95, 0.95, 0.95, 0.95, 0.95, 0.95, 0.95, 0.95, 0.95, 0.95, 0.95, 0.95, 0.95, 0.95, 0.95, 0.95, 0.95, 0.95, 0.95, 0.95, 0.95, 0.95, 0.95, 0.95, 0.95, 0.95, 0.95, 0.95, 0.95, 0.95, 0.95, 0.95, 0.95],
    "jonesReal":[[0.70710678, -0.70710678],[0.70710678, 0.70710678]],
    "jonesImag":[[0, 0],[0, 0]]
    },
    {
    "index":[2],
    "skySubIndex":[2],
    "subArray":[1],
    "weights":[0.95, 0.95, 0.95, 0.95, 0.95, 0.95, 0.95, 0.95, 0.95, 0.95, 0.95, 0.95, 0.95, 0.95, 0.95, 0.95, 0.95, 0.95, 0.95, 0.95, 0.95, 0.95, 0.95, 0.95, 0.95, 0.95, 0.95, 0.95, 0.95, 0.95, 0.95, 0.95, 0.95, 0.95, 0.95, 0.95, 0.95, 0.95, 0.95, 0.95, 0.95, 0.95, 0.95, 0.95, 0.95, 0.95, 0.95, 0.95, 0.95, 0.95, 0.95, 0.95, 0.95, 0.95, 0.95, 0.95, 0.95, 0.95, 0.95, 0.95, 0.95, 0.95, 0.95, 0.95],
    "jonesReal":[[0.70710678, 0.70710678],[-0.70710678, 0.70710678]],
    "jonesImag":[[0, 0],[0, 0]]
    }
    ]
   
}
