<?xml version="1.0" encoding="UTF-8"?>
<svg viewBox="0 0 14 14" version="1.1" xmlns="http://www.w3.org/2000/svg" xmlns:xlink="http://www.w3.org/1999/xlink">
    <g id="Symbols" stroke="none" stroke-width="1">
        <g id="Fulscreen" transform="translate(-6.000000, -6.000000)">
            <path d="M16.0857864,8.5 L14.5,8.5 C13.9477153,8.5 13.5,8.05228475 13.5,7.5 C13.5,6.94771525 13.9477153,6.5 14.5,6.5 L18.5,6.5 C19.0522847,6.5 19.5,6.94771525 19.5,7.5 L19.5,11.5 C19.5,12.0522847 19.0522847,12.5 18.5,12.5 C17.9477153,12.5 17.5,12.0522847 17.5,11.5 L17.5,9.91421356 L15.2071068,12.2071068 C14.8165825,12.5976311 14.1834175,12.5976311 13.7928932,12.2071068 C13.4023689,11.8165825 13.4023689,11.1834175 13.7928932,10.7928932 L16.0857864,8.5 Z M9.91421356,17.5 L11.5,17.5 C12.0522847,17.5 12.5,17.9477153 12.5,18.5 C12.5,19.0522847 12.0522847,19.5 11.5,19.5 L7.5,19.5 C6.94771525,19.5 6.5,19.0522847 6.5,18.5 L6.5,14.5 C6.5,13.9477153 6.94771525,13.5 7.5,13.5 C8.05228475,13.5 8.5,13.9477153 8.5,14.5 L8.5,16.0857864 L10.7928932,13.7928932 C11.1834175,13.4023689 11.8165825,13.4023689 12.2071068,13.7928932 C12.5976311,14.1834175 12.5976311,14.8165825 12.2071068,15.2071068 L9.91421356,17.5 Z" id="Arrow-13x13"></path>
        </g>
    </g>
</svg>
