<?xml version="1.0" encoding="utf-8"?>
<!-- Generator: Adobe Illustrator 21.1.0, SVG Export Plug-In . SVG Version: 6.00 Build 0)  -->
<svg version="1.1" id="Слой_1" xmlns="http://www.w3.org/2000/svg" xmlns:xlink="http://www.w3.org/1999/xlink" x="0px" y="0px"
	 viewBox="0 0 16 16" style="enable-background:new 0 0 16 16;" xml:space="preserve">
<g>
	<path d="M13,1.5c0.8,0,1.5,0.7,1.5,1.5v10c0,0.8-0.7,1.5-1.5,1.5H3c-0.8,0-1.5-0.7-1.5-1.5V3c0-0.8,0.7-1.5,1.5-1.5H13 M13,0H3
		C1.4,0,0,1.4,0,3v10c0,1.6,1.4,3,3,3h10c1.6,0,3-1.4,3-3V3C16,1.4,14.6,0,13,0L13,0z"/>
</g>
<g>
	<path d="M11.4,6.5c0,1-0.3,1.7-0.8,2.2S9.1,9.5,8.1,9.5H7.4v2.8H5.1V3.8h3c1.1,0,1.9,0.2,2.4,0.7S11.4,5.7,11.4,6.5z M7.4,7.7h0.4
		c0.3,0,0.6-0.1,0.8-0.3S9,6.9,9,6.6C9,6,8.7,5.7,8,5.7H7.4V7.7z"/>
</g>
</svg>
