<svg xmlns="http://www.w3.org/2000/svg" viewBox="0 0 132.7 133" xml:space="preserve">
<path d="M126.7,19H89.5v-3c0-8.8-7.2-16-16-16H59.2c-8.8,0-16,7.2-16,16v3H6c-3.3,0-6,2.7-6,6s2.7,6,6,6h11.9l0.1,76
	c0,14.4,11.6,26,26,26h44.6c14.4,0,26-11.6,26-26l0.1-76h11.9c3.3,0,6-2.7,6-6S130,19,126.7,19z M55.2,16c0-2.2,1.8-4,4-4h14.4
	c2.2,0,4,1.8,4,4v3H55.2V16z M102.6,106.9c0,7.7-6.3,14-14,14H44c-7.7,0-14-6.3-14-14l-0.1-76h72.9L102.6,106.9z"/>
<path d="M54.3,49.5c-3.3,0-6,2.7-6,6v39.8c0,3.3,2.7,6,6,6s6-2.7,6-6V55.5C60.3,52.2,57.7,49.5,54.3,49.5z"/>
<path d="M78.3,49.5c-3.3,0-6,2.7-6,6v39.8c0,3.3,2.7,6,6,6s6-2.7,6-6V55.5C84.3,52.2,81.7,49.5,78.3,49.5z"/>
</svg>
