<!-- Generated by IcoMoon.io -->
<svg version="1.1" xmlns="http://www.w3.org/2000/svg" width="32" height="32" viewBox="0 0 32 32">
<title>live</title>
<path d="M12.080 16c0-2.166 1.754-3.92 3.92-3.92s3.92 1.754 3.92 3.92c0 2.166-1.754 3.92-3.92 3.92s-3.92-1.754-3.92-3.92zM20.666 7.379c3.059 1.658 5.133 4.896 5.133 8.621s-2.077 6.96-5.133 8.621c1.35-2.147 2.195-5.216 2.195-8.621s-0.845-6.474-2.195-8.621zM9.139 16c0 3.405 0.845 6.474 2.195 8.621-3.059-1.658-5.133-4.896-5.133-8.621s2.077-6.96 5.133-8.621c-1.35 2.147-2.195 5.216-2.195 8.621zM3.261 16c0 5.264 1.667 9.99 4.307 13.222-4.358-2.787-7.248-7.667-7.248-13.222s2.89-10.435 7.248-13.222c-2.643 3.232-4.307 7.958-4.307 13.222zM24.432 2.778c4.358 2.787 7.248 7.667 7.248 13.222s-2.89 10.435-7.248 13.222c2.64-3.232 4.307-7.958 4.307-13.222s-1.664-9.99-4.307-13.222v0z"></path>
</svg>
