<svg width="34" height="34" viewBox="0 0 34 34" xmlns="http://www.w3.org/2000/svg">
<path d="M18.8314 11.7482C19.3847 11.1949 20.2817 11.1949 20.8349 11.7482C21.3456 12.2589 21.3849 13.0624 20.9528 13.6182L20.8349 13.7517L17.5878 16.9999L20.8349 20.2482C21.3456 20.7589 21.3849 21.5624 20.9528 22.1182L20.8349 22.2517C20.3242 22.7623 19.5206 22.8016 18.9649 22.3695L18.8314 22.2517L14.5814 18.0017C14.0708 17.491 14.0315 16.6874 14.4636 16.1316L14.5814 15.9982L18.8314 11.7482Z" fill="#fff"/>
<path d="M29.7498 15.5833C30.5322 15.5833 31.1665 16.2175 31.1665 16.9999C31.1665 17.7264 30.6196 18.3252 29.915 18.4071L29.7498 18.4166L15.5832 18.4166C14.8008 18.4166 14.1665 17.7823 14.1665 16.9999C14.1665 16.2734 14.7134 15.6746 15.418 15.5928L15.5832 15.5833L29.7498 15.5833Z" fill="#fff"/>
<path d="M22.6668 4.25C24.9302 4.25 26.7803 6.0193 26.9096 8.25028L26.9168 8.5V9.91667H24.0835V8.5C24.0835 7.77348 23.5366 7.1747 22.832 7.09286L22.6668 7.08333H11.3335C10.607 7.08333 10.0082 7.63022 9.92636 8.33479L9.91683 8.5V25.5C9.91683 26.2265 10.4637 26.8253 11.1683 26.9071L11.3335 26.9167H22.6668C23.3933 26.9167 23.9921 26.3698 24.074 25.6652L24.0835 25.5V24.0833H26.9168V25.5C26.9168 27.7634 25.1475 29.6135 22.9165 29.7428L22.6668 29.75H11.3335C9.07011 29.75 7.21998 27.9807 7.09071 25.7497L7.0835 25.5V8.5C7.0835 6.23662 8.8528 4.38648 11.0838 4.25721L11.3335 4.25H22.6668Z" fill="#fff"/>
</svg>
