<svg xmlns="http://www.w3.org/2000/svg" viewBox="0 0 20 32">
    <g>
        <path d="M11.4,1c-0.3-0.1-0.5-0.2-0.8-0.4c0,0,0,0,0,0C9-0.2,7.1-0.2,5.5,0.5c0,0,0,0,0,0C5.2,0.7,4.8,0.8,4.5,1
                            C5.8,1.5,7,2.3,8.1,3.2C9.1,2.3,10.2,1.5,11.4,1z"/>
    </g>
    <g>
        <path d="M19.9,18H15c-2.1,0-3.9,1.1-5,2.7v-3.8c3.4-0.5,6-3.4,6-6.9V3.5c0-0.7,0.3-1.2,0.8-1.6l0,0C16.9,1.8,17,1.7,17,1.5
                            C17,1.2,16.8,1,16.5,1c-1.3,0-2.6,0.2-3.8,0.6c0,0,0,0,0,0C11.3,2.1,10,2.9,8.8,3.9c2,2,3.5,4.5,4.1,7.5c0.1,0.3-0.1,0.5-0.4,0.6
                            c-0.3,0.1-0.5-0.1-0.6-0.4c-1.1-5.2-5.4-9-10.4-9.5c-0.1,0-0.2,0-0.2,0C1.2,2,1.1,2,0.9,2C0.4,2.1,0,2.5,0,3c0,0.3,0.1,0.6,0.4,0.8
                            l0,0C1.4,4.7,2,6,2,7.5V10c0,3.5,2.6,6.4,6,6.9v6.6c0,1.4-2,6.9-2,7.5c0,0.6,0.4,1,1,1c0.4,0,0.7-0.2,0.9-0.5l0.5-1.3l1.6-4.9
                            c0.9,0.5,2,0.7,3.1,0.7c3.9,0,7-3.1,7-7C20,18.7,20,18.3,19.9,18z"/>
    </g>
</svg>