{
  "scan": {
    "end_time": "2021-01-28T03:06:00",
    "messages": [],
    "scanner": {
      "id": "demo_scanner",
      "name": "Demo Scanner",
      "url": "https://www.gitlab.com",
      "version": "0.0.1",
      "vendor": {
        "name": "GitLab"
      }
    },
    "scanned_resources": [
      {
        "method": "GET",
        "type": "url",
        "url": "http://nginx"
      }
    ],
    "start_time": "2021-01-28T02:06:00",
    "status": "success",
    "type": "dast"
  },
  "version": "13.1.0",
  "vulnerabilities": [
    {
      "category": "dast",
      "confidence": "Medium",
      "cve": "10023",
      "details": {
        "diff example": {
          "type": "diff",
          "name": "An Example Diff",
          "before": "one potato,\ntwo potato,\nthree potato",
          "after": "one potato,\ntwo potato,\nhot potato"
        },
        "table": {
          "type": "table",
          "name": "Pretty Table Example",
          "header": [
            {
              "type": "text",
              "value": "Number"
            },
            {
              "type": "text",
              "value": "Address"
            }
          ],
          "rows": [
            [
              {
                "type": "text",
                "value": "1"
              },
              {
                "type": "url",
                "href": "http://1.example.com/"
              }
            ],
            [
              {
                "type": "text",
                "value": "2"
              },
              {
                "type": "url",
                "href": "http://2.example.com/"
              }
            ]
          ]
        },
        "list": {
          "name": "URLs",
          "type": "list",
          "items": [
            {
              "type": "url",
              "href": "http://site.com/page/1"
            },
            {
              "type": "url",
              "href": "http://site.com/page/2"
            },
            {
              "type": "url",
              "href": "http://site.com/page/3"
            }
          ]
        },
        "named list": {
          "name": "Comments with Named List",
          "type": "named-list",
          "items": {
            "Comment #1": {
              "name": "Fred:",
              "type": "text",
              "value": "Hi Wilma"
            },
            "Comment #2": {
              "name": "Wilma:",
              "type": "markdown",
              "value": "Hi Fred. Checkout [GitLab](http://gitlab.com)"
            },
            "A list": {
              "name": "resources",
              "type": "list",
              "items": [
                {
                  "type": "value",
                  "value": "42"
                },
                {
                  "type": "value",
                  "value": "Life, the universe and everything"
                }
              ]
            }
          }
        },
        "code": {
          "type": "code",
          "name": "Code Sample",
          "value": "<img src=x onerror=alert(1)>",
          "lang": "html"
        },
        "textfield": {
          "name": "Sample Text Field",
          "type": "text",
          "value": "Everyone can contribute"
        },
        "valuefield": {
          "name": "Sample Value Field",
          "type": "value",
          "value": "false"
        },
        "markdown example": {
          "type": "markdown",
          "name": "Markdown Example",
          "value": "**Markdown** _example_ with a [link](http://www.gitlab.com)"
        },
        "file": {
          "type": "file-location",
          "name": "File Location Example",
          "file_name": "index.js",
          "line_start": 1,
          "line_end": 2
        },
        "module": {
          "type": "module-location",
          "name": "A Module Location Example",
          "module_name": "dynamic-library.dll",
          "offset": 500
        },
        "commit": {
          "type": "commit",
          "name": "Commit Example",
          "value": "initial-commit"
        },
        "url": {
          "name": "URL Example",
          "type": "url",
          "href": "http://site.com/login"
        }
      },
      "description": "Short description of vulnerability",
      "id": "9ff985d6-0ccd-4326-a671-c9aaf9b320cc",
      "identifiers": [
        {
          "name": "X-Frame-Options Header Not Set",
          "type": "Sample Identifier",
          "url": "https://gitlab.com/sample_id",
          "value": "88"
        },
        {
          "name": "CWE-16",
          "type": "CWE",
          "url": "https://cwe.mitre.org/data/definitions/16.html",
          "value": "16"
        }
      ],
      "location": {
        "hostname": "http://nginx",
        "method": "",
        "param": "",
        "path": ""
      },
      "message": "Sample Vulnerability Title",
      "scanner": {
        "id": "demo_scanner",
        "name": "Demo Scanner"
      },
      "severity": "Medium",
      "solution": "This is where a solution would tell you how to resolve the vulnerability."
    }
  ]
}